{"text_format":"1","workbook":"xlsx","n_sheets":10,"sheets":["Input Summary","Create Rules","Corridors","Terminus","Routes - Passenger Demand","Routes - Vehicle Capacity","Routes - Corridors","Routes - Termini","Route Colours","Validation Lists"],"not_rendered":{"charts":0,"images":0,"macros":1,"external_links":0,"defined_names":16,"comments":0,"pivot_tables":0},"unopened":[],"bounds":{"document_bytes":16777216,"sheet_cells":100000,"rows_first":2000,"rows_last":500,"rows_between":2000,"halvings":0,"cell_chars":16384,"cell_head_chars":4096},"cells_cut":0,"cells_raw":0,"read":"whole","date_system":"1900"}

{"sheet":"Input Summary","index":0,"n_rows":16,"n_cols":8,"rows_kept":16,"cut":false,"hidden":false,"merged":[]}
[]
[]
[]
[null,null,null,"Please enter the following variables:"]
[null,null,1,"Corridors: Capacity (vehicles per hour)",null,null,"Start Year",2016]
[null,null,2,"Termini: Capacity (vehicles per hour)",null,null,"End Year",2046]
[null,null,3,"Routes: Demand (passengers in one hour)"]
[null,null,4,"Routes: Vehicle capacity (passengers per vehicle)"]
{"$rows_left_out":9}
{"sheet":"Create Rules","index":1,"n_rows":73,"n_cols":10,"rows_kept":73,"cut":false,"hidden":false,"merged":[]}
["Rule #","Rule Description","Years to Implement","Trigger Type","Trigger Subject","Trigger Value","Action Subject Type","Action Subject","Action Type","Updated Parameters"]
[1,"CRL construction complete",0,"Year","N/A",2023,"Route Group","West Express","Remove from corridor stops","Albert Street : North : All routes"]
[null,null,null,null,null,null,"Route Group","West Express","Remove from terminus stops","Britomart West : West/Northwest"]
[null,null,null,null,null,null,"Route Group","Green Bay","Remove from corridor stops","Albert Street : North : All routes, K Road (Pitt to Ponsonby) : East : All routes, Pitt Street : North : All routes, Great North Road : East : All routes"]
[null,null,null,null,null,null,"Route Group","Green Bay","Remove from terminus stops","Britomart West : West/Northwest"]
[null,null,null,null,null,null,"Route","195 : Inbound","Remove from corridor stops","Albert Street : North : All routes, K Road (Pitt to Ponsonby) : East : All routes, Pitt Street : North : All routes, Great North Road : East : All routes"]
[null,null,null,null,null,null,"Route","195 : Outbound","Remove from corridor stops","Albert Street : South : All routes, K Road (Pitt to Ponsonby) : West : All routes, Pitt Street : South : All routes, Great North Road : West : All routes"]
[null,null,null,null,null,null,"Route","195 : Inbound","Remove from terminus stops","Britomart West : West/Northwest"]
{"$rows_left_out":66}
{"sheet":"Corridors","index":2,"n_rows":63,"n_cols":34,"rows_kept":63,"cut":false,"hidden":false,"merged":[]}
["Corridor Name","Direction","Stop Group",{"$f":"'Input Summary'!$H$5","v":2016},{"$f":"IF(IFERROR(D$1+1<='Input Summary'!$H$6,FALSE),D$1+1,\"\")","v":2017},{"$f":"IF(IFERROR(E$1+1<='Input Summary'!$H$6,FALSE),E$1+1,\"\")","v":2018},{"$f":"IF(IFERROR(F$1+1<='Input Summary'!$H$6,FALSE),F$1+1,\"\")","v":2019},{"$f":"IF(IFERROR(G$1+1<='Input Summary'!$H$6,FALSE),G$1+1,\"\")","v":2020},{"$f":"IF(IFERROR(H$1+1<='Input Summary'!$H$6,FALSE),H$1+1,\"\")","v":2021},{"$f":"IF(IFERROR(I$1+1<='Input Summary'!$H$6,FALSE),I$1+1,\"\")","v":2022},{"$f":"IF(IFERROR(J$1+1<='Input Summary'!$H$6,FALSE),J$1+1,\"\")","v":2023},{"$f":"IF(IFERROR(K$1+1<='Input Summary'!$H$6,FALSE),K$1+1,\"\")","v":2024},{"$f":"IF(IFERROR(L$1+1<='Input Summary'!$H$6,FALSE),L$1+1,\"\")","v":2025},{"$f":"IF(IFERROR(M$1+1<='Input Summary'!$H$6,FALSE),M$1+1,\"\")","v":2026},{"$f":"IF(IFERROR(N$1+1<='Input Summary'!$H$6,FALSE),N$1+1,\"\")","v":2027},{"$f":"IF(IFERROR(O$1+1<='Input Summary'!$H$6,FALSE),O$1+1,\"\")","v":2028},{"$f":"IF(IFERROR(P$1+1<='Input Summary'!$H$6,FALSE),P$1+1,\"\")","v":2029},{"$f":"IF(IFERROR(Q$1+1<='Input Summary'!$H$6,FALSE),Q$1+1,\"\")","v":2030},{"$f":"IF(IFERROR(R$1+1<='Input Summary'!$H$6,FALSE),R$1+1,\"\")","v":2031},{"$f":"IF(IFERROR(S$1+1<='Input Summary'!$H$6,FALSE),S$1+1,\"\")","v":2032},{"$f":"IF(IFERROR(T$1+1<='Input Summary'!$H$6,FALSE),T$1+1,\"\")","v":2033},{"$f":"IF(IFERROR(U$1+1<='Input Summary'!$H$6,FALSE),U$1+1,\"\")","v":2034},{"$f":"IF(IFERROR(V$1+1<='Input Summary'!$H$6,FALSE),V$1+1,\"\")","v":2035},{"$f":"IF(IFERROR(W$1+1<='Input Summary'!$H$6,FALSE),W$1+1,\"\")","v":2036},{"$f":"IF(IFERROR(X$1+1<='Input Summary'!$H$6,FALSE),X$1+1,\"\")","v":2037},{"$f":"IF(IFERROR(Y$1+1<='Input Summary'!$H$6,FALSE),Y$1+1,\"\")","v":2038},{"$f":"IF(IFERROR(Z$1+1<='Input Summary'!$H$6,FALSE),Z$1+1,\"\")","v":2039},{"$f":"IF(IFERROR(AA$1+1<='Input Summary'!$H$6,FALSE),AA$1+1,\"\")","v":2040},{"$f":"IF(IFERROR(AB$1+1<='Input Summary'!$H$6,FALSE),AB$1+1,\"\")","v":2041},{"$f":"IF(IFERROR(AC$1+1<='Input Summary'!$H$6,FALSE),AC$1+1,\"\")","v":2042},{"$f":"IF(IFERROR(AD$1+1<='Input Summary'!$H$6,FALSE),AD$1+1,\"\")","v":2043},{"$f":"IF(IFERROR(AE$1+1<='Input Summary'!$H$6,FALSE),AE$1+1,\"\")","v":2044},{"$f":"IF(IFERROR(AF$1+1<='Input Summary'!$H$6,FALSE),AF$1+1,\"\")","v":2045},{"$f":"IF(IFERROR(AG$1+1<='Input Summary'!$H$6,FALSE),AG$1+1,\"\")","v":2046}]
["Anzac Ave","North","All routes",53,53,53,53,53,53,53,53,53,53,53,53,53,53,53,53,53,53,53,53,53,53,53,53,53,53,53,53,53,53,53]
["Anzac Ave","South","All routes",53,53,53,53,53,53,53,53,53,53,53,53,53,53,53,53,53,53,53,53,53,53,53,53,53,53,53,53,53,53,53]
["Symonds Street (Anzac to Wellesley)","North","All routes",53,53,53,53,53,53,53,53,53,53,53,53,53,53,53,53,53,53,53,53,53,53,53,53,53,53,53,53,53,53,53]
["Symonds Street (Anzac to Wellesley)","South","All routes",53,53,53,53,53,53,53,53,53,53,53,53,53,53,53,53,53,53,53,53,53,53,53,53,53,53,53,53,53,53,53]
["Symonds Street (Wellesley to K Rd)","North","Britomart-bound",53,53,53,53,53,53,53,53,53,53,53,53,53,53,53,53,53,53,53,53,53,53,53,53,53,53,53,53,53,53,53]
["Symonds Street (Wellesley to K Rd)","North","Wynyard-bound",53,53,53,53,53,53,53,53,53,53,53,53,53,53,53,53,53,53,53,53,53,53,53,53,53,53,53,53,53,53,53]
["Symonds Street (Wellesley to K Rd)","South","Grafton",53,53,53,53,53,53,53,53,53,53,53,53,53,53,53,53,53,53,53,53,53,53,53,53,53,53,53,53,53,53,53]
{"$rows_left_out":56}
{"sheet":"Terminus","index":3,"n_rows":9,"n_cols":33,"rows_kept":9,"cut":false,"hidden":false,"merged":[]}
["Terminus Name","Stop Group",{"$f":"'Input Summary'!$H$5","v":2016},{"$f":"IF(IFERROR(C$1+1<='Input Summary'!$H$6,FALSE),C$1+1,\"\")","v":2017},{"$f":"IF(IFERROR(D$1+1<='Input Summary'!$H$6,FALSE),D$1+1,\"\")","v":2018},{"$f":"IF(IFERROR(E$1+1<='Input Summary'!$H$6,FALSE),E$1+1,\"\")","v":2019},{"$f":"IF(IFERROR(F$1+1<='Input Summary'!$H$6,FALSE),F$1+1,\"\")","v":2020},{"$f":"IF(IFERROR(G$1+1<='Input Summary'!$H$6,FALSE),G$1+1,\"\")","v":2021},{"$f":"IF(IFERROR(H$1+1<='Input Summary'!$H$6,FALSE),H$1+1,\"\")","v":2022},{"$f":"IF(IFERROR(I$1+1<='Input Summary'!$H$6,FALSE),I$1+1,\"\")","v":2023},{"$f":"IF(IFERROR(J$1+1<='Input Summary'!$H$6,FALSE),J$1+1,\"\")","v":2024},{"$f":"IF(IFERROR(K$1+1<='Input Summary'!$H$6,FALSE),K$1+1,\"\")","v":2025},{"$f":"IF(IFERROR(L$1+1<='Input Summary'!$H$6,FALSE),L$1+1,\"\")","v":2026},{"$f":"IF(IFERROR(M$1+1<='Input Summary'!$H$6,FALSE),M$1+1,\"\")","v":2027},{"$f":"IF(IFERROR(N$1+1<='Input Summary'!$H$6,FALSE),N$1+1,\"\")","v":2028},{"$f":"IF(IFERROR(O$1+1<='Input Summary'!$H$6,FALSE),O$1+1,\"\")","v":2029},{"$f":"IF(IFERROR(P$1+1<='Input Summary'!$H$6,FALSE),P$1+1,\"\")","v":2030},{"$f":"IF(IFERROR(Q$1+1<='Input Summary'!$H$6,FALSE),Q$1+1,\"\")","v":2031},{"$f":"IF(IFERROR(R$1+1<='Input Summary'!$H$6,FALSE),R$1+1,\"\")","v":2032},{"$f":"IF(IFERROR(S$1+1<='Input Summary'!$H$6,FALSE),S$1+1,\"\")","v":2033},{"$f":"IF(IFERROR(T$1+1<='Input Summary'!$H$6,FALSE),T$1+1,\"\")","v":2034},{"$f":"IF(IFERROR(U$1+1<='Input Summary'!$H$6,FALSE),U$1+1,\"\")","v":2035},{"$f":"IF(IFERROR(V$1+1<='Input Summary'!$H$6,FALSE),V$1+1,\"\")","v":2036},{"$f":"IF(IFERROR(W$1+1<='Input Summary'!$H$6,FALSE),W$1+1,\"\")","v":2037},{"$f":"IF(IFERROR(X$1+1<='Input Summary'!$H$6,FALSE),X$1+1,\"\")","v":2038},{"$f":"IF(IFERROR(Y$1+1<='Input Summary'!$H$6,FALSE),Y$1+1,\"\")","v":2039},{"$f":"IF(IFERROR(Z$1+1<='Input Summary'!$H$6,FALSE),Z$1+1,\"\")","v":2040},{"$f":"IF(IFERROR(AA$1+1<='Input Summary'!$H$6,FALSE),AA$1+1,\"\")","v":2041},{"$f":"IF(IFERROR(AB$1+1<='Input Summary'!$H$6,FALSE),AB$1+1,\"\")","v":2042},{"$f":"IF(IFERROR(AC$1+1<='Input Summary'!$H$6,FALSE),AC$1+1,\"\")","v":2043},{"$f":"IF(IFERROR(AD$1+1<='Input Summary'!$H$6,FALSE),AD$1+1,\"\")","v":2044},{"$f":"IF(IFERROR(AE$1+1<='Input Summary'!$H$6,FALSE),AE$1+1,\"\")","v":2045},{"$f":"IF(IFERROR(AF$1+1<='Input Summary'!$H$6,FALSE),AF$1+1,\"\")","v":2046}]
["Wynyard Quarter","Isthmus/Link",53,53,53,53,53,53,53,53,53,53,53,53,53,53,53,53,53,53,53,53,53,53,53,53,53,53,53,53,53,53,53]
["Britomart West","West/Northwest",74,74,74,74,74,74,74,74,74,74,74,74,74,74,74,74,74,74,74,74,74,74,74,74,74,74,74,74,74,74,74]
["Britomart West","North Shore",77,77,77,77,77,77,77,77,77,77,77,77,77,77,77,77,77,77,77,77,77,77,77,77,77,77,77,77,77,77,77]
["Britomart East","Mt Eden/Hospitals",25,25,25,25,25,25,25,25,25,25,25,25,25,25,25,25,25,25,25,25,25,25,25,25,25,25,25,25,25,25,25]
["Britomart East","Tamaki Drive",25,25,25,25,25,25,25,25,25,25,25,25,25,25,25,25,25,25,25,25,25,25,25,25,25,25,25,25,25,25,25]
["Britomart East","AMETI",25,25,25,25,25,25,25,25,25,25,25,25,25,25,25,25,25,25,25,25,25,25,25,25,25,25,25,25,25,25,25]
["University","All routes",53,53,53,53,53,53,53,53,53,53,53,53,53,53,53,53,53,53,53,53,53,53,53,53,53,53,53,53,53,53,53]
{"$rows_left_out":2}
{"sheet":"Routes - Passenger Demand","index":4,"n_rows":78,"n_cols":34,"rows_kept":78,"cut":false,"hidden":false,"merged":[]}
["Route Name","Direction","Route Group",{"$f":"'Input Summary'!$H$5","v":2016},{"$f":"IF(IFERROR(D$1+1<='Input Summary'!$H$6,FALSE),D$1+1,\"\")","v":2017},{"$f":"IF(IFERROR(E$1+1<='Input Summary'!$H$6,FALSE),E$1+1,\"\")","v":2018},{"$f":"IF(IFERROR(F$1+1<='Input Summary'!$H$6,FALSE),F$1+1,\"\")","v":2019},{"$f":"IF(IFERROR(G$1+1<='Input Summary'!$H$6,FALSE),G$1+1,\"\")","v":2020},{"$f":"IF(IFERROR(H$1+1<='Input Summary'!$H$6,FALSE),H$1+1,\"\")","v":2021},{"$f":"IF(IFERROR(I$1+1<='Input Summary'!$H$6,FALSE),I$1+1,\"\")","v":2022},{"$f":"IF(IFERROR(J$1+1<='Input Summary'!$H$6,FALSE),J$1+1,\"\")","v":2023},{"$f":"IF(IFERROR(K$1+1<='Input Summary'!$H$6,FALSE),K$1+1,\"\")","v":2024},{"$f":"IF(IFERROR(L$1+1<='Input Summary'!$H$6,FALSE),L$1+1,\"\")","v":2025},{"$f":"IF(IFERROR(M$1+1<='Input Summary'!$H$6,FALSE),M$1+1,\"\")","v":2026},{"$f":"IF(IFERROR(N$1+1<='Input Summary'!$H$6,FALSE),N$1+1,\"\")","v":2027},{"$f":"IF(IFERROR(O$1+1<='Input Summary'!$H$6,FALSE),O$1+1,\"\")","v":2028},{"$f":"IF(IFERROR(P$1+1<='Input Summary'!$H$6,FALSE),P$1+1,\"\")","v":2029},{"$f":"IF(IFERROR(Q$1+1<='Input Summary'!$H$6,FALSE),Q$1+1,\"\")","v":2030},{"$f":"IF(IFERROR(R$1+1<='Input Summary'!$H$6,FALSE),R$1+1,\"\")","v":2031},{"$f":"IF(IFERROR(S$1+1<='Input Summary'!$H$6,FALSE),S$1+1,\"\")","v":2032},{"$f":"IF(IFERROR(T$1+1<='Input Summary'!$H$6,FALSE),T$1+1,\"\")","v":2033},{"$f":"IF(IFERROR(U$1+1<='Input Summary'!$H$6,FALSE),U$1+1,\"\")","v":2034},{"$f":"IF(IFERROR(V$1+1<='Input Summary'!$H$6,FALSE),V$1+1,\"\")","v":2035},{"$f":"IF(IFERROR(W$1+1<='Input Summary'!$H$6,FALSE),W$1+1,\"\")","v":2036},{"$f":"IF(IFERROR(X$1+1<='Input Summary'!$H$6,FALSE),X$1+1,\"\")","v":2037},{"$f":"IF(IFERROR(Y$1+1<='Input Summary'!$H$6,FALSE),Y$1+1,\"\")","v":2038},{"$f":"IF(IFERROR(Z$1+1<='Input Summary'!$H$6,FALSE),Z$1+1,\"\")","v":2039},{"$f":"IF(IFERROR(AA$1+1<='Input Summary'!$H$6,FALSE),AA$1+1,\"\")","v":2040},{"$f":"IF(IFERROR(AB$1+1<='Input Summary'!$H$6,FALSE),AB$1+1,\"\")","v":2041},{"$f":"IF(IFERROR(AC$1+1<='Input Summary'!$H$6,FALSE),AC$1+1,\"\")","v":2042},{"$f":"IF(IFERROR(AD$1+1<='Input Summary'!$H$6,FALSE),AD$1+1,\"\")","v":2043},{"$f":"IF(IFERROR(AE$1+1<='Input Summary'!$H$6,FALSE),AE$1+1,\"\")","v":2044},{"$f":"IF(IFERROR(AF$1+1<='Input Summary'!$H$6,FALSE),AF$1+1,\"\")","v":2045},{"$f":"IF(IFERROR(AG$1+1<='Input Summary'!$H$6,FALSE),AG$1+1,\"\")","v":2046}]
["Airbus","Inbound","Airbus",420,420,420,420,420,420,420,420,420,420,420,420,420,420,420,420,420,420,420,420,420,420,420,420,420,420,420,420,420,420,420]
["Airbus","Outbound","Airbus",420,420,420,420,420,420,420,420,420,420,420,420,420,420,420,420,420,420,420,420,420,420,420,420,420,420,420,420,420,420,420]
["City Link","Inbound","City Link",605,646.5,688,729.5,729.5,729.5,771,812.5,854,895.5,937,978.5,1020,1040.4000000000001,1060.8,1081.2,1101.5999999999999,1122,1142.4000000000001,1162.8,1183.2,1203.5999999999999,1224,1244.4000000000001,1264.8,1285.2,1305.5999999999999,1326,1346.4,1366.8,1387.2]
["Inner Link","Inbound","Inner Link",605,646.5,688,729.5,729.5,729.5,771,812.5,854,895.5,937,978.5,1020,1040.4000000000001,1060.8,1081.2,1101.5999999999999,1122,1142.4000000000001,1162.8,1183.2,1203.5999999999999,1224,1244.4000000000001,1264.8,1285.2,1305.5999999999999,1326,1346.4,1366.8,1387.2]
["Inner Link","Outbound","Inner Link",605,646.5,688,729.5,729.5,729.5,771,812.5,854,895.5,937,978.5,1020,1040.4000000000001,1060.8,1081.2,1101.5999999999999,1122,1142.4000000000001,1162.8,1183.2,1203.5999999999999,1224,1244.4000000000001,1264.8,1285.2,1305.5999999999999,1326,1346.4,1366.8,1387.2]
["Crosstown 4 peak","Inbound","Manukau Road",385,402.5,420,437.5,437.5,437.5,455,472.5,490,507.5,525,542.5,560,574,588,602,616,630,644,658,672,686,700,714,728,742,756,770,784,798,812]
["Crosstown 4","Inbound","Manukau Road / Jervois Road",605,632.5,660,687.5,687.5,687.5,715,742.5,770,797.5,825,852.5,880,902,924,946,968,990,1012,1034,1056,1078,1100,1122,1144,1166,1188,1210,1232,1254,1276]
{"$rows_left_out":71}
{"sheet":"Routes - Vehicle Capacity","index":5,"n_rows":78,"n_cols":34,"rows_kept":78,"cut":false,"hidden":false,"merged":[]}
["Route Name","Direction","Route Group",{"$f":"'Input Summary'!$H$5","v":2016},{"$f":"IF(IFERROR(D$1+1<='Input Summary'!$H$6,FALSE),D$1+1,\"\")","v":2017},{"$f":"IF(IFERROR(E$1+1<='Input Summary'!$H$6,FALSE),E$1+1,\"\")","v":2018},{"$f":"IF(IFERROR(F$1+1<='Input Summary'!$H$6,FALSE),F$1+1,\"\")","v":2019},{"$f":"IF(IFERROR(G$1+1<='Input Summary'!$H$6,FALSE),G$1+1,\"\")","v":2020},{"$f":"IF(IFERROR(H$1+1<='Input Summary'!$H$6,FALSE),H$1+1,\"\")","v":2021},{"$f":"IF(IFERROR(I$1+1<='Input Summary'!$H$6,FALSE),I$1+1,\"\")","v":2022},{"$f":"IF(IFERROR(J$1+1<='Input Summary'!$H$6,FALSE),J$1+1,\"\")","v":2023},{"$f":"IF(IFERROR(K$1+1<='Input Summary'!$H$6,FALSE),K$1+1,\"\")","v":2024},{"$f":"IF(IFERROR(L$1+1<='Input Summary'!$H$6,FALSE),L$1+1,\"\")","v":2025},{"$f":"IF(IFERROR(M$1+1<='Input Summary'!$H$6,FALSE),M$1+1,\"\")","v":2026},{"$f":"IF(IFERROR(N$1+1<='Input Summary'!$H$6,FALSE),N$1+1,\"\")","v":2027},{"$f":"IF(IFERROR(O$1+1<='Input Summary'!$H$6,FALSE),O$1+1,\"\")","v":2028},{"$f":"IF(IFERROR(P$1+1<='Input Summary'!$H$6,FALSE),P$1+1,\"\")","v":2029},{"$f":"IF(IFERROR(Q$1+1<='Input Summary'!$H$6,FALSE),Q$1+1,\"\")","v":2030},{"$f":"IF(IFERROR(R$1+1<='Input Summary'!$H$6,FALSE),R$1+1,\"\")","v":2031},{"$f":"IF(IFERROR(S$1+1<='Input Summary'!$H$6,FALSE),S$1+1,\"\")","v":2032},{"$f":"IF(IFERROR(T$1+1<='Input Summary'!$H$6,FALSE),T$1+1,\"\")","v":2033},{"$f":"IF(IFERROR(U$1+1<='Input Summary'!$H$6,FALSE),U$1+1,\"\")","v":2034},{"$f":"IF(IFERROR(V$1+1<='Input Summary'!$H$6,FALSE),V$1+1,\"\")","v":2035},{"$f":"IF(IFERROR(W$1+1<='Input Summary'!$H$6,FALSE),W$1+1,\"\")","v":2036},{"$f":"IF(IFERROR(X$1+1<='Input Summary'!$H$6,FALSE),X$1+1,\"\")","v":2037},{"$f":"IF(IFERROR(Y$1+1<='Input Summary'!$H$6,FALSE),Y$1+1,\"\")","v":2038},{"$f":"IF(IFERROR(Z$1+1<='Input Summary'!$H$6,FALSE),Z$1+1,\"\")","v":2039},{"$f":"IF(IFERROR(AA$1+1<='Input Summary'!$H$6,FALSE),AA$1+1,\"\")","v":2040},{"$f":"IF(IFERROR(AB$1+1<='Input Summary'!$H$6,FALSE),AB$1+1,\"\")","v":2041},{"$f":"IF(IFERROR(AC$1+1<='Input Summary'!$H$6,FALSE),AC$1+1,\"\")","v":2042},{"$f":"IF(IFERROR(AD$1+1<='Input Summary'!$H$6,FALSE),AD$1+1,\"\")","v":2043},{"$f":"IF(IFERROR(AE$1+1<='Input Summary'!$H$6,FALSE),AE$1+1,\"\")","v":2044},{"$f":"IF(IFERROR(AF$1+1<='Input Summary'!$H$6,FALSE),AF$1+1,\"\")","v":2045},{"$f":"IF(IFERROR(AG$1+1<='Input Summary'!$H$6,FALSE),AG$1+1,\"\")","v":2046}]
["Airbus","Inbound","Airbus",70,70,70,70,70,70,70,70,70,70,70,70,70,70,70,70,70,70,70,70,70,70,70,70,70,70,70,70,70,70,70]
["Airbus","Outbound","Airbus",70,70,70,70,70,70,70,70,70,70,70,70,70,70,70,70,70,70,70,70,70,70,70,70,70,70,70,70,70,70,70]
["City Link","Inbound","City Link",82,84,86,88,88,88,90,92,94,96,98,100,102,102,102,102,102,102,102,102,102,102,102,102,102,102,102,102,102,102,102]
["Inner Link","Inbound","Inner Link",82,84,86,88,88,88,90,92,94,96,98,100,102,102,102,102,102,102,102,102,102,102,102,102,102,102,102,102,102,102,102]
["Inner Link","Outbound","Inner Link",82,84,86,88,88,88,90,92,94,96,98,100,102,102,102,102,102,102,102,102,102,102,102,102,102,102,102,102,102,102,102]
["Crosstown 4 peak","Inbound","Manukau Road",70,70,70,70,70,70,70,70,70,70,70,70,70,70,70,70,70,70,70,70,70,70,70,70,70,70,70,70,70,70,70]
["Crosstown 4","Inbound","Manukau Road / Jervois Road",110,110,110,110,110,110,110,110,110,110,110,110,110,110,110,110,110,110,110,110,110,110,110,110,110,110,110,110,110,110,110]
{"$rows_left_out":71}
{"sheet":"Routes - Corridors","index":6,"n_rows":80,"n_cols":65,"rows_kept":80,"cut":false,"hidden":false,"merged":[]}
[null,null,"Corridor Name","Anzac Ave","Anzac Ave","Symonds Street (Anzac to Wellesley)","Symonds Street (Anzac to Wellesley)","Symonds Street (Wellesley to K Rd)","Symonds Street (Wellesley to K Rd)","Symonds Street (Wellesley to K Rd)","Symonds Street (Wellesley to K Rd)","Symonds Street Upper","Symonds Street Upper","Wellesley Street","Wellesley Street","Wellesley Street","Wellesley Street","Wellesley Street","Wellesley Street","Fanshawe Street (Halsey to Albert)","Fanshawe Street (Halsey to Albert)","Fanshawe Street (Halsey to Albert)","Fanshawe Street (Halsey to Albert)","Fanshawe Street (Victoria Park)","Fanshawe Street (Victoria Park)","Fanshawe Street (Victoria Park)","Fanshawe Street (Victoria Park)","Fanshawe Street (Victoria Park)","Fanshawe Street (Victoria Park)","Queen Street (Customs to Mayoral)","Queen Street (Customs to Mayoral)","Queen Street (Mayoral to K Rd)","Queen Street (Mayoral to K Rd)","Albert Street","Albert Street","Beach Road","Beach Road","Victoria Street","Victoria Street","College Hill","College Hill","Beaumont Street","Beaumont Street","K Road (Pitt to Ponsonby)","K Road (Pitt to Ponsonby)","K Road (Queen to Symonds)","K Road (Queen to Symonds)","K Road (Pitt to Queen)","K Road (Pitt to Queen)","Pitt Street","Pitt Street","Great North Road","Great North Road","Grafton Bridge","Grafton Bridge","Grafton Bridge","Grafton Bridge","Park Road","Park Road","Park Road","Park Road","Khyber Pass","Khyber Pass","Grafton Road","Grafton Road"]
[null,null,"Direction","North","South","North","South","North","North","South","South","North","South","East","East","East","West","West","West","East","East","West","West","East","East","East","West","West","West","North","South","North","South","North","South","East","West","East","West","East","West","North","South","East","West","East","West","East","West","North","South","East","West","East","East","West","West","East","East","West","West","East","West","North","South"]
["Route Name","Direction","Group","All routes","All routes","All routes","All routes","Britomart-bound","Wynyard-bound","Grafton","Upper Symonds","All routes","All routes","North Shore","Isthmus","Crosstown","North Shore","Isthmus","Crosstown","North Shore to Britomart","Link","North Shore","Link","NS to Britomart","NS to University","Isthmus/Link","NEX","Isthmus/Link","North Shore","All routes","All routes","All routes","All routes","All routes","All routes","All routes","All routes","All routes","All routes","All routes","All routes","All routes","All routes","All routes","All routes","All routes","All routes","All routes","All routes","All routes","All routes","All routes","All routes","Other","To 277","Britomart-bound","Wynyard/Ponsonby","Other","To 277","Britomart-bound","Wynyard/Ponsonby","All routes","All routes","All routes","All routes"]
["Airbus","Inbound","Airbus","No","No","No","No","No","No","No","No","No","No","No","No","No","No","No","No","No","No","No","No","No","No","No","No","No","No","Yes","No","Yes","No","No","No","No","No","No","No","No","No","No","No","No","No","No","No","No","No","No","No","No","No","No","No","No","No","No","No","No","No","No","No","No","No"]
["Airbus","Outbound","Airbus","No","No","No","No","No","No","No","No","No","No","No","No","No","No","No","No","No","No","No","No","No","No","No","No","No","No","No","Yes","No","Yes","No","No","No","No","No","No","No","No","No","No","No","No","No","No","No","No","No","No","No","No","No","No","No","No","No","No","No","No","No","No","No","No"]
["City Link","Inbound","City Link","No","No","No","No","No","No","No","No","No","No","No","No","No","No","No","No","No","Yes","No","Yes","No","No","Yes","No","Yes","No","Yes","Yes","Yes","Yes","No","No","No","No","No","No","No","No","No","No","No","No","No","No","Yes","No","No","Yes","No","No","No","No","No","No","No","No","No","No","No","No","No","No"]
["Inner Link","Inbound","Inner Link","No","No","No","No","No","No","No","No","No","No","No","No","No","No","No","No","No","Yes","No","No","No","No","Yes","No","No","No","No","No","No","No","No","No","Yes","No","No","No","Yes","No","Yes","No","No","Yes","No","Yes","No","Yes","No","No","No","No","No","No","Yes","No","No","No","Yes","No","No","No","No","No"]
["Inner Link","Outbound","Inner Link","No","No","No","No","No","No","No","No","No","No","No","No","No","No","No","No","No","No","No","Yes","No","No","No","No","Yes","No","No","No","No","No","No","No","No","Yes","No","No","No","Yes","No","Yes","Yes","No","Yes","No","Yes","No","No","No","No","No","No","Yes","No","No","No","Yes","No","No","No","No","No","No"]
{"$rows_left_out":73}
{"sheet":"Routes - Termini","index":7,"n_rows":79,"n_cols":11,"rows_kept":79,"cut":false,"hidden":false,"merged":[]}
[null,"Return to Summary Sheet","Terminus Name","Wynyard Quarter","Britomart West","Britomart West","Britomart East","Britomart East","Britomart East","University","Victoria Park"]
["Route Name","Direction","Group","Isthmus/Link","West/Northwest","North Shore","Mt Eden/Hospitals","Tamaki Drive","AMETI","All routes","All routes"]
["Airbus","Inbound","Airbus","No","No","No","No","No","No","No","No"]
["Airbus","Outbound","Airbus","No","No","No","No","No","No","No","No"]
["City Link","Inbound","City Link","Yes","No","No","No","No","No","No","No"]
["Inner Link","Inbound","Inner Link","No","No","No","No","No","No","No","No"]
["Inner Link","Outbound","Inner Link","No","No","No","No","No","No","No","No"]
["Crosstown 4 peak","Inbound","Manukau Road","No","No","No","No","No","No","No","Yes"]
{"$rows_left_out":72}
{"sheet":"Route Colours","index":8,"n_rows":59,"n_cols":3,"rows_kept":59,"cut":false,"hidden":false,"merged":[]}
["Route Name","Group","Larger Group"]
["Airbus","Airbus","City"]
["City Link","City Link","City"]
["Inner Link","Inner Link","City"]
["Crosstown 5","Mount Eden Crosstown","Central Isthmus"]
["Crosstown 4","Manukau Road / Jervois Road","Central Isthmus"]
["Crosstown 4 peak","Manukau Road","Central Isthmus"]
["309 & 309X","Manukau Road","Central Isthmus"]
{"$rows_left_out":52}
{"sheet":"Validation Lists","index":9,"n_rows":78,"n_cols":7,"rows_kept":78,"cut":false,"hidden":false,"merged":[]}
["Trigger Type","Action Subject Type","Action Type","Corridor Stop List","Terminus Stop List","Route List","Route Group List"]
["Corridor stop capacity","Route","Remove from corridor stops","Anzac Ave : North : All routes","Wynyard Quarter : Isthmus/Link","Airbus : Inbound","Airbus"]
["Corridor stop volume (above)","Route Group","Add to corridor stops","Anzac Ave : South : All routes","Britomart West : West/Northwest","Airbus : Outbound","City Link"]
["Corridor stop volume (below)","Stop (Corridor)","Remove from terminus stops","Symonds Street (Anzac to Wellesley) : North : All routes","Britomart West : North Shore","City Link : Inbound","Inner Link"]
["Terminus stop capacity","Stop (Terminus)","Add to terminus stops","Symonds Street (Anzac to Wellesley) : South : All routes","Britomart East : Mt Eden/Hospitals","Inner Link : Inbound","Manukau Road"]
["Terminus stop volume (above)",null,"Change vehicle capacity","Symonds Street (Wellesley to K Rd) : North : Britomart-bound","Britomart East : Tamaki Drive","Inner Link : Outbound","Manukau Road / Jervois Road"]
["Terminus stop volume (below)",null,null,"Symonds Street (Wellesley to K Rd) : North : Wynyard-bound","Britomart East : AMETI","Crosstown 4 peak : Inbound","Jervois Road"]
["Year",null,null,"Symonds Street (Wellesley to K Rd) : South : Grafton","University : All routes","Crosstown 4 : Inbound","Richmond Road"]
{"$rows_left_out":70}