{"text_format":"1","workbook":"xlsx","n_sheets":35,"sheets":["Instructions",">>Input tabs","Control","UHCC Adjustments","Capital values","ESSbase","Class Rates",">>District wide rates","Gen","River management","Stadium","WRS","Public transport",">>Other rates & levies","Pest","Water levy",">>Output tabs","Comparison - TA","Comparison - Category","Rates Check - ex-KCDC &  UHC","Rates Check - UHC","Rates Check - KCDC","Checks",">>Rates","1","2","3","4","5","5b","6","Impact","Changes","Mechanisms","For IT"],"not_rendered":{"charts":0,"images":1,"macros":1,"external_links":6,"defined_names":95,"comments":5,"pivot_tables":0},"unopened":[],"bounds":{"document_bytes":16777216,"sheet_cells":100000,"rows_first":2000,"rows_last":500,"rows_between":2000,"halvings":0,"cell_chars":16384,"cell_head_chars":4096},"cells_cut":0,"cells_raw":0,"read":"whole","date_system":"1900"}

{"sheet":"Instructions","index":0,"n_rows":29,"n_cols":4,"rows_kept":29,"cut":false,"hidden":false,"merged":[[23,2,23,13],[24,2,24,13],[3,0,3,13],[12,2,12,14],[18,2,18,13],[20,2,20,13],[22,2,22,13]]}
["Instructions"]
[]
["Purpose"]
["This rating model is prepared to determine the rates sought by each rating category/TA to cover funding requirements for the forthcoming year."]
[]
["Conventions"]
["All yellow cells are input cells. "]
["The majority of tabs in this spreadhseet have been protected to ensure that values aren't inadvertantly changed."]
["Should a user need to amend the content of a tab the password required is \"gwrcrates\". "]
[]
["Process"]
["To run the rates model the following actions should be completed"]
[null,"1)","On each of the tabs shaded green in the structure diagram below delete all values in the shaded yellow cell"]
[null,"2)","In the control tab;"]
[null,null,"a)","In cell B5 enter the current rating year in the YYYY/YY date format"]
[null,null,"b)","Adjust the WRS rating basis if required by the rates funding policy"]
[null,null,"c)","Obtain \"Flood protection\" and \"Pest rate\" information from the Landcare & Wairarapa Accountant and enter in the relevant cells"]
[null,null,"d)","Obtian Water levy split from the water supply accountant and enter in the relevant cells"]
[null,"3)","Obtain Capital Values (CVs) & corresponding assessments from each Territorial Authority (TA) and Equalised Capital Values (ECVs) & corresponding assessments from Quotable Value and enter into the relevant yellow cells on the \"UHCC Adjustments\" and \"Capital values\" tab"]
[null,"4)","Select the cells to be updated in the ESSBase tab and retrieve the information from the ESSbase system"]
[null,"5)","Email the ESSBase extract to the respective management accountants and obtain confirmation that these rates values are correct before proceeding further."]
[null,"6)","Populate the \"Class rates\" tab with data provided by the  Landcare & Wairarapa Accountant"]
[null,"7)","Use the rating model from the previous year to populate the yellow cells using the PASTE SPECIAL>>VALUES comand in the \"Comparison - TA\" and \"Comparison - Category\" tabs."]
[null,"8)","On the \"Check\" tab  if cell B7 says \"Error\" then a rounding/check total error occurs within the model and the error should be investigated and reconciled where possible. Explanations of the difference can be entered in the \"Check\" tab for future reference. If cell B7 reads \"OK\" then no rounding/check total errors have been found in the data that has been entered. "]
[null,"9)","Once all checks have been completed the individual that has completed steps 1 through 9 above should forward the model to their manager for reivew and approval."]
[null,"10)","Once approval of the results is obtained the values can be used for distribution as required."]
[]
["Strucutre diagram"]
["The flow diagram below sets out the structure of this excel spreadsheet."]

{"sheet":">>Input tabs","index":1,"n_rows":0,"n_cols":0,"rows_kept":0,"cut":false,"hidden":false,"merged":[]}

{"sheet":"Control","index":2,"n_rows":190,"n_cols":20,"rows_kept":190,"cut":false,"hidden":false,"merged":[]}
["Control"]
[{"$f":"check_total","v":0}]
[]
["Years"]
["Current rating year","2018/19"]
["Previous rating year",{"$f":"VALUE(LEFT(year_current,4))-1&\"/\"&VALUE(RIGHT(year_current,2))-1","v":"2017/18"}]
[]
[]
["GST"]
["GST %",0.15]
[]
["Error tolerance"]
["$ error tolerance",2]
[]
["TA's"]
["TA full name","TA short name"]
["Wellington city","Wellington"]
["Hutt city","Hutt"]
["Upper Hutt city","Upper Hutt"]
["Porirua city","Porirua"]
["Kāpiti Coast district","Kapiti"]
["Masterton district","Masterton"]
["Carterton district","Carterton"]
["South Wairarapa district","South Wairarapa"]
["Tararua district","Tararua"]
[]
[]
["TA's for rates check tab"]
["Excludes KCDC and UHC as they have their own rates check tab"]
["TA full name"]
["Wellington city"]
["Hutt city"]
["Porirua city"]
["Masterton district"]
["Carterton district"]
["South Wairarapa district"]
["Tararua district"]
[]
[]
["TA's"]
["TA full name","Category group","Concatenated  row"]
["Wellington city","District wide",{"$f":"A42&B42","v":"Wellington cityDistrict wide"}]
["Hutt city","District wide","Hutt cityDistrict wide"]
["Upper Hutt city","District wide","Upper Hutt cityDistrict wide"]
["Porirua city","District wide","Porirua cityDistrict wide"]
["Kāpiti Coast district","District wide","Kāpiti Coast districtDistrict wide"]
["Masterton district","District wide","Masterton districtDistrict wide"]
["Carterton district","District wide","Carterton districtDistrict wide"]
["South Wairarapa district","District wide","South Wairarapa districtDistrict wide"]
["Tararua district","District wide","Tararua districtDistrict wide"]
["Region wide",null,"Region wide"]
[]
[]
["PT target differentials"]
["Category group","Differential"]
["Regional CBD",7]
["Business - excl Wairarapa",1.4]
["Business - Wairarapa",1]
["Residential - excl Wairarapa & Otaki",1]
["Residential - Wairarapa & Otaki",0.5]
["Rural",0.25]
["Tararua",0]
[]
[]
["TA & Category",null,null,null,null,null,null,"PT differentials to use for rating model transition",null,null,null,null,null,null,null,"Calculation of differentials using the 2017/18 Transport rate"]
["TA full name","Rating area","Category group","Concatenated  name","PT differential category","PT differential",null,"2017/18","2018/19","2019/20","2020/21","2021/22","2022/23","2023/24 onwards",null,"Rate levied","ECV","Cents/ECV$"]
["Wellington city","Wellington city","Regional CBD",{"$f":"B67&C67","v":"Wellington cityRegional CBD"},"Regional CBD",{"$f":"IF(VALUE(LEFT(year_current,4))>2022,N67,INDEX($H67:$M67,,MATCH(year_current,$H$66:$M$66,0)))","v":6.7860042755521404},null,{"$f":"R67/R$96","v":6.7432051306625684},{"$f":"($N67-$H67)/6+H67","v":6.7860042755521404},6.8288034204417123,6.8716025653312842,6.9144017102208561,6.9572008551104281,{"$f":"INDEX($B$56:$B$62,MATCH(E67,$A$56:$A$62,0),)","v":7},null,25019166.076555029,9699270190.5155792,{"$f":"(P67*100)/Q67","v":0.25794895476795759}]
["Wellington city","Wellington city","Business",{"$f":"B68&C68","v":"Wellington cityBusiness"},"Business - excl Wairarapa",0.78418518486916788,null,0.66102222184300141,0.78418518486916788,0.90734814789533424,1.0305111109215006,1.153674073947667,1.2768370369738333,{"$f":"INDEX($B$56:$B$62,MATCH(E68,$A$56:$A$62,0),)","v":1.4},null,1192769.6660720154,4717078732.5825872,2.5286193716316824E-2]
["Wellington city","Wellington city","Residential","Wellington cityResidential","Residential - excl Wairarapa & Otaki",0.71751851820250112,null,0.6610222218430013,0.71751851820250112,0.77401481456200094,0.83051111092150076,0.88700740728100058,0.9435037036405004,1,null,12199001.999804026,48243725950.466728,2.528619371631682E-2]
["Wellington city","Wellington city","Rural","Wellington cityRural","Rural",0.18314851735902948,null,0.16977822083083538,0.18314851735902948,0.19651881388722359,0.20988911041541769,0.22325940694361179,0.2366297034718059,0.25,null,46420.266798237128,714756729.43509579,6.4945547046370783E-3]
["Hutt city","Hutt city","Business","Hutt cityBusiness","Business - excl Wairarapa",1.4169443617879141,null,1.4203332341454968,1.4169443617879141,1.4135554894303313,1.4101666170727485,1.4067777447151657,1.4033888723575829,1.4,null,2092334.5901653506,3850999697.4912381,5.4332244988967854E-2]
["Hutt city","Hutt city","Residential","Hutt cityResidential","Residential - excl Wairarapa & Otaki",1.3502776951212474,null,1.4203332341454968,1.3502776951212474,1.280222156096998,1.2101666170727485,1.1401110780484991,1.0700555390242497,1,null,9399014.0502914134,17299145382.635818,5.4332244988967854E-2]
["Hutt city","Hutt city","Rural","Hutt cityRural","Rural",0.34330276280399857,null,0.36196331536479831,0.34330276280399857,0.32464221024319884,0.3059816576823991,0.28732110512159936,0.26866055256079963,0.25,null,44664.5601546291,322575294.87294579,1.3846243300256869E-2]
["Upper Hutt city","Upper Hutt city","Business","Upper Hutt cityBusiness","Business - excl Wairarapa",1.5639888652990679,null,1.5967866383588816,1.5639888652990679,1.5311910922392542,1.4983933191794405,1.4655955461196268,1.4327977730598132,1.4,null,725473.26351998048,1187700995.936275,6.108214660105455E-2]
["Upper Hutt city","Upper Hutt city","Residential","Upper Hutt cityResidential","Residential - excl Wairarapa & Otaki",1.4973221986324032,null,1.5967866383588838,1.4973221986324032,1.3978577589059227,1.2983933191794421,1.1989288794529616,1.099464439726481,1,null,3744588.8646753002,6130414651.4894199,6.1082146601054634E-2]
["Upper Hutt city","Upper Hutt city","Rural","Upper Hutt cityRural","Rural",0.38080058746082263,null,0.40696070495298714,0.38080058746082263,0.35464046996865811,0.3284803524764936,0.30232023498432908,0.27616011749216457,0.25,null,126321.43492736586,811441419.57430518,1.5567535977352012E-2]
["Porirua city","Porirua city","Business","Porirua cityBusiness","Business - excl Wairarapa",1.6065069305439641,null,1.6478083166527571,{"$f":"($N77-$H77)/6+H77","v":1.6065069305439641},1.5652055444351713,1.5239041583263786,1.4826027722175859,1.4413013861087931,1.4,null,691972.22128697077,1097778115.5520244,6.303388740255661E-2]
["Porirua city","Porirua city","Residential","Porirua cityResidential","Residential - excl Wairarapa & Otaki",1.5398402638772972,null,1.6478083166527566,1.5398402638772972,1.4318722111018378,1.3239041583263784,1.215936105550919,1.1079680527754596,1,null,5277337.6833140422,8372223102.1721783,6.3033887402556596E-2]
["Porirua city","Porirua city","Rural","Porirua cityRural","Rural",0.39154307533795868,null,0.41985169040555043,0.39154307533795868,0.36323446027036693,0.33492584520277519,0.30661723013518344,0.27830861506759169,0.25,null,96761.343740997501,602474380.27579737,1.6060657001996107E-2]
["Kāpiti Coast district","Kāpiti Coast district","Business","Kāpiti Coast districtBusiness","Business - excl Wairarapa",0.81998047547188435,null,0.70397657056626128,0.81998047547188435,0.93598438037750742,1.0519882852831306,1.1679921901887538,1.283996095094377,1.4,null,403085.53288284957,1496826987.0055292,2.6929333609172868E-2]
["Kāpiti Coast district","Kāpiti Coast district excl Ōtaki ","Residential","Kāpiti Coast district excl Ōtaki Residential","Residential - excl Wairarapa & Otaki",0.7533138088052177,null,0.70397657056626128,0.7533138088052177,0.80265104704417412,0.85198828528313053,0.90132552352208695,0.95066276176104336,1,null,2549190.972629251,9466223745.5475941,2.6929333609172868E-2,null,"Green cells not consistent with formulas above and below due to Otaki carveout"]
["Kāpiti Coast district","Ōtaki rating area","Residential","Ōtaki rating areaResidential","Residential - Wairarapa & Otaki",0.66998047547188444,null,{"$f":"H81","v":0.70397657056626128},0.66998047547188444,0.6359843803775076,0.60198828528313075,0.56799219018875391,0.53399609509437707,0.5]
["Kāpiti Coast district","Kāpiti Coast district","Rural","Kāpiti Coast districtRural","Rural",0.19343672929503264,null,{"$f":"R83/R$96","v":0.18212407515403917},0.19343672929503264,0.20474938343602611,0.21606203757701958,0.22737469171801306,0.23868734585900653,{"$f":"INDEX($B$56:$B$62,MATCH(E83,$A$56:$A$62,0),)","v":0.25},null,138343.58213775302,1985748559.4468777,6.9668227369273821E-3]
["Masterton district","Masterton district","Business","Masterton districtBusiness","Business - Wairarapa",0.37415618558897079,null,0.24898742270676497,0.37415618558897079,0.49932494847117659,0.62449371135338239,0.74966247423558818,0.87483123711779398,1,null,38506.176024532608,404283094.12757981,9.5245575647002426E-3]
["Masterton district","Masterton district","Residential","Masterton districtResidential","Residential - Wairarapa & Otaki",0.29082285225563748,null,0.24898742270676497,0.29082285225563748,0.33265828180450996,0.37449371135338244,0.41632914090225492,0.45816457045112741,0.5,null,199517.22834409823,2094766365.6687391,9.5245575647002426E-3]
["Masterton district","Masterton district","Rural","Masterton districtRural","Rural",0.10127416620481691,null,7.1528999445780297E-2,0.10127416620481691,0.13101933296385354,0.16076449972289017,0.1905096664819268,0.22025483324096343,0.25,null,68725.161709690234,2511691056.2036815,2.7362107907317832E-3]
["Carterton district","Carterton district","Business","Carterton districtBusiness","Business - Wairarapa",0.5389184370068979,null,0.4467021244082775,{"$f":"($N87-$H87)/6+H87","v":0.5389184370068979},0.6311347496055183,0.7233510622041387,0.81556737480275909,0.90778368740137949,1,null,16823.535176000685,98453654.5420295,1.7087771149032139E-2]
["Carterton district","Carterton district","Residential","Carterton districtResidential","Residential - Wairarapa & Otaki",0.45558510367356447,null,0.44670212440827739,0.45558510367356447,0.46446808293885156,0.47335106220413864,0.48223404146942572,0.49111702073471281,0.5,null,109887.40711283383,643076303.83414829,1.7087771149032135E-2]
["Carterton district","Carterton district","Rural","Carterton districtRural","Rural",0.14143066301924595,null,0.11971679562309516,0.14143066301924595,0.16314453041539675,0.18485839781154756,0.20657226520769836,0.22828613260384917,0.25,null,72077.971351554661,1573910634.6238222,4.5795466251984437E-3]
["South Wairarapa district","South Wairarapa district","Business","South Wairarapa districtBusiness","Business - Wairarapa",0.65854143910329699,null,0.59024972692395639,0.65854143910329699,0.72683315128263759,0.79512486346197819,0.8634165756413188,0.9317082878206594,1,null,44332.499030580657,196344625.20795071,2.2578921619895442E-2]
["South Wairarapa district","South Wairarapa district","Residential","South Wairarapa districtResidential","Residential - Wairarapa & Otaki",0.57520810576996362,null,0.59024972692395627,0.57520810576996362,0.56016648461597085,0.54512486346197808,0.53008324230798531,0.51504162115399255,0.5,null,206694.86872182382,915432863.4530288,2.2578921619895439E-2]
["South Wairarapa district","South Wairarapa district","Rural","South Wairarapa districtRural","Rural",0.16953563031481486,null,0.15344275637777782,0.16953563031481486,0.1856285042518519,0.20172137818888894,0.21781425212592598,0.23390712606296302,0.25,null,153385.1807396345,2613181710.3390203,5.8696714481342033E-3]
["Tararua district","Tararua district","Rural","Tararua districtRural","Tararua",0,null,0,0,0,0,0,0,0,null,0,7041799.9999999991,0]
["Region wide",null,null,{"$f":"A94&C94","v":"Region wide"},null,null,null,null,null,null,null,null,null,null,null,{"$f":"SUM(P67:P93)","v":64656396.137165949},{"$f":"SUM(Q67:Q93)","v":127056566042.99998}]
[]
[null,null,null,null,null,null,null,null,null,null,null,null,null,null,null,{"$f":"SUMIF($C$67:$C$79,\"Residential\",P$67:P$79)","v":30619942.598084778},{"$f":"SUMIF($C$67:$C$79,\"Residential\",Q$67:Q$79)","v":80045509086.764145},{"$f":"(P96*100)/Q96","v":3.8253167413670575E-2}]
[]
[]
["WRS rates"]
["Category group","Rating basis"]
["Regional CBD","Remainder"]
["Business","Remainder"]
["Residential",14]
["Rural",28]
[]
[]
["Flood protection"]
["From Essbase / Landcare & Wairarapa Accountant"]
["TA full name","[not used]","River management","[not used]","Total"]
["Wellington city",null,42679,null,{"$f":"SUM(B110:D110)","v":42679}]
["Hutt city",null,4356562,null,{"$f":"SUM(B111:D111)","v":4356562}]
["Upper Hutt city",null,667062,null,667062]
["Porirua city",null,33588,null,33588]
["Kāpiti Coast district",null,1335375,null,1335375]
["Masterton district",null,null,null,0]
["Carterton district",null,23705,null,23705]
["South Wairarapa district",null,null,null,0]
["Tararua district",null,null,null,0]
["Non district Wide",null,null,null,0]
["Special Rates",null,null,null,0]
["External Revenue",null,null,null,0]
["Total",null,{"$f":"SUM(C110:C121)","v":6458971},null,{"$f":"SUM(B122:D122)","v":6458971}]
[]
["Non district-wide breakdown"]
["Greytown River Management Rate",null,null,92549]
["Donalds Creek Stopbank River Management Rate",null,null,2615]
["South Wairarapa district River Management Rates",null,null,{"$f":"SUM(D125:D126)","v":95164}]
[]
[]
["Stadium Rate (ex-GST)"]
["Stadium rate allocations"]
[{"$f":"B66","v":"Rating area"},{"$f":"C66","v":"Category group"},"Concatenated  name","CV","Stadium allocation"]
[{"$f":"B67","v":"Wellington city"},"Regional CBD","Wellington cityRegional CBD",{"$f":"INDEX(capital_values,MATCH($C133,capital_values_rows,0),MATCH(D$132&\" \"&year_current,capital_values_header,0))","v":7963363000},{"$f":"0.2055*D133/SUM($D$133:$D$134)","v":0.13798828004744285}]
[{"$f":"B68","v":"Wellington city"},"Business","Wellington cityBusiness",3896130400,{"$f":"0.2055*D134/SUM($D$133:$D$134)","v":6.7511719952557156E-2}]
[{"$f":"B69","v":"Wellington city"},"Residential","Wellington cityResidential",39537398501,0.3856]
[{"$f":"B70","v":"Wellington city"},"Rural","Wellington cityRural",595945550,2.8999999999999998E-3]
[{"$f":"B71","v":"Hutt city"},"Business","Hutt cityBusiness",3789029500,5.0900000000000001E-2]
[{"$f":"B72","v":"Hutt city"},"Residential","Hutt cityResidential",17301952000,0.14199999999999999]
[{"$f":"B73","v":"Hutt city"},"Rural","Hutt cityRural",311549000,2.3E-3]
[{"$f":"B74","v":"Upper Hutt city"},"Business","Upper Hutt cityBusiness",1174676500,7.9000000000000008E-3]
[{"$f":"B75","v":"Upper Hutt city"},"Residential","Upper Hutt cityResidential",6156988420,4.2700000000000002E-2]
[{"$f":"B76","v":"Upper Hutt city"},"Rural","Upper Hutt cityRural",854712340,2E-3]
[{"$f":"B77","v":"Porirua city"},"Business","Porirua cityBusiness",1099995500,1.24E-2]
[{"$f":"B78","v":"Porirua city"},"Residential","Porirua cityResidential",8551317050,5.8000000000000003E-2]
[{"$f":"B79","v":"Porirua city"},"Rural","Porirua cityRural",625816700,1.4E-3]
[{"$f":"B80","v":"Kāpiti Coast district"},"Business","Kāpiti Coast districtBusiness",1479149500,{"$f":"0.0441*D146/SUM($D$146:$D$148)","v":5.0945760677369341E-3}]
[{"$f":"B81","v":"Kāpiti Coast district excl Ōtaki "},"Residential","Kāpiti Coast district excl Ōtaki Residential",10219999500,{"$f":"0.0441*D147/SUM($D$146:$D$148)","v":3.5200339698579101E-2}]
[{"$f":"B82","v":"Ōtaki rating area"},"Residential","Ōtaki rating areaResidential",1104760900,{"$f":"0.0441*D148/SUM($D$146:$D$148)","v":3.8050842336839622E-3}]
[{"$f":"B83","v":"Kāpiti Coast district"},"Rural","Kāpiti Coast districtRural",1966405700,4.3E-3]
[{"$f":"B84","v":"Masterton district"},"Business","Masterton districtBusiness",433363100,{"$f":"0.0147*D150/SUM($D$150:$D$151)","v":2.0971813053968025E-3}]
[{"$f":"B85","v":"Masterton district"},"Residential","Masterton districtResidential",2604255800,{"$f":"0.0147*D151/SUM($D$150:$D$151)","v":1.2602818694603196E-2}]
[{"$f":"B86","v":"Masterton district"},"Rural","Masterton districtRural",2808895600,5.3E-3]
[{"$f":"B87","v":"Carterton district"},"Business","Carterton districtBusiness",96652500,{"$f":"0.0039*D153/SUM($D$153:$D$154)","v":4.0076374225732163E-4}]
[{"$f":"B88","v":"Carterton district"},"Residential","Carterton districtResidential",843913500,{"$f":"0.0039*D154/SUM($D$153:$D$154)","v":3.4992362577426781E-3}]
[{"$f":"B89","v":"Carterton district"},"Rural","Carterton districtRural",1744267200,3.0999999999999999E-3]
[{"$f":"B90","v":"South Wairarapa district"},"Business","South Wairarapa districtBusiness",206493600,{"$f":"0.0072*D156/SUM($D$156:$D$157)","v":9.7467792445382606E-4}]
[{"$f":"B91","v":"South Wairarapa district"},"Residential","South Wairarapa districtResidential",1318886100,{"$f":"0.0072*D157/SUM($D$156:$D$157)","v":6.2253220755461736E-3}]
[{"$f":"B92","v":"South Wairarapa district"},"Rural","South Wairarapa districtRural",2982290600,3.8E-3]
[{"$f":"B93","v":"Tararua district"},"Rural","Tararua districtRural",10760500,0]
[]
[]
["Pest Rate property areas"]
["TA full name","TA code","Range","Area ha"]
["Wellington city","WCC",16690,34055]
["Hutt city","HCC","15780 to 15890,\n16031 to 16600",15578]
["Upper Hutt city","UHCC","15170 to 15230,\n1590 to 16016",54326.211900000002]
["Porirua city","PCC",null,11858]
["Kāpiti Coast district","KCDC","14860 to 15150, \n15251 to 15410",29205.998500000002]
["Masterton district","MDC","17870 to 18130",207207.73449999999]
["Carterton district","CDC","18140 to 18190",78106.069000000003]
["South Wairarapa district","SWDC","18230 to 18480",178090.13709999999]
["Tararua district","TDC","11130 to 17750",5307.8222999999998]
["Region wide",null,null,{"$f":"SUM(D164:D172)","v":613734.97330000007}]
[]
[]
["Water levy"]
["Need numbers for each city - March 31 comes from Wellington Water"]
["TA full name","Share of levy",{"$f":"year_current","v":"2018/19"}]
["Wellington city",{"$f":"C179/$C$188","v":0.53514217498266803},17696562]
["Hutt city",{"$f":"C180/$C$188","v":0.24815885911892197},8206340]
["Upper Hutt city",0.10032287740583312,3317567]
["Porirua city",0.11637608849257693,3848429]
["Kāpiti Coast district"]
["Masterton district"]
["Carterton district"]
["South Wairarapa district"]
["Tararua district"]
["Region wide",{"$f":"SUM(B179:B187)","v":1},{"$f":"SUM(C179:C187)","v":33068898}]
[]
["Water levy evidence"]

{"sheet":"UHCC Adjustments","index":3,"n_rows":34,"n_cols":5,"rows_kept":34,"cut":false,"hidden":false,"merged":[]}
["Wellington Regional Council"]
[{"$f":"\"UHCC Adjustments \"&year_current","v":"UHCC Adjustments 2018/19"}]
["Printed:",{"$f":"NOW()","v":"2018-11-12T16:52:19.590"}]
[{"$f":"check_total","v":0}]
[]
["TA full name","Category group","Sub category group","CV","Rateable Land Value"]
[]
["Trentham Military Camp"]
["Upper Hutt city","Business","Trentham Military Camp",56325000,19235000]
["Upper Hutt city","Residential","Trentham Military Camp",26720000,9495000]
["Upper Hutt city","Rural","Trentham Military Camp",4676000,2720500]
["Upper Hutt city","Business & Residential","Trentham Military Camp",{"$f":"D10+D9","v":83045000},{"$f":"E10+E9","v":28730000}]
["Upper Hutt","Total","Trentham Military Camp",{"$f":"+D9+D10+D11","v":87721000},{"$f":"+E9+E10+E11","v":31450500}]
[]
["Rest of Upper Hutt"]
["Upper Hutt city","Business","Rest of Upper Hutt city",{"$f":"+D23-D9","v":1118351500},269945200]
["Upper Hutt city","Residential","Rest of Upper Hutt city",6130268420,2965504620]
["Upper Hutt city","Rural","Rest of Upper Hutt city",850036340,419021740]
["Upper Hutt city","Business & Residential","Rest of Upper Hutt city",7248619920,3235449820]
["Upper Hutt","Total","Rest of Upper Hutt city",{"$f":"+D27-D13","v":8098656260},3654471560]
[]
["All Upper Hutt"]
["Upper Hutt city","Business","Total",{"$f":"INDEX(capital_values,MATCH($A16&B16,capital_values_rows,0),MATCH(D$6&\" \"&year_current,capital_values_header,0))","v":1174676500},289180200]
["Upper Hutt city","Residential","Total",{"$f":"INDEX(capital_values,MATCH($A17&B17,capital_values_rows,0),MATCH(D$6&\" \"&year_current,capital_values_header,0))","v":6156988420},2974999620]
["Upper Hutt city","Rural","Total",{"$f":"INDEX(capital_values,MATCH($A18&B18,capital_values_rows,0),MATCH(D$6&\" \"&year_current,capital_values_header,0))","v":854712340},421742240]
["Upper Hutt city","Business & Residential","Total",{"$f":"D24+D23","v":7331664920},{"$f":"E24+E23","v":3264179820}]
["Upper Hutt","All","Total",{"$f":"+'Capital values'!F10","v":8186377260},{"$f":"+E23+E24+E25","v":3685922060}]
[]
["Trentham Military Camp share of rates"]
["Upper Hutt city","Business","Trentham % of Share",{"$f":"+D9/D23","v":4.7949371592944955E-2},{"$f":"+E9/E23","v":6.651561898082925E-2}]
["Upper Hutt city","Residential","Trentham % of Share",{"$f":"+D10/D24","v":4.3397840270747168E-3},3.1915970463216397E-3]
["Upper Hutt city","Rural","Trentham % of Share",{"$f":"+D11/D25","v":5.4708464838591191E-3},6.450622541389262E-3]
["Upper Hutt city","Business & Residential","% of Share",{"$f":"+D12/D26","v":1.1326895174036405E-2},8.8015984364488847E-3]
["Upper Hutt","All","% of Share",{"$f":"+D13/D27","v":1.0715484666046285E-2},{"$f":"+E13/E27","v":8.5326003881916052E-3}]

{"sheet":"Capital values","index":4,"n_rows":143,"n_cols":11,"rows_kept":143,"cut":false,"hidden":false,"merged":[]}
["Wellington Regional Council"]
["Rateable values"]
[{"$f":"check_total","v":0}]
[]
["Capital values"]
[{"$f":"Control!A41","v":"TA full name"},"Rating area",{"$f":"Control!B41","v":"Category group"},{"$f":"Control!C41","v":"Concatenated  row"},{"$f":"\"CV \"&year_previous","v":"CV 2017/18"},{"$f":"\"CV \"&year_current","v":"CV 2018/19"},{"$f":"\"ECV \"&year_previous","v":"ECV 2017/18"},{"$f":"\"ECV \"&year_current","v":"ECV 2018/19"},null,"Check CV","Check ECV"]
[{"$f":"Control!A52","v":0},null,{"$f":"Control!B52","v":0},{"$f":"Control!C52","v":0}]
[{"$f":"Control!A42","v":"Wellington city"},null,{"$f":"Control!B42","v":"District wide"},{"$f":"Control!C42","v":"Wellington cityDistrict wide"},{"$f":"SUMIF($A$19:$A$45,$A8,E$19:E$45)","v":51319125451},51992837451,63374831603,68975077410,null,null,{"$f":"ISBLANK(G8)+ISBLANK(H8)","v":0}]
[{"$f":"Control!A43","v":"Hutt city"},null,{"$f":"Control!B43","v":"District wide"},{"$f":"Control!C43","v":"Hutt cityDistrict wide"},21170821500,21402530500,21472720375,24118117072,null,null,{"$f":"ISBLANK(G9)+ISBLANK(H9)","v":0}]
[{"$f":"Control!A44","v":"Upper Hutt city"},null,{"$f":"Control!B44","v":"District wide"},{"$f":"Control!C44","v":"Upper Hutt cityDistrict wide"},8012247760,8186377260,8129557067,9172479133,null,null,0]
[{"$f":"Control!A45","v":"Porirua city"},null,{"$f":"Control!B45","v":"District wide"},{"$f":"Control!C45","v":"Porirua cityDistrict wide"},10044595300,10277129250,10072475598,11429809803,null,null,0]
[{"$f":"Control!A46","v":"Kāpiti Coast district"},null,{"$f":"Control!B46","v":"District wide"},{"$f":"Control!C46","v":"Kāpiti Coast districtDistrict wide"},10974506450,14770315600,12948799292,14678791680,null,null,0]
[{"$f":"Control!A47","v":"Masterton district"},null,{"$f":"Control!B47","v":"District wide"},{"$f":"Control!C47","v":"Masterton districtDistrict wide"},4724008400,5846514500,5010740516,5891731979,null,null,0]
[{"$f":"Control!A48","v":"Carterton district"},null,{"$f":"Control!B48","v":"District wide"},{"$f":"Control!C48","v":"Carterton districtDistrict wide"},2188251200,2684833200,2315440593,2715649450,null,null,0]
[{"$f":"Control!A49","v":"South Wairarapa district"},null,{"$f":"Control!B49","v":"District wide"},{"$f":"Control!C49","v":"South Wairarapa districtDistrict wide"},3612556200,4507670300,3724959199,4514129051,null,null,0]
[{"$f":"Control!A50","v":"Tararua district"},null,{"$f":"Control!B50","v":"District wide"},{"$f":"Control!C50","v":"Tararua districtDistrict wide"},6806000,10760500,7041800,7041800,null,null,0]
[{"$f":"Control!A51","v":"Region wide"},null,{"$f":"Control!B51","v":0},{"$f":"Control!C51","v":"Region wide"},{"$f":"SUM(E8:E16)","v":112052918261},{"$f":"SUM(F8:F16)","v":119678968561},{"$f":"SUM(G8:G16)","v":127056566043},{"$f":"SUM(H8:H16)","v":141502827378}]
[]
[{"$f":"Control!A67","v":"Wellington city"},{"$f":"Control!B67","v":"Wellington city"},{"$f":"Control!C67","v":"Regional CBD"},{"$f":"Control!D67","v":"Wellington cityRegional CBD"},7854191500,7963363000,{"$f":"E19\n*\n(INDEX(G$8:G$16,MATCH($A19&\"District wide\",$D$8:$D$16,0))/INDEX(E$8:E$16,MATCH($A19&\"District wide\",$D$8:$D$16,0)))","v":9699270190.5155849},{"$f":"F19\n*\n(INDEX(H$8:H$16,MATCH($A19&\"District wide\",$D$8:$D$16,0))/INDEX(F$8:F$16,MATCH($A19&\"District wide\",$D$8:$D$16,0)))","v":10564408605.061914},null,{"$f":"ISBLANK(E19)+ISBLANK(F19)","v":0}]
[{"$f":"Control!A68","v":"Wellington city"},{"$f":"Control!B68","v":"Wellington city"},{"$f":"Control!C68","v":"Business"},{"$f":"Control!D68","v":"Wellington cityBusiness"},3819755400,3896130400,4717078732.5825872,5168709943.8017988,null,{"$f":"ISBLANK(E20)+ISBLANK(F20)","v":0}]
[{"$f":"Control!A69","v":"Wellington city"},{"$f":"Control!B69","v":"Wellington city"},{"$f":"Control!C69","v":"Residential"},{"$f":"Control!D69","v":"Wellington cityResidential"},39066389001,39537398501,48243725950.466728,52451361685.474648,null,{"$f":"ISBLANK(E21)+ISBLANK(F21)","v":0}]
[{"$f":"Control!A70","v":"Wellington city"},{"$f":"Control!B70","v":"Wellington city"},{"$f":"Control!C70","v":"Rural"},{"$f":"Control!D70","v":"Wellington cityRural"},578789550,595945550,714756729.43509579,790597175.66163385,null,{"$f":"ISBLANK(E22)+ISBLANK(F22)","v":0}]
[{"$f":"Control!A71","v":"Hutt city"},{"$f":"Control!B71","v":"Hutt city"},{"$f":"Control!C71","v":"Business"},{"$f":"Control!D71","v":"Hutt cityBusiness"},3796856000,{"$f":"754379000+3034650500","v":3789029500},3850999697.4912381,4269787494.0657892,null,{"$f":"ISBLANK(E23)+ISBLANK(F23)","v":0}]
[{"$f":"Control!A72","v":"Hutt city"},{"$f":"Control!B72","v":"Hutt city"},{"$f":"Control!C72","v":"Residential"},{"$f":"Control!D72","v":"Hutt cityResidential"},17055925500,17301952000,17299145382.635818,19497250753.13522,null,{"$f":"ISBLANK(E24)+ISBLANK(F24)","v":0}]
[{"$f":"Control!A73","v":"Hutt city"},{"$f":"Control!B73","v":"Hutt city"},{"$f":"Control!C73","v":"Rural"},{"$f":"Control!D73","v":"Hutt cityRural"},318040000,311549000,322575294.87294579,351078824.79898942,null,0]
[{"$f":"Control!A74","v":"Upper Hutt city"},{"$f":"Control!B74","v":"Upper Hutt city"},{"$f":"Control!C74","v":"Business"},{"$f":"Control!D74","v":"Upper Hutt cityBusiness"},1170562500,1174676500,1187700995.936275,1316173851.0296159,null,{"$f":"ISBLANK(E26)+ISBLANK(F26)","v":0}]
[{"$f":"Control!A75","v":"Upper Hutt city"},{"$f":"Control!B75","v":"Upper Hutt city"},{"$f":"Control!C75","v":"Residential"},{"$f":"Control!D75","v":"Upper Hutt cityResidential"},6041952920,6156988420,6130414651.4894199,6898637335.0417328,null,{"$f":"ISBLANK(E27)+ISBLANK(F27)","v":0}]
[{"$f":"Control!A76","v":"Upper Hutt city"},{"$f":"Control!B76","v":"Upper Hutt city"},{"$f":"Control!C76","v":"Rural"},{"$f":"Control!D76","v":"Upper Hutt cityRural"},799732340,854712340,811441419.57430518,957667946.92865169,null,0]
[{"$f":"Control!A77","v":"Porirua city"},{"$f":"Control!B77","v":"Porirua city"},{"$f":"Control!C77","v":"Business"},{"$f":"Control!D77","v":"Porirua cityBusiness"},1094739500,1099995500,1097778115.5520244,1223370752.990762,null,{"$f":"ISBLANK(E29)+ISBLANK(F29)","v":0}]
[{"$f":"Control!A78","v":"Porirua city"},{"$f":"Control!B78","v":"Porirua city"},{"$f":"Control!C78","v":"Residential"},{"$f":"Control!D78","v":"Porirua cityResidential"},8349049050,8551317050,8372223102.1721783,9510430886.7820301,null,{"$f":"ISBLANK(E30)+ISBLANK(F30)","v":0}]
[{"$f":"Control!A79","v":"Porirua city"},{"$f":"Control!B79","v":"Porirua city"},{"$f":"Control!C79","v":"Rural"},{"$f":"Control!D79","v":"Porirua cityRural"},600806750,625816700,602474380.27579737,696008163.22720754,null,0]
[{"$f":"Control!A80","v":"Kāpiti Coast district"},{"$f":"Control!B80","v":"Kāpiti Coast district"},{"$f":"Control!C80","v":"Business"},{"$f":"Control!D80","v":"Kāpiti Coast districtBusiness"},1268607000,1479149500,1496826987.0055292,1469983984.2336314,null,{"$f":"ISBLANK(E32)+ISBLANK(F32)","v":0}]
[{"$f":"Control!A81","v":"Kāpiti Coast district"},{"$f":"Control!B81","v":"Kāpiti Coast district excl Ōtaki "},{"$f":"Control!C81","v":"Residential"},{"$f":"Control!D81","v":"Kāpiti Coast district excl Ōtaki Residential"},{"$f":"8022916350-E34","v":7258515350},{"$f":"11324760400-F34","v":10219999500},8564308459.1791496,10156671508.779688,null,{"$f":"ISBLANK(E33)+ISBLANK(F33)","v":0}]
[{"$f":"Control!A82","v":"Kāpiti Coast district"},{"$f":"Control!B82","v":"Ōtaki rating area"},{"$f":"Control!C82","v":"Residential"},{"$f":"Control!D82","v":"Ōtaki rating areaResidential"},764401000,1104760900,901915286.36844468,1097915274.559828,null,0]
[{"$f":"Control!A83","v":"Kāpiti Coast district"},{"$f":"Control!B83","v":"Kāpiti Coast district"},{"$f":"Control!C83","v":"Rural"},{"$f":"Control!D83","v":"Kāpiti Coast districtRural"},1682983100,1966405700,1985748559.4468777,1954220912.4268527,null,0]
[{"$f":"Control!A84","v":"Masterton district"},{"$f":"Control!B84","v":"Masterton district"},{"$f":"Control!C84","v":"Business"},{"$f":"Control!D84","v":"Masterton districtBusiness"},381148600,433363100,404283094.12757981,436714769.93490309,null,{"$f":"ISBLANK(E36)+ISBLANK(F36)","v":0}]
[{"$f":"Control!A85","v":"Masterton district"},{"$f":"Control!B85","v":"Masterton district"},{"$f":"Control!C85","v":"Residential"},{"$f":"Control!D85","v":"Masterton districtResidential"},1974896500,2604255800,2094766365.6687391,2624397353.0479107,null,{"$f":"ISBLANK(E37)+ISBLANK(F37)","v":0}]
[{"$f":"Control!A86","v":"Masterton district"},{"$f":"Control!B86","v":"Masterton district"},{"$f":"Control!C86","v":"Rural"},{"$f":"Control!D86","v":"Masterton districtRural"},2367963300,2808895600,2511691056.2036815,2830619856.0171862,null,0]
[{"$f":"Control!A87","v":"Carterton district"},{"$f":"Control!B87","v":"Carterton district"},{"$f":"Control!C87","v":"Business"},{"$f":"Control!D87","v":"Carterton districtBusiness"},93045500,96652500,98453654.5420295,97761867.838242248,null,{"$f":"ISBLANK(E39)+ISBLANK(F39)","v":0}]
[{"$f":"Control!A88","v":"Carterton district"},{"$f":"Control!B88","v":"Carterton district"},{"$f":"Control!C88","v":"Residential"},{"$f":"Control!D88","v":"Carterton districtResidential"},607751500,843913500,643076303.83414829,853599855.70894134,null,{"$f":"ISBLANK(E40)+ISBLANK(F40)","v":0}]
[{"$f":"Control!A89","v":"Carterton district"},{"$f":"Control!B89","v":"Carterton district"},{"$f":"Control!C89","v":"Rural"},{"$f":"Control!D89","v":"Carterton districtRural"},1487454200,1744267200,1573910634.6238222,1764287726.4528167,null,0]
[{"$f":"Control!A90","v":"South Wairarapa district"},{"$f":"Control!B90","v":"South Wairarapa district"},{"$f":"Control!C90","v":"Business"},{"$f":"Control!D90","v":"South Wairarapa districtBusiness"},190419802,206493600,196344625.20795071,206789471.40512332,null,{"$f":"ISBLANK(E42)+ISBLANK(F42)","v":0}]
[{"$f":"Control!A91","v":"South Wairarapa district"},{"$f":"Control!B91","v":"South Wairarapa district"},{"$f":"Control!C91","v":"Residential"},{"$f":"Control!D91","v":"South Wairarapa districtResidential"},887809098,1318886100,915432863.4530288,1320775847.1088915,null,{"$f":"ISBLANK(E43)+ISBLANK(F43)","v":0}]
[{"$f":"Control!A92","v":"South Wairarapa district"},{"$f":"Control!B92","v":"South Wairarapa district"},{"$f":"Control!C92","v":"Rural"},{"$f":"Control!D92","v":"South Wairarapa districtRural"},2534327300,2982290600,2613181710.3390203,2986563732.4859853,null,0]
[{"$f":"Control!A93","v":"Tararua district"},{"$f":"Control!B93","v":"Tararua district"},{"$f":"Control!C93","v":"Rural"},{"$f":"Control!D93","v":"Tararua districtRural"},6806000,10760500,7041799.9999999991,7041800,null,{"$f":"ISBLANK(E45)+ISBLANK(F45)","v":0}]
[{"$f":"Control!A94","v":"Region wide"},null,{"$f":"Control!C94","v":0},{"$f":"Control!D94","v":"Region wide"},{"$f":"SUM(E19:E45)","v":112052918261},{"$f":"SUM(F19:F45)","v":119678968561},{"$f":"SUM(G19:G45)","v":127056566042.99998},{"$f":"SUM(H19:H45)","v":141502827378.00003}]
[]
["Greytown Urban -CV",null,null,null,535058000,739130000,null,null,null,{"$f":"ISBLANK(E48)+ISBLANK(F48)","v":0}]
["Featherston Urban - LV",null,null,null,78778700,162213500,null,null,null,{"$f":"ISBLANK(E49)+ISBLANK(F49)","v":0}]
[]
["Check totals",null,null,null,{"$f":"Total_CV-E17","v":0},{"$f":"F17-F46","v":0}]
[]
[]
["No. of Assessments (#)"]
[{"$f":"Control!A41","v":"TA full name"},"Rating area",{"$f":"Control!B41","v":"Category group"},{"$f":"Control!C41","v":"Concatenated  row"},{"$f":"\"CV assessments \"&year_previous","v":"CV assessments 2017/18"},{"$f":"\"CV assessments \"&year_current","v":"CV assessments 2018/19"},{"$f":"\"ECV assessments \"&year_previous","v":"ECV assessments 2017/18"},{"$f":"\"ECV assessments  \"&year_current","v":"ECV assessments  2018/19"}]
[{"$f":"Control!A52","v":0},null,{"$f":"Control!B52","v":0},{"$f":"Control!C52","v":0}]
[{"$f":"Control!A42","v":"Wellington city"},null,{"$f":"Control!B42","v":"District wide"},{"$f":"Control!C42","v":"Wellington cityDistrict wide"},{"$f":"SUMIF($A$68:$A$94,$A57,E$68:E$94)","v":76971},77369,77487,77786,null,null,{"$f":"ISBLANK(G57)+ISBLANK(H57)","v":0}]
[{"$f":"Control!A43","v":"Hutt city"},null,{"$f":"Control!B43","v":"District wide"},{"$f":"Control!C43","v":"Hutt cityDistrict wide"},39049,39287,39674,39853,null,null,0]
[{"$f":"Control!A44","v":"Upper Hutt city"},null,{"$f":"Control!B44","v":"District wide"},{"$f":"Control!C44","v":"Upper Hutt cityDistrict wide"},16570,16792,16638,16793,null,null,0]
[{"$f":"Control!A45","v":"Porirua city"},null,{"$f":"Control!B45","v":"District wide"},{"$f":"Control!C45","v":"Porirua cityDistrict wide"},18514,18675,18501,18614,null,null,0]
[{"$f":"Control!A46","v":"Kāpiti Coast district"},null,{"$f":"Control!B46","v":"District wide"},{"$f":"Control!C46","v":"Kāpiti Coast districtDistrict wide"},24761,25013,24679,24776,null,null,0]
[{"$f":"Control!A47","v":"Masterton district"},null,{"$f":"Control!B47","v":"District wide"},{"$f":"Control!C47","v":"Masterton districtDistrict wide"},12296,12342,12273,12285,null,null,0]
[{"$f":"Control!A48","v":"Carterton district"},null,{"$f":"Control!B48","v":"District wide"},{"$f":"Control!C48","v":"Carterton districtDistrict wide"},4561,4662,4619,4662,null,null,0]
[{"$f":"Control!A49","v":"South Wairarapa district"},null,{"$f":"Control!B49","v":"District wide"},{"$f":"Control!C49","v":"South Wairarapa districtDistrict wide"},6598,6657,6556,6596,null,null,0]
[{"$f":"Control!A50","v":"Tararua district"},null,{"$f":"Control!B50","v":"District wide"},{"$f":"Control!C50","v":"Tararua districtDistrict wide"},12,10,10,10,null,null,0]
[{"$f":"Control!A51","v":"Region wide"},null,{"$f":"Control!B51","v":0},{"$f":"Control!C51","v":"Region wide"},{"$f":"SUM(E57:E65)","v":199332},{"$f":"SUM(F57:F65)","v":200807},200437,201375]
[]
[{"$f":"Control!A67","v":"Wellington city"},{"$f":"Control!B67","v":"Wellington city"},{"$f":"Control!C67","v":"Regional CBD"},{"$f":"Control!D67","v":"Wellington cityRegional CBD"},3401,3381,null,null,null,{"$f":"ISBLANK(E68)+ISBLANK(F68)","v":0}]
[{"$f":"Control!A68","v":"Wellington city"},{"$f":"Control!B68","v":"Wellington city"},{"$f":"Control!C68","v":"Business"},{"$f":"Control!D68","v":"Wellington cityBusiness"},1907,1899,null,null,null,{"$f":"ISBLANK(E69)+ISBLANK(F69)","v":0}]
[{"$f":"Control!A69","v":"Wellington city"},{"$f":"Control!B69","v":"Wellington city"},{"$f":"Control!C69","v":"Residential"},{"$f":"Control!D69","v":"Wellington cityResidential"},70889,71308,null,null,null,0]
[{"$f":"Control!A70","v":"Wellington city"},{"$f":"Control!B70","v":"Wellington city"},{"$f":"Control!C70","v":"Rural"},{"$f":"Control!D70","v":"Wellington cityRural"},774,781,null,null,null,0]
[{"$f":"Control!A71","v":"Hutt city"},{"$f":"Control!B71","v":"Hutt city"},{"$f":"Control!C71","v":"Business"},{"$f":"Control!D71","v":"Hutt cityBusiness"},2357,{"$f":"368+2003","v":2371},null,null,null,{"$f":"ISBLANK(E72)+ISBLANK(F72)","v":0}]
[{"$f":"Control!A72","v":"Hutt city"},{"$f":"Control!B72","v":"Hutt city"},{"$f":"Control!C72","v":"Residential"},{"$f":"Control!D72","v":"Hutt cityResidential"},36202,36436,null,null,null,{"$f":"ISBLANK(E73)+ISBLANK(F73)","v":0}]
[{"$f":"Control!A73","v":"Hutt city"},{"$f":"Control!B73","v":"Hutt city"},{"$f":"Control!C73","v":"Rural"},{"$f":"Control!D73","v":"Hutt cityRural"},490,480,null,null,null,0]
[{"$f":"Control!A74","v":"Upper Hutt city"},{"$f":"Control!B74","v":"Upper Hutt city"},{"$f":"Control!C74","v":"Business"},{"$f":"Control!D74","v":"Upper Hutt cityBusiness"},722,716,null,null,null,{"$f":"ISBLANK(E75)+ISBLANK(F75)","v":0}]
[{"$f":"Control!A75","v":"Upper Hutt city"},{"$f":"Control!B75","v":"Upper Hutt city"},{"$f":"Control!C75","v":"Residential"},{"$f":"Control!D75","v":"Upper Hutt cityResidential"},14604,14823,null,null,null,{"$f":"ISBLANK(E76)+ISBLANK(F76)","v":0}]
[{"$f":"Control!A76","v":"Upper Hutt city"},{"$f":"Control!B76","v":"Upper Hutt city"},{"$f":"Control!C76","v":"Rural"},{"$f":"Control!D76","v":"Upper Hutt cityRural"},1244,1253,null,null,null,0]
[{"$f":"Control!A77","v":"Porirua city"},{"$f":"Control!B77","v":"Porirua city"},{"$f":"Control!C77","v":"Business"},{"$f":"Control!D77","v":"Porirua cityBusiness"},796,797,null,null,null,{"$f":"ISBLANK(E78)+ISBLANK(F78)","v":0}]
[{"$f":"Control!A78","v":"Porirua city"},{"$f":"Control!B78","v":"Porirua city"},{"$f":"Control!C78","v":"Residential"},{"$f":"Control!D78","v":"Porirua cityResidential"},17106,17255,null,null,null,{"$f":"ISBLANK(E79)+ISBLANK(F79)","v":0}]
[{"$f":"Control!A79","v":"Porirua city"},{"$f":"Control!B79","v":"Porirua city"},{"$f":"Control!C79","v":"Rural"},{"$f":"Control!D79","v":"Porirua cityRural"},612,623,null,null,null,0]
[{"$f":"Control!A80","v":"Kāpiti Coast district"},{"$f":"Control!B80","v":"Kāpiti Coast district"},{"$f":"Control!C80","v":"Business"},{"$f":"Control!D80","v":"Kāpiti Coast districtBusiness"},1389,1334,null,null,null,0]
[{"$f":"Control!A81","v":"Kāpiti Coast district"},{"$f":"Control!B81","v":"Kāpiti Coast district excl Ōtaki "},{"$f":"Control!C81","v":"Residential"},{"$f":"Control!D81","v":"Kāpiti Coast district excl Ōtaki Residential"},{"$f":"20583-E83","v":17518},{"$f":"21036-F83","v":17885},null,null,null,0]
[{"$f":"Control!A82","v":"Kāpiti Coast district"},{"$f":"Control!B82","v":"Ōtaki rating area"},{"$f":"Control!C82","v":"Residential"},{"$f":"Control!D82","v":"Ōtaki rating areaResidential"},3065,3151,null,null,null,0]
[{"$f":"Control!A83","v":"Kāpiti Coast district"},{"$f":"Control!B83","v":"Kāpiti Coast district"},{"$f":"Control!C83","v":"Rural"},{"$f":"Control!D83","v":"Kāpiti Coast districtRural"},2789,2643,null,null,null,0]
[{"$f":"Control!A84","v":"Masterton district"},{"$f":"Control!B84","v":"Masterton district"},{"$f":"Control!C84","v":"Business"},{"$f":"Control!D84","v":"Masterton districtBusiness"},546,550,null,null,null,{"$f":"ISBLANK(E85)+ISBLANK(F85)","v":0}]
[{"$f":"Control!A85","v":"Masterton district"},{"$f":"Control!B85","v":"Masterton district"},{"$f":"Control!C85","v":"Residential"},{"$f":"Control!D85","v":"Masterton districtResidential"},7842,7912,null,null,null,{"$f":"ISBLANK(E86)+ISBLANK(F86)","v":0}]
[{"$f":"Control!A86","v":"Masterton district"},{"$f":"Control!B86","v":"Masterton district"},{"$f":"Control!C86","v":"Rural"},{"$f":"Control!D86","v":"Masterton districtRural"},3908,3880,null,null,null,0]
[{"$f":"Control!A87","v":"Carterton district"},{"$f":"Control!B87","v":"Carterton district"},{"$f":"Control!C87","v":"Business"},{"$f":"Control!D87","v":"Carterton districtBusiness"},225,227,null,null,null,{"$f":"ISBLANK(E88)+ISBLANK(F88)","v":0}]
[{"$f":"Control!A88","v":"Carterton district"},{"$f":"Control!B88","v":"Carterton district"},{"$f":"Control!C88","v":"Residential"},{"$f":"Control!D88","v":"Carterton districtResidential"},2299,2392,null,null,null,{"$f":"ISBLANK(E89)+ISBLANK(F89)","v":0}]
[{"$f":"Control!A89","v":"Carterton district"},{"$f":"Control!B89","v":"Carterton district"},{"$f":"Control!C89","v":"Rural"},{"$f":"Control!D89","v":"Carterton districtRural"},2037,2043,null,null,null,0]
[{"$f":"Control!A90","v":"South Wairarapa district"},{"$f":"Control!B90","v":"South Wairarapa district"},{"$f":"Control!C90","v":"Business"},{"$f":"Control!D90","v":"South Wairarapa districtBusiness"},312,304,null,null,null,{"$f":"ISBLANK(E91)+ISBLANK(F91)","v":0}]
[{"$f":"Control!A91","v":"South Wairarapa district"},{"$f":"Control!B91","v":"South Wairarapa district"},{"$f":"Control!C91","v":"Residential"},{"$f":"Control!D91","v":"South Wairarapa districtResidential"},3147,3229,null,null,null,{"$f":"ISBLANK(E92)+ISBLANK(F92)","v":0}]
[{"$f":"Control!A92","v":"South Wairarapa district"},{"$f":"Control!B92","v":"South Wairarapa district"},{"$f":"Control!C92","v":"Rural"},{"$f":"Control!D92","v":"South Wairarapa districtRural"},3139,3124,null,null,null,0]
[{"$f":"Control!A93","v":"Tararua district"},{"$f":"Control!B93","v":"Tararua district"},{"$f":"Control!C93","v":"Rural"},{"$f":"Control!D93","v":"Tararua districtRural"},12,10,null,null,null,{"$f":"ISBLANK(E94)+ISBLANK(F94)","v":0}]
[{"$f":"Control!A94","v":"Region wide"},null,{"$f":"Control!C94","v":0},{"$f":"Control!D94","v":"Region wide"},{"$f":"SUM(E68:E94)","v":199332},{"$f":"SUM(F68:F94)","v":200807}]
[]
["Check totals",null,null,null,{"$f":"Total_assessments-E66","v":0},{"$f":"F66-F95","v":0}]
[]
[]
["Number of Assessments Contiguous for WRS"]
[{"$f":"Control!A41","v":"TA full name"},null,{"$f":"Control!B41","v":"Category group"},{"$f":"Control!C41","v":"Concatenated  row"},{"$f":"\"Contiguous assements \"&year_previous","v":"Contiguous assements 2017/18"},{"$f":"\"Contiguous assements \"&year_current","v":"Contiguous assements 2018/19"}]
[{"$f":"Control!A52","v":0},null,{"$f":"Control!B52","v":0},{"$f":"Control!C52","v":0}]
[{"$f":"Control!A42","v":"Wellington city"},null,{"$f":"Control!B42","v":"District wide"},{"$f":"Control!C42","v":"Wellington cityDistrict wide"},{"$f":"SUMIF($A$114:$A$140,$A103,E$114:E$140)","v":0},{"$f":"SUMIF($A$114:$A$140,$A103,F$114:F$140)","v":0}]
[{"$f":"Control!A43","v":"Hutt city"},null,{"$f":"Control!B43","v":"District wide"},{"$f":"Control!C43","v":"Hutt cityDistrict wide"},{"$f":"SUMIF($A$114:$A$140,$A104,E$114:E$140)","v":125},125]
[{"$f":"Control!A44","v":"Upper Hutt city"},null,{"$f":"Control!B44","v":"District wide"},{"$f":"Control!C44","v":"Upper Hutt cityDistrict wide"},78,124]
[{"$f":"Control!A45","v":"Porirua city"},null,{"$f":"Control!B45","v":"District wide"},{"$f":"Control!C45","v":"Porirua cityDistrict wide"},0,0]
[{"$f":"Control!A46","v":"Kāpiti Coast district"},null,{"$f":"Control!B46","v":"District wide"},{"$f":"Control!C46","v":"Kāpiti Coast districtDistrict wide"},425,369]
[{"$f":"Control!A47","v":"Masterton district"},null,{"$f":"Control!B47","v":"District wide"},{"$f":"Control!C47","v":"Masterton districtDistrict wide"},498,453]
[{"$f":"Control!A48","v":"Carterton district"},null,{"$f":"Control!B48","v":"District wide"},{"$f":"Control!C48","v":"Carterton districtDistrict wide"},293,331]
[{"$f":"Control!A49","v":"South Wairarapa district"},null,{"$f":"Control!B49","v":"District wide"},{"$f":"Control!C49","v":"South Wairarapa districtDistrict wide"},445,406]
[{"$f":"Control!A50","v":"Tararua district"},null,{"$f":"Control!B50","v":"District wide"},{"$f":"Control!C50","v":"Tararua districtDistrict wide"},3,1]
[{"$f":"Control!A51","v":"Region wide"},null,{"$f":"Control!B51","v":0},{"$f":"Control!C51","v":"Region wide"},{"$f":"SUM(E103:E111)","v":1867},{"$f":"SUM(F103:F111)","v":1809}]
[]
[{"$f":"Control!A67","v":"Wellington city"},{"$f":"Control!B67","v":"Wellington city"},{"$f":"Control!C67","v":"Regional CBD"},{"$f":"Control!D67","v":"Wellington cityRegional CBD"}]
[{"$f":"Control!A68","v":"Wellington city"},{"$f":"Control!B68","v":"Wellington city"},{"$f":"Control!C68","v":"Business"},{"$f":"Control!D68","v":"Wellington cityBusiness"}]
[{"$f":"Control!A69","v":"Wellington city"},{"$f":"Control!B69","v":"Wellington city"},{"$f":"Control!C69","v":"Residential"},{"$f":"Control!D69","v":"Wellington cityResidential"}]
[{"$f":"Control!A70","v":"Wellington city"},{"$f":"Control!B70","v":"Wellington city"},{"$f":"Control!C70","v":"Rural"},{"$f":"Control!D70","v":"Wellington cityRural"}]
[{"$f":"Control!A71","v":"Hutt city"},{"$f":"Control!B71","v":"Hutt city"},{"$f":"Control!C71","v":"Business"},{"$f":"Control!D71","v":"Hutt cityBusiness"}]
[{"$f":"Control!A72","v":"Hutt city"},{"$f":"Control!B72","v":"Hutt city"},{"$f":"Control!C72","v":"Residential"},{"$f":"Control!D72","v":"Hutt cityResidential"},125,125]
[{"$f":"Control!A73","v":"Hutt city"},{"$f":"Control!B73","v":"Hutt city"},{"$f":"Control!C73","v":"Rural"},{"$f":"Control!D73","v":"Hutt cityRural"}]
[{"$f":"Control!A74","v":"Upper Hutt city"},{"$f":"Control!B74","v":"Upper Hutt city"},{"$f":"Control!C74","v":"Business"},{"$f":"Control!D74","v":"Upper Hutt cityBusiness"}]
[{"$f":"Control!A75","v":"Upper Hutt city"},{"$f":"Control!B75","v":"Upper Hutt city"},{"$f":"Control!C75","v":"Residential"},{"$f":"Control!D75","v":"Upper Hutt cityResidential"},12,{"$f":"14823-14780","v":43}]
[{"$f":"Control!A76","v":"Upper Hutt city"},{"$f":"Control!B76","v":"Upper Hutt city"},{"$f":"Control!C76","v":"Rural"},{"$f":"Control!D76","v":"Upper Hutt cityRural"},66,{"$f":"1253-1172","v":81}]
[{"$f":"Control!A77","v":"Porirua city"},{"$f":"Control!B77","v":"Porirua city"},{"$f":"Control!C77","v":"Business"},{"$f":"Control!D77","v":"Porirua cityBusiness"}]
[{"$f":"Control!A78","v":"Porirua city"},{"$f":"Control!B78","v":"Porirua city"},{"$f":"Control!C78","v":"Residential"},{"$f":"Control!D78","v":"Porirua cityResidential"}]
[{"$f":"Control!A79","v":"Porirua city"},{"$f":"Control!B79","v":"Porirua city"},{"$f":"Control!C79","v":"Rural"},{"$f":"Control!D79","v":"Porirua cityRural"}]
[{"$f":"Control!A80","v":"Kāpiti Coast district"},{"$f":"Control!B80","v":"Kāpiti Coast district"},{"$f":"Control!C80","v":"Business"},{"$f":"Control!D80","v":"Kāpiti Coast districtBusiness"}]
[{"$f":"Control!A81","v":"Kāpiti Coast district"},{"$f":"Control!B81","v":"Kāpiti Coast district excl Ōtaki "},{"$f":"Control!C81","v":"Residential"},{"$f":"Control!D81","v":"Kāpiti Coast district excl Ōtaki Residential"},255,{"$f":"212-F129","v":166}]
[{"$f":"Control!A82","v":"Kāpiti Coast district"},{"$f":"Control!B82","v":"Ōtaki rating area"},{"$f":"Control!C82","v":"Residential"},{"$f":"Control!D82","v":"Ōtaki rating areaResidential"},null,46]
[{"$f":"Control!A83","v":"Kāpiti Coast district"},{"$f":"Control!B83","v":"Kāpiti Coast district"},{"$f":"Control!C83","v":"Rural"},{"$f":"Control!D83","v":"Kāpiti Coast districtRural"},170,157]
[{"$f":"Control!A84","v":"Masterton district"},{"$f":"Control!B84","v":"Masterton district"},{"$f":"Control!C84","v":"Business"},{"$f":"Control!D84","v":"Masterton districtBusiness"}]
[{"$f":"Control!A85","v":"Masterton district"},{"$f":"Control!B85","v":"Masterton district"},{"$f":"Control!C85","v":"Residential"},{"$f":"Control!D85","v":"Masterton districtResidential"},17,15]
[{"$f":"Control!A86","v":"Masterton district"},{"$f":"Control!B86","v":"Masterton district"},{"$f":"Control!C86","v":"Rural"},{"$f":"Control!D86","v":"Masterton districtRural"},481,438]
[{"$f":"Control!A87","v":"Carterton district"},{"$f":"Control!B87","v":"Carterton district"},{"$f":"Control!C87","v":"Business"},{"$f":"Control!D87","v":"Carterton districtBusiness"}]
[{"$f":"Control!A88","v":"Carterton district"},{"$f":"Control!B88","v":"Carterton district"},{"$f":"Control!C88","v":"Residential"},{"$f":"Control!D88","v":"Carterton districtResidential"},79,37]
[{"$f":"Control!A89","v":"Carterton district"},{"$f":"Control!B89","v":"Carterton district"},{"$f":"Control!C89","v":"Rural"},{"$f":"Control!D89","v":"Carterton districtRural"},214,294]
[{"$f":"Control!A90","v":"South Wairarapa district"},{"$f":"Control!B90","v":"South Wairarapa district"},{"$f":"Control!C90","v":"Business"},{"$f":"Control!D90","v":"South Wairarapa districtBusiness"}]
[{"$f":"Control!A91","v":"South Wairarapa district"},{"$f":"Control!B91","v":"South Wairarapa district"},{"$f":"Control!C91","v":"Residential"},{"$f":"Control!D91","v":"South Wairarapa districtResidential"},75,69]
[{"$f":"Control!A92","v":"South Wairarapa district"},{"$f":"Control!B92","v":"South Wairarapa district"},{"$f":"Control!C92","v":"Rural"},{"$f":"Control!D92","v":"South Wairarapa districtRural"},370,337]
[{"$f":"Control!A93","v":"Tararua district"},{"$f":"Control!B93","v":"Tararua district"},{"$f":"Control!C93","v":"Rural"},{"$f":"Control!D93","v":"Tararua districtRural"},3,1]
[{"$f":"Control!A94","v":"Region wide"},null,{"$f":"Control!C94","v":0},{"$f":"Control!D94","v":"Region wide"},{"$f":"SUM(E114:E140)","v":1867},{"$f":"SUM(F114:F140)","v":1809}]
[]
["Check totals",null,null,null,{"$f":"E112-E141","v":0},{"$f":"F112-F141","v":0}]

{"sheet":"ESSbase","index":5,"n_rows":52,"n_cols":11,"rows_kept":52,"cut":false,"hidden":false,"merged":[[2,0,2,1]]}
["Wellington Regional Council"]
["ESSBase values"]
[{"$f":"check_total","v":0}]
[]
[null,"Model naming convention","Essbase name","Essbase name",null,"Last Year Base","Current Year Base","total",null,"Proposed Budget Base"]
[null,null,null,null,null,{"$f":"year_previous","v":"2017/18"},{"$f":"year_current","v":"2018/19"},{"$f":"year_current","v":"2018/19"},null,{"$f":"year_current","v":"2018/19"}]
[]
[null,"General rate","WRC - Mgmt","General Rates",null,{"$f":"42481670.5205436","v":42481670.520543598},47283313.907157809,{"$f":"+G8/F8-1","v":0.11302859157321032},null,36441465.131910644,{"$f":"+G8-J8","v":10841848.775247164}]
[null,"Remission of rates",null,"Remission of Regional Rates",null,0,0,null,null,0,0]
[null,"Public transport rate",null,"Transport Rate",null,64656396.127130903,68109677.793629244,{"$f":"+G10/F10-1","v":5.3409745568068878E-2},null,67273010.401963174,836667.39166606963]
[null,"River management rate",null,"River Rate",null,5826660.417418221,6458970.8070691349,{"$f":"+G11/F11-1","v":0.10852020614770774},null,0,6458970.8070691349]
[null,"Stadium purposes rate",null,"Stadium Rate",null,978091.35,0,-1,null,0,0]
[null,"Wellington regional strategy rate",null,"WRS Rate",null,4822017.2188234972,4907860.8208731934,1.7802425448543158E-2,null,4907860.8208731934,0]
[null,"District-Wide Rates",null,"District-Wide Rates",null,{"$f":"SUM(F8:F13)","v":118764835.63391621},126759823.32872939,6.7317802042492936E-2,null,126743425.26826406,16398.060465335846]
[null,"Rates penalties",null,"Rates Penalties",null,0,0,null,null,0,0]
[null,"Remission of rates penalties",null,"Remission of Rates Penalties",null,0,0,null,null,0,0]
[null,"Pest management rate",null,"Pest Rate",null,472000,532000,0.12711864406779672,null,532000,0]
[null,"River management rate - Non district wide",null,"River  Mgmt Rates - Non District Wide",null,93297.36,95164,2.0007425719227312E-2,null,95164,0]
[null,"Special Rates",null,"Special Rates",null,1451756.1159999999,1487363,2.4526767001407324E-2,null,1480589,6774]
[null,"Total Other Rates",null,"Total Other Rates",null,{"$f":"SUM(F15:F19)","v":2017053.4759999998},2114527,4.8324709860096959E-2,null,2107753,6774]
[null,"Total Regnl Rates",null,"Total Regnl Rates",null,{"$f":"F20+F14","v":120781889.10991621},128874350.32872939,{"$f":"+G21/F21-1","v":6.7000618043394855E-2},null,128851178.26826404,23172.060465350747]
[null,"Bulk water levies",null,"Bulk Water Levies",null,30862765.437637679,33068898.040148415,7.1482013073926209E-2,null,33068898.040148415,0]
[null,"Total Regnl Rates & levies",null,"Total Regnl Rates & levies",null,{"$f":"SUM(F21:F22)","v":151644654.5475539},161943248.3688778,{"$f":"+G23/F23-1","v":6.791267290001568E-2},null,null,161943248.3688778]
[null,"Warm Greater Wellington rate",null,"Warm Greater Wellington rate",null,3181767,3237058,1.7377450957282603E-2,null,3237058,0]
[null,"Total Rates & Levies",null,"Total Rates & Levies",null,{"$f":"SUM(F23:F24)","v":154826421.5475539},165180306.3688778,6.6874146659417377E-2,null,165157134.30841243,23172.060465365648]
[]
[]
[]
[]
[null,"Total River, Drainage etc",null,"Total River, Drainage etc"]
[]
[null,"General Rates","Te Hunga Whiriwhiri Department","General Rates",null,1033308.0584435116,1322264.75,{"$f":"+G32/F32-1","v":0.27964234788969744},null,1322264.75,{"$f":"+G32-J32","v":0}]
[null,"General Rates","Managing Emergencies","General Rates",null,1303299.1439564219,1473476.5933135368,{"$f":"+G33/F33-1","v":0.13057435827089381},null,1454741.3196077219,18735.273705814965]
[null,"General Rates","Rates Collection..","General Rates",null,"0","0","0",null,"0",0]
[null,"General Rates","Old 30000","General Rates",null,16860390.21319633,18396134.632347487,{"$f":"+G35/F35-1","v":9.1085935718685729E-2},null,18407195.973236576,-11061.340889088809]
[null,"General Rates","Parks & Forests Group","General Rates",null,5882830.0820970405,5783725.6973982351,{"$f":"+G36/F36-1","v":-1.6846378922349858E-2},null,5919808.1382245906,-136082.44082635548]
[null,"General Rates","Wairarapa Water Use (was Env Edu) activity","General Rates",null,361326.35353576462,423791.47567589843,{"$f":"+G37/F37-1","v":0.1728772936955203},null,423791.47567589843,0]
[null,"General Rates","Catchment Management (excluding forests)","General Rates",null,21662719.477799378,22664845.332558595,{"$f":"+G38/F38-1","v":4.6260390150286712E-2},null,11132110.546967734,11532734.785590861]
[null,"General Rates","Strategy Group","General Rates",null,5273359.2280416125,6358568.0637109205,{"$f":"+G39/F39-1","v":0.20579080406633432},null,6446744.4822720932,-88176.418561172672]
[null,null,null,null,null,null,null,null,null,null,0]
[null,"General Rates","Investment Management.","General Rates",null,-9897893.7680854462,-9139492.6378468685,{"$f":"+G41/F41-1","v":-7.6622476256913319E-2},null,-8665191.5540739745,-474301.083772894]
[]
[null,"General Rates","WRC - Mgmt","General Rates",null,{"$f":"SUM(F32:F41)","v":42479338.788984612},47283313.907157809,{"$f":"+G43/F43-1","v":0.11308968677777353},null,36441465.131910644,{"$f":"+G43-J43","v":10841848.775247164}]
[]
[null,null,null,null,null,0,0,null,null,null,{"$f":"+G45-J45","v":0}]
[]
[]
[]
[]
[]
[null,"Warm Greater Wellington rate","Warm Greater Wellington management","Warm Greater Wellington rate",null,3181767,3237058,{"$f":"+G51/F51-1","v":1.7377450957282603E-2},null,3237058]
[null,"External Income","Warm Greater Wellington management","External Income",null,0,0,0,null,"0"]

{"sheet":"Class Rates","index":6,"n_rows":165,"n_cols":13,"rows_kept":165,"cut":false,"hidden":false,"merged":[[161,1,161,8]]}
["Wellington Regional Council"]
[{"$f":"\"Class rates \"&year_current","v":"Class rates 2018/19"}]
["Printed :",{"$f":"NOW()","v":"2018-11-12T16:52:19.590"}]
[{"$f":"check_total","v":0}]
[]
["2016-12-01","Revenue Required",null,"Class","$ per Hectare","Class Total","Class Areas","Scheme Total","Var"]
["Draft","ex gst",null,null,"ex gst","ex gst","Hectares","ex gst","$",null,"Lookup index"]
["River Management",null,null,null,null,null,null,null,null,null,"Scheme","Class","Concat"]
["Waingawa",40635,null,"A",146.8098727324633,{"$f":"E9*G9","v":4979.9523739451624},33.92110000000001,{"$f":"SUM(F9:F16)","v":40635.000000000015},{"$f":"B9-H9","v":0},null,{"$f":"A9","v":"Waingawa"},{"$f":"D9","v":"A"},{"$f":"K9&L9","v":"WaingawaA"}]
[null,null,null,"B",95.426417276101148,{"$f":"E10*G10","v":12423.794288577074},130.19240000000002,null,null,null,{"$f":"K9","v":"Waingawa"},"B",{"$f":"K10&L10","v":"WaingawaB"}]
[null,null,null,"C",73.404936366231652,{"$f":"SUM(E11*G11)","v":8381.0012691208594},114.17489999999997,null,null,null,"Waingawa","C","WaingawaC"]
[null,null,null,"D",66.064442729608487,{"$f":"E12*G12","v":153.95657733707961},2.3304,null,null,null,"Waingawa","D","WaingawaD"]
[null,null,null,"E",58.723949092985322,{"$f":"E13*G13","v":9854.2603634720381},167.80649999999994,null,null,null,"Waingawa","E","WaingawaE"]
[null,null,null,"F",51.383455456362157,{"$f":"E14*G14","v":1333.7500765897012},25.956799999999998,null,null,null,"Waingawa","F","WaingawaF"]
[null,null,null,"G",22.021480909869496,{"$f":"E15*G15","v":1030.1343992341158},46.778616000000007,null,null,null,"Waingawa","G","WaingawaG"]
[null,null,null,"H",14.68098727324633,{"$f":"E16*G16","v":2478.1506517239814},168.80000000000004,null,null,null,"Waingawa","H","WaingawaH"]
["Lower Wairarapa Valley Development Scheme",769460,null,"A",0.2341872774,{"$f":"E17*G17+J17","v":676524.10774034355},2888816.6567000002,{"$f":"SUM(F17:F19)","v":769459.60324712354},{"$f":"B17-H17","v":0.39675287646241486},null,{"$f":"A17","v":"Lower Wairarapa Valley Development Scheme"},"A","Lower Wairarapa Valley Development SchemeA"]
[null,null,null,"Sa",18.802472939999998,{"$f":"E18*G18","v":7840.6312159799991},417,null,null,null,"Lower Wairarapa Valley Development Scheme","Sa","Lower Wairarapa Valley Development SchemeSa"]
[null,null,null,"Sb",37.6193034,85094.864290800004,2262,null,null,null,"Lower Wairarapa Valley Development Scheme","Sb","Lower Wairarapa Valley Development SchemeSb"]
["Upper Ruamahanga",42007,null,"A",132.77572476680345,{"$f":"E20*G20+J20","v":11819.576546679356},89.019107728000023,{"$f":"SUM(F20:F26)","v":42007.000000000022},{"$f":"B20-H20","v":0},null,{"$f":"A20","v":"Upper Ruamahanga"},"A","Upper RuamahangaA"]
["(Mt Bruce - Te Ore Ore)",null,null,"B",110.64643730566955,729.50671087960427,6.5931333049999994,null,null,null,{"$f":"K20","v":"Upper Ruamahanga"},"B","Upper RuamahangaB"]
[null,null,null,"C",88.517149844535638,11043.781131309606,124.764310088,null,null,null,"Upper Ruamahanga","C","Upper RuamahangaC"]
[null,null,null,"D",66.387862383401725,1169.435473456098,17.615199999999998,null,null,null,"Upper Ruamahanga","D","Upper RuamahangaD"]
[null,null,null,"E",44.258574922267819,13130.681138894855,296.68106490000008,null,null,null,"Upper Ruamahanga","E","Upper RuamahangaE"]
[null,null,null,"F",22.129287461133909,872.40436925265033,39.423066413000001,null,null,null,"Upper Ruamahanga","F","Upper RuamahangaF"]
[null,null,null,"S",1246.7748575107094,3241.6146295278454,2.600000000000001,null,null,null,"Upper Ruamahanga","S","Upper RuamahangaS"]
["Middle Ruamahanga",29642,null,"A",130.9622033006674,{"$f":"E27*G27+J27","v":5283.1667484972813},40.341156573000006,{"$f":"SUM(F27:F33)","v":29642.000000000004},{"$f":"B27-H27","v":0},null,{"$f":"A27","v":"Middle Ruamahanga"},"A","Middle RuamahangaA"]
["(Te Ore Ore - Gladstone)",null,null,"B",109.13516941722281,5956.5527318534587,54.579589363000011,null,null,null,{"$f":"K27","v":"Middle Ruamahanga"},"B","Middle RuamahangaB"]
[null,null,null,"C",87.308135533778255,446.43268942486833,5.1132999999999997,null,null,null,"Middle Ruamahanga","C","Middle RuamahangaC"]
[null,null,null,"D",65.481101650333699,7412.9898756430821,113.20808124500002,null,null,null,"Middle Ruamahanga","D","Middle RuamahangaD"]
[null,null,null,"E",43.654067766889128,1316.3534902563281,30.154199999999999,null,null,null,"Middle Ruamahanga","E","Middle RuamahangaE"]
[null,null,null,"F",21.827033883444564,6452.9734893659961,295.641337427,null,null,null,"Middle Ruamahanga","F","Middle RuamahangaF"]
[null,null,null,"S",1320.729035694756,2773.5309749589878,2.1,null,null,null,"Middle Ruamahanga","S","Middle RuamahangaS"]
["Lower Ruamahanga",68591,null,"A",63.010582513684838,{"$f":"E34*G34+J34","v":7906.1665794171458},125.47363100000003,{"$f":"SUM(F34:F41)","v":68590.999999999956},{"$f":"B34-H34","v":0},null,{"$f":"A34","v":"Lower Ruamahanga"},"A","Lower RuamahangaA"]
["(Gladstone - Waiohine)",null,null,"B",54.009070726015572,2907.3676871592165,53.831099999999992,null,null,null,{"$f":"K34","v":"Lower Ruamahanga"},"B","Lower RuamahangaB"]
[null,null,null,"C",45.007558938346307,10080.649026822206,223.97680000000005,null,null,null,"Lower Ruamahanga","C","Lower RuamahangaC"]
[null,null,null,"D",36.006047150677048,11468.354489451733,318.51189999999997,null,null,null,"Lower Ruamahanga","D","Lower RuamahangaD"]
[null,null,null,"E",27.004535363007786,8736.6138675413567,323.52394700000002,null,null,null,"Lower Ruamahanga","E","Lower RuamahangaE"]
[null,null,null,"F",18.003023575338524,22040.946937284196,1224.2913999999994,null,null,null,"Lower Ruamahanga","F","Lower RuamahangaF"]
[null,null,null,"SA",1579.9713699813096,4107.925561951407,2.600000000000001,null,null,null,"Lower Ruamahanga","SA","Lower RuamahangaSA"]
[null,null,null,"SB",789.98579433688678,1342.9758503727078,1.7000000000000004,null,null,null,"Lower Ruamahanga",{"$f":"D41","v":"SB"},"Lower RuamahangaSB"]
["Waiohine Rural",92549,null,"A",45.785193650716508,{"$f":"E42*G42","v":5150.2116070719567},112.48639999999997,{"$f":"SUM(F42:F47)","v":92548.999999999971},{"$f":"B42-H42","v":0},null,{"$f":"A42","v":"Waiohine Rural"},"A","Waiohine RuralA"]
[null,null,null,"B",38.154328042263757,{"$f":"E43*G43","v":14613.989005164794},383.0231,null,null,null,{"$f":"K42","v":"Waiohine Rural"},"B","Waiohine RuralB"]
[null,null,null,"C",30.523462433811005,39000.598089160994,1277.7252310000001,null,null,null,"Waiohine Rural","C","Waiohine RuralC"]
[null,null,null,"D",22.892596825358254,8505.1079362701148,371.52220000000005,null,null,null,"Waiohine Rural","D","Waiohine RuralD"]
[null,null,null,"E",15.261731216905503,12230.313171877911,801.37128600000028,null,null,null,"Waiohine Rural","E","Waiohine RuralE"]
[null,null,null,"S",763.08656084527513,13048.780190454185,17.099999999999973,null,null,null,"Waiohine Rural","S","Waiohine RuralS"]
["Mangatarere",9907,null,"A",34.614077181897954,742.71425409198446,21.457000000000001,{"$f":"SUM(F48:F51)","v":9906.9995174453652},{"$f":"B48-H48","v":4.8255463480018079E-4},null,{"$f":"A48","v":"Mangatarere"},"A","MangatarereA"]
[null,null,null,"B",33.109117304424132,6937.9758002013114,209.5488,null,null,null,{"$f":"K48","v":"Mangatarere"},"B","MangatarereB"]
[null,null,null,"C",28.056752001476291,442.41008826007874,15.7684,null,null,null,"Mangatarere","C","MangatarereC"]
[null,null,null,"D",24.831837978318099,1783.8993748919897,71.839200000000005,null,null,null,"Mangatarere","D","MangatarereD"]
["Waipoua",51896,null,"A",111.47839521806316,9754.1812161481757,87.49839999999999,{"$f":"SUM(F52:F57)","v":51895.999999999978},{"$f":"B52-H52","v":0},null,{"$f":"A52","v":"Waipoua"},"A","WaipouaA"]
[null,null,null,"B",89.182716174450519,26784.191639043016,300.32939999999996,null,null,null,{"$f":"K52","v":"Waipoua"},"B","WaipouaB"]
[null,null,null,"C",66.887037130837882,1501.7276915504331,22.451700000000002,null,null,null,{"$f":"K53","v":"Waipoua"},"C","WaipouaC"]
[null,null,null,"D",44.59135808722526,13253.916119080815,297.23059999999998,null,null,null,"Waipoua","D","WaipouaD"]
[null,null,null,"SA",3767.9697583705342,376.79697583705342,0.1,null,null,null,"Waipoua","SA","WaipouaSA"]
[null,null,null,"SC",2251.8635834048755,225.18635834048757,0.1,null,null,null,"Waipoua","SC","WaipouaSC"]
["Kopuaranga",21919,null,"A2",122.7145,3197.203583,26.053999999999998,{"$f":"SUM(F58:F69)","v":21918.581646569997},{"$f":"B58-H58","v":0.41835343000275316},null,{"$f":"A58","v":"Kopuaranga"},"A2","KopuarangaA2"]
[null,null,null,"A3",110.5441,7616.8753943500005,68.903500000000008,null,null,null,{"$f":"K58","v":"Kopuaranga"},"A3","KopuarangaA3"]
[null,null,null,"A4",61.458300000000001,693.53847800999995,11.284699999999999,null,null,null,"Kopuaranga","A4","KopuarangaA4"]
[null,null,null,"A5",42.950899999999997,2479.2977516000001,57.724000000000004,null,null,null,"Kopuaranga","A5","KopuarangaA5"]
[null,null,null,"A6",24.543900000000001,{"$f":"E62*G62","v":1991.2711509000001},81.131,null,null,null,"Kopuaranga","A6","KopuarangaA6"]
[null,null,null,"B2",24.543900000000001,1503.97901469,61.277099999999997,null,null,null,"Kopuaranga","B2","KopuarangaB2"]
[null,null,null,"B3",22.089600000000001,1622.2889404800001,73.441299999999998,null,null,null,"Kopuaranga","B3","KopuarangaB3"]
[null,null,null,"B4",12.272500000000001,113.87898200000001,9.2791999999999994,null,null,null,"Kopuaranga","B4","KopuarangaB4"]
[null,null,null,"B5",8.5909999999999993,266.91377899999998,31.069000000000003,null,null,null,"Kopuaranga","B5","KopuarangaB5"]
[null,null,null,"B6",4.9093999999999998,590.42457253999987,120.26409999999998,null,null,null,"Kopuaranga","B6","KopuarangaB6"]
[null,null,null,"SA",153.57,767.84999999999991,5,null,null,null,"Kopuaranga","SA","KopuarangaSA"]
[null,null,null,"SB",76.790000000000006,1075.0600000000002,14,null,null,null,"Kopuaranga","SB","KopuarangaSB"]
["Lower Taueru",2263,null,"A",4.0587685087116778,{"$f":"E70*G70+J70","v":1653.6785433079754},407.43357000000009,{"$f":"SUM(F70:F73)","v":2263},{"$f":"B70-H70","v":0},null,{"$f":"A70","v":"Lower Taueru"},{"$f":"D70","v":"A"},"Lower TaueruA"]
[null,null,null,"B",0.81175370174233563,228.94946066506537,282.04301399999997,null,null,null,{"$f":"K70","v":"Lower Taueru"},"B",{"$f":"K71&L71","v":"Lower TaueruB"}]
[null,null,null,"C",0.40587685087116782,{"$f":"E72*G72","v":72.311466215743224},178.1611,null,null,null,"Lower Taueru","C","Lower TaueruC"]
[null,null,null,"S",202.93842543558389,308.06052981121627,1.5179999999999996,null,null,null,"Lower Taueru","S","Lower TaueruS"]
["Lower Whangaehu",4114,null,"A",21.623069428869243,{"$f":"E74*G74+J74","v":721.99645053688687},33.390099999999997,{"$f":"SUM(F74:F79)","v":4113.9999999999982},{"$f":"B74-H74","v":0},null,{"$f":"A74","v":"Lower Whangaehu"},"A","Lower WhangaehuA"]
[null,null,null,"B",17.298455543095393,{"$f":"E75*G75","v":1125.8353821112773},65.082999999999998,null,null,null,{"$f":"K74","v":"Lower Whangaehu"},"B","Lower WhangaehuB"]
[null,null,null,"C",12.973841657321547,{"$f":"E76*G76","v":705.83666582991577},54.404599999999995,null,null,null,"Lower Whangaehu","C","Lower WhangaehuC"]
[null,null,null,"D",8.6492277715476966,{"$f":"E77*G77","v":662.2609913940812},76.568799999999996,null,null,null,"Lower Whangaehu","D","Lower WhangaehuD"]
[null,null,null,"E",4.3246138857738483,{"$f":"E78*G78","v":753.53110253056116},174.2424,null,null,null,"Lower Whangaehu","E","Lower WhangaehuE"]
[null,null,null,"S",108.11534714434622,{"$f":"E79*G79","v":144.53940759727647},1.3369,null,null,null,"Lower Whangaehu","S","Lower WhangaehuS"]
["Catchment Schemes",null,null,null,null,null,null,null,null,null,"Lower Whangaehu",0,"Lower Whangaehu0"]
["Awhea-Opouawe",22344,null,"A",null,{"$f":"E81*G81","v":0},2224.6093000000001,{"$f":"H149","v":22343.7},{"$f":"B81-H81","v":0.2999999999992724},null,{"$f":"A81","v":"Awhea-Opouawe"},"A","Awhea-OpouaweA"]
[null,null,null,"B",null,{"$f":"E82*G82","v":0},1956.3706999999999,"see bottom of sheet",null,null,{"$f":"K81","v":"Awhea-Opouawe"},"B","Awhea-OpouaweB"]
["see bottom of sheet",null,null,"C",null,0,1789.5900999999999,null,null,null,"Awhea-Opouawe","C","Awhea-OpouaweC"]
[null,null,null,"D",null,0,685.62689999999998,null,null,null,"Awhea-Opouawe","D","Awhea-OpouaweD"]
[null,null,null,"E",null,0,31708.360700000001,null,null,null,"Awhea-Opouawe","E","Awhea-OpouaweE"]
[null,null,null,"F",null,0,3356.5216999999998,null,null,null,"Awhea-Opouawe","F","Awhea-OpouaweF"]
[null,null,null,"SA",null,0,0.65,null,null,null,"Awhea-Opouawe","SA","Awhea-OpouaweSA"]
[null,null,null,"SB",null,0,0.21,null,null,null,"Awhea-Opouawe","SB","Awhea-OpouaweSB"]
["Whareama",19016,null,"A",4.4592049999999999,{"$f":"E89*G89+J89","v":3190.0529940230949},715.38603720239257,{"$f":"SUM(F89:F94)","v":19016.378851406422},{"$f":"B89-H89","v":-0.3788514064217452},null,{"$f":"A89","v":"Whareama"},"A","WhareamaA"]
[null,null,null,"B",1.718925,1637.3876898023741,952.56494018201727,null,null,null,{"$f":"K89","v":"Whareama"},"B","WhareamaB"]
[null,null,null,"C",0.3008538,13711.448046429548,45575.12002982694,null,null,null,"Whareama","C","WhareamaC"]
[null,null,null,"D",0.25781080000000001,0,0,null,null,null,"Whareama","D","WhareamaD"]
[null,null,null,"E",0.2148796,3.3096830389999998,15.4025,null,null,null,"Whareama","E","WhareamaE"]
[null,null,null,"F",0.17183660000000001,474.18043811240744,2759.4845225778877,null,null,null,"Whareama","F","WhareamaF"]
["Homewood",11566,null,"A",1.97,4520.6251388100009,2294.7335730000004,{"$f":"SUM(F95:F98)","v":11566.232615799327},{"$f":"B95-H95","v":-0.23261579932659515},null,{"$f":"A95","v":"Homewood"},"A","HomewoodA"]
[null,null,null,"B",1.71061,944.99595155844975,552.43214499999988,null,null,null,{"$f":"K95","v":"Homewood"},"B","HomewoodB"]
[null,null,null,"C",1.5598000000000001,5712.7267611436009,3662.4738820000002,null,null,null,"Homewood","C","HomewoodC"]
[null,null,null,"D",0.223,387.88476428727557,1739.3935618263479,null,null,null,"Homewood","D","HomewoodD"]
["Mataikona-Whakataki",6553,null,"A",null,0,4067.5167999999999,{"$f":"H153","v":6553.1399999999994},{"$f":"B99-H99","v":-0.13999999999941792},null,{"$f":"A99","v":"Mataikona-Whakataki"},"A","Mataikona-WhakatakiA"]
[null,null,null,"B",null,0,7767.2790000000005,"see bottom of sheet",null,null,{"$f":"K99","v":"Mataikona-Whakataki"},"B","Mataikona-WhakatakiB"]
["see bottom of sheet",null,null,"C",null,0,11511.363600000001,null,null,null,"Mataikona-Whakataki","C","Mataikona-WhakatakiC"]
[null,null,null,"S",null,0,12.2,null,null,null,"Mataikona-Whakataki",{"$f":"D102","v":"S"},"Mataikona-WhakatakiS"]
["Maungaraki",6835,null,"A",null,"-",3305.4717999999998,{"$f":"SUM(H155:H158)","v":6835.4459630000001},{"$f":"B103-H103","v":-0.44596300000011979},null,{"$f":"A103","v":"Maungaraki"},"A","MaungarakiA"]
[null,null,null,"B",null,"-",2971.2169000000004,"see bottom of sheet",null,null,{"$f":"K103","v":"Maungaraki"},"B","MaungarakiB"]
[null,null,null,"C",null,"-",null,null,null,null,{"$f":"K104","v":"Maungaraki"},"C","MaungarakiC"]
["Upper Kaiwhata",2444,null,"A",9.8000000000000007,{"$f":"E106*G106","v":319.61818000000005},32.614100000000001,{"$f":"SUM(F106:F111)","v":2443.9253050000002},{"$f":"B106-H106","v":7.4694999999792344E-2},null,{"$f":"A106","v":"Upper Kaiwhata"},"A","Upper KaiwhataA"]
[null,null,null,"B",4.2,220.95276000000001,52.607799999999997,null,null,null,{"$f":"K106","v":"Upper Kaiwhata"},"B","Upper KaiwhataB"]
[null,null,null,"C",0.62,594.07941199999993,958.19259999999997,null,null,null,"Upper Kaiwhata","C","Upper KaiwhataC"]
[null,null,null,"D",0.39,800.54469300000005,2052.6786999999999,null,null,null,"Upper Kaiwhata","D","Upper KaiwhataD"]
[null,null,null,"E",0.27,443.12993999999998,1641.2219999999998,null,null,null,"Upper Kaiwhata","E","Upper KaiwhataE"]
[null,null,null,"F",0.14499999999999999,65.600319999999996,452.416,null,null,null,"Upper Kaiwhata","F","Upper KaiwhataF"]
["Lower Kaiwhata",4203,null,"A",16.190000000000001,743.61965200000009,45.930800000000005,{"$f":"SUM(F112:F117)","v":4202.9885717639991},{"$f":"B112-H112","v":1.1428236000938341E-2},null,{"$f":"A112","v":"Lower Kaiwhata"},"A","Lower KaiwhataA"]
[null,null,null,"B",7.1,315.28827999999999,44.406799999999997,null,null,null,{"$f":"K112","v":"Lower Kaiwhata"},"B","Lower KaiwhataB"]
[null,null,null,"C",1.01901,1180.6666635089998,1158.6408999999999,null,null,null,"Lower Kaiwhata","C","Lower KaiwhataC"]
[null,null,null,"D",0.638575,1889.6335917899996,2959.1411999999996,null,null,null,"Lower Kaiwhata","D","Lower KaiwhataD"]
[null,null,null,"E",null,0,0,null,null,null,"Lower Kaiwhata","E","Lower KaiwhataE"]
[null,null,null,"F",0.21182500000000001,73.780384464999997,348.30819999999994,null,null,null,"Lower Kaiwhata","F","Lower KaiwhataF"]
["Pump Drainage",null,null,null,null,null,null,null,null,null,null,0,"0"]
["Te Hopai",55200,null,"A",44.280099999999997,{"$f":"E119*G119","v":55200.337094610499},1246.6172636152696,{"$f":"F119","v":55200.337094610499},{"$f":"B119-H119","v":-0.33709461049875244},null,{"$f":"A119","v":"Te Hopai"},"A","Te HopaiA"]
["Moonmoot Pump",29700,null,"A",130.42169999999999,{"$f":"E120*G120","v":29699.992748434499},227.72278500000002,{"$f":"F120","v":29699.992748434499},{"$f":"B120-H120","v":7.2515655010647606E-3},null,{"$f":"A120","v":"Moonmoot Pump"},"A","Moonmoot PumpA"]
["Onoke Pump",51732,null,"A",72.511700000000005,{"$f":"E121*G121","v":51731.844477335013},713.42755000000011,{"$f":"F121","v":51731.844477335013},{"$f":"B121-H121","v":0.15552266498707468},null,{"$f":"A121","v":"Onoke Pump"},"A","Onoke PumpA"]
["Pouawha Pump",103430,null,"A",109.3922,{"$f":"E122*G122","v":103430.3515729124},945.50024199999996,{"$f":"F122","v":103430.3515729124},{"$f":"B122-H122","v":-0.35157291240466293},null,{"$f":"A122","v":"Pouawha Pump"},"A","Pouawha PumpA"]
["Gravity Drainage",null,null,null,null,null,null,null,null,null,null,0,"0"]
["Okawa",1976,null,"A",7.0071000000000003,{"$f":"E124*G124","v":1976.0096299603995},282.00106034741896,{"$f":"F124","v":1976.0096299603995},{"$f":"B124-H124","v":-9.629960399479387E-3},null,{"$f":"A124","v":"Okawa"},"A","OkawaA"]
["Taumata",1834,null,"A",6.3118999999999996,1834.00270613,290.56270000000001,{"$f":"F125","v":1834.00270613},{"$f":"B125-H125","v":-2.706129999978657E-3},null,{"$f":"A125","v":"Taumata"},"A","TaumataA"]
["East Pukio",3150,null,"A",27.740300000000001,3149.9981721148642,113.55314009274824,{"$f":"F126","v":3149.9981721148642},1.8278851357536041E-3,null,{"$f":"A126","v":"East Pukio"},"A","East PukioA"]
["Longbush",4427,null,"A",15.7545,3436.7862197985924,218.14632135571375,{"$f":"SUM(F127:F128)","v":4426.9974534842149},2.546515785070369E-3,null,{"$f":"A127","v":"Longbush"},"A","LongbushA"]
[null,null,null,"B",7.8773,990.21123368562257,125.70439537476325,null,0,null,{"$f":"K127","v":"Longbush"},"B","LongbushB"]
["Otahoua",3000,null,"A",32.357399999999998,2999.9978067725237,92.714427202819877,{"$f":"F129","v":2999.9978067725237},{"$f":"B129-H129","v":2.1932274762548332E-3},null,{"$f":"A129","v":"Otahoua"},"A","OtahouaA"]
["Te Whiti",1348,null,"A",9.5417000000000005,1347.9941257999999,141.27399999999997,{"$f":"F130","v":1347.9941257999999},5.8742000001075212E-3,null,{"$f":"A130","v":"Te Whiti"},"A","Te WhitiA"]
["Ahikouka",3048,null,"A",27.166399999999999,3048.2747788240004,112.20753500000001,{"$f":"F131","v":3048.2747788240004},-0.27477882400035014,null,{"$f":"A131","v":"Ahikouka"},"A","AhikoukaA"]
["Battersea",10332,null,"A",15.0373,{"$f":"E132*G132","v":2536.8098225890344},168.70115130967889,{"$f":"SUM(F132:F137)","v":10332.003824242869},-3.8242428690864472E-3,null,{"$f":"A132","v":"Battersea"},"A","BatterseaA"]
[null,null,null,"B",12.425800000000001,2427.5136037375073,195.36074970927484,null,null,null,{"$f":"K132","v":"Battersea"},"B","BatterseaB"]
[null,null,null,"C",9.7245000000000008,3092.5012360373394,318.0113359079993,null,null,null,{"$f":"K133","v":"Battersea"},{"$f":"D134","v":"C"},"BatterseaC"]
[null,null,null,"D",5.8792,{"$f":"E135*G135","v":897.97225507807116},152.73715047592719,null,null,null,"Battersea","D",{"$f":"K135&L135","v":"BatterseaD"}]
[null,null,null,"E",5.0279999999999996,1020.1552175284344,202.89483244400049,null,null,null,"Battersea","E","BatterseaE"]
[null,null,null,"F",5.069,357.05168927248292,70.438289459949289,null,null,null,"Battersea","F","BatterseaF"]
["Manaia",3969,null,"A",22.752800000000001,3969.0049146958236,174.44028491859567,{"$f":"F138","v":3969.0049146958236},{"$f":"B138-H138","v":-4.9146958235724014E-3},null,{"$f":"A138","v":"Manaia"},"A","ManaiaA"]
["Whakawiriwiri",8273,null,"A",11.4764,8273.0156469608355,720.87201970660101,{"$f":"F139","v":8273.0156469608355},{"$f":"B139-H139","v":-1.5646960835510981E-2},null,{"$f":"A139","v":"Whakawiriwiri"},"A","WhakawiriwiriA"]
["Total Scheme Rates",{"$f":"SUM(B9:B139)","v":1487363},null,null,null,{"$f":"SUM(F8:F139)+H149+H153+H155+H156+H157+H158","v":1487363.8206703868},null,{"$f":"SUM(H8:H139)","v":1487363.8206703868},{"$f":"SUM(I8:I139)","v":-0.8206703865939744}]
["Checks",{"$f":"IF(ABS(INDEX(ESSbase!$G$8:$G$25,MATCH(\"Special Rates\",ESSbase!$B$8:$B$25,0),)-B140)>tolerance_dollar,1,0)","v":0},null,null,null,{"$f":"IF(ABS(INDEX(ESSbase!$G$8:$G$25,MATCH(\"Special Rates\",ESSbase!$B$8:$B$25,0),)-F140)>tolerance_dollar,1,0)","v":0},null,{"$f":"IF(ABS(INDEX(ESSbase!$G$8:$G$25,MATCH(\"Special Rates\",ESSbase!$B$8:$B$25,0),)-H140)>tolerance_dollar,1,0)","v":0}]
[]
[]
[]
["Revised"]
["Catchment Schemes","$GST Excl",null,null,"Rate Base",null,null,null,null,null,67774000]
["Awhea-Opouawe Catchment Scheme",{"$f":"B81","v":22344},null,null,"land value",{"$f":"DOLLAR(K146,0)&\" x \"&ROUND(K147,5)&\" cents\"","v":"$67,774,000 x 0.00016 cents"},null,{"$f":"K148","v":10523},null,null,1.5526603122141235E-4]
[null,null,null,null,"charge per dwelling","$114.54 / $57.27",null,11820.7,null,null,{"$f":"K146*K147","v":10523}]
[null,null,null,null,null,null,null,{"$f":"SUM(H147:H148)","v":22343.7}]
[]
["Mataikona Whakataki Catchment Scheme",{"$f":"B99","v":6553},null,null,"land value within scheme area",{"$f":"DOLLAR(K151,0)&\" x \"&ROUND(K152,9)&\" cents\"","v":"$74,213,500 x 0.000052349 cents"},null,{"$f":"K153","v":3885},null,null,74213500]
[null,null,null,null,"charge per dwelling",15.3,null,2668.14,null,null,5.2348966158448263E-5]
[null,null,null,null,null,null,null,{"$f":"SUM(H151:H152)","v":6553.1399999999994},null,null,{"$f":"K151*K152","v":3885}]
[]
["Maungaraki Catchment Scheme",{"$f":"B103","v":6835},null,null,"Class A",0.99,3305.4717999999998,{"$f":"F155*G155","v":3272.4170819999999}]
[null,null,null,null,"Class B",0.49,2971.2169000000004,{"$f":"F156*G156","v":1455.896281}]
[null,null,null,null,"Charge per dwelling",22.18,19,421.42]
[null,null,null,null,"River frontage",3.5400000000000001E-2,47619,{"$f":"F158*G158","v":1685.7126000000001}]
[]
[]
[]
["Notes"]
["All River Management schemes have hectare adjustments which in turn affect the $/ha and total columns"]
["Upper Mangatarere River scheme on rates holiday"]
["Bovine Tb rate has been deleted"]

{"sheet":">>District wide rates","index":7,"n_rows":8,"n_cols":12,"rows_kept":8,"cut":false,"hidden":false,"merged":[]}
[]
[]
[]
[]
[]
[]
[null,null,null,null,null,null,null,null,null,null,null,"New category to be added in GL"]
[null,null,null,null,null,null,null,null,null,null,null,"New category to be added in GL, was \"River  Mgmt Rates\""]

{"sheet":"Gen","index":8,"n_rows":29,"n_cols":5,"rows_kept":29,"cut":false,"hidden":false,"merged":[]}
["Wellington Regional Council"]
[{"$f":"\"General rate \"&year_current","v":"General rate 2018/19"}]
["Printed: ",{"$f":"NOW()","v":"2018-11-12T16:52:19.590"}]
[{"$f":"check_total","v":0}]
[]
[null,"CV",{"$f":"\"ECV \"&year_current","v":"ECV 2018/19"},"General Rate","Rates sought"]
[null,"$","$","$","Cents per $"]
[]
["By TA"]
["Wellington city",{"$f":"INDEX(capital_values,MATCH($A10&\"district wide\",capital_values_rows,0),MATCH(B$6&\" \"&year_current,capital_values_header,0))","v":51992837451},{"$f":"INDEX(capital_values,MATCH($A10&\"district wide\",capital_values_rows,0),MATCH(C$6,capital_values_header,0))","v":68975077410},{"$f":"C10/C$19*D$19","v":23048092.376524467},{"$f":"D10/B10*100","v":4.4329360555183883E-2}]
["Hutt city",21402530500,24118117072,{"$f":"C11/C$19*D$19","v":8059093.3870078828},{"$f":"D11/B11*100","v":3.7654862293072695E-2}]
["Upper Hutt city",8186377260,9172479133,3064993.2456397233,3.7440166123491395E-2]
["Porirua city",10277129250,11429809803,3819282.5884013595,3.7162932327637697E-2]
["Kāpiti Coast district",14770315600,14678791680,4904933.1921061305,3.3208045954726456E-2]
["Masterton district",5846514500,5891731979,1968728.2422683882,3.3673537323278477E-2]
["Carterton district",2684833200,2715649450,907437.02995516302,3.3798637098020202E-2]
["South Wairarapa district",4507670300,4514129051,1508400.8206117172,3.3462980214229887E-2]
["Tararua district",10760500,7041800,2353.0246429774902,2.1867242627921474E-2]
["Region wide",{"$f":"SUM(B10:B18)","v":119678968561},{"$f":"SUM(C10:C18)","v":141502827378},{"$f":"INDEX(ess_base_estract,MATCH(D6,ESSbase!$B$8:$B$25,0),MATCH(year_current,ESSbase!$F$6:$G$6,0))","v":47283313.907157809},3.9508457062827754E-2]
[]
[]
["Upper Hutt breakdown"]
["Trentham Military Camp",{"$f":"SUMIFS('UHCC Adjustments'!$D$9:$D$27,'UHCC Adjustments'!$B$9:$B$27,\"Total\",'UHCC Adjustments'!$C$9:$C$27,A23)","v":87721000},null,{"$f":"+D12*'UHCC Adjustments'!$E$34","v":26152.36255755015},{"$f":"D23/B23*100","v":2.9813114941177315E-2}]
["Rest of Upper Hutt city",{"$f":"SUMIFS('UHCC Adjustments'!$D$9:$D$27,'UHCC Adjustments'!$B$9:$B$27,\"Total\",'UHCC Adjustments'!$C$9:$C$27,A24)","v":8098656260},null,{"$f":"+D12-D23","v":3038840.8830821733},{"$f":"D24/B24*100","v":3.7522778909524594E-2}]
["Total Upper Hutt city",{"$f":"+B24+B23","v":8186377260},null,{"$f":"+D24+D23","v":3064993.2456397233},{"$f":"D25/B25*100","v":3.7440166123491395E-2}]
[]
[]
["Check Upper Hutt total",{"$f":"B25-B12","v":0},null,{"$f":"D25-D12","v":0}]
["Check totals",{"$f":"B19-SUM(B10:B18)","v":0},{"$f":"C19-SUM(C10:C18)","v":0},{"$f":"D19-SUM(D10:D18)","v":0}]

{"sheet":"River management","index":9,"n_rows":36,"n_cols":4,"rows_kept":36,"cut":false,"hidden":false,"merged":[]}
["Wellington Regional Council"]
[{"$f":"\"River management rate \"&year_current","v":"River management rate 2018/19"}]
["Printed: ",{"$f":"NOW()","v":"2018-11-12T16:52:19.590"}]
[{"$f":"check_total","v":0}]
[]
[null,"CV","River management rate","Rates sought"]
[null,"$","$","Cents per $"]
[]
["By TA"]
["Wellington city",{"$f":"INDEX(capital_values,MATCH($A10&\"district wide\",capital_values_rows,0),MATCH(B$6&\" \"&year_current,capital_values_header,0))","v":51992837451},{"$f":"INDEX(Control!$C$110:$C$121,MATCH(A10,Control!$A$110:$A$121,0),)","v":42679},{"$f":"C10/B10*100","v":8.2086306676803879E-5}]
["Hutt city",21402530500,{"$f":"INDEX(Control!$C$110:$C$121,MATCH(A11,Control!$A$110:$A$121,0),)","v":4356562},2.0355359381452581E-2]
["Upper Hutt city",8186377260,{"$f":"INDEX(Control!$C$110:$C$121,MATCH(A12,Control!$A$110:$A$121,0),)","v":667062},8.1484395210977608E-3]
["Porirua city",10277129250,{"$f":"INDEX(Control!$C$110:$C$121,MATCH(A13,Control!$A$110:$A$121,0),)","v":33588},3.2682278467987543E-4]
["Kāpiti Coast district",14770315600,{"$f":"INDEX(Control!$C$110:$C$121,MATCH(A14,Control!$A$110:$A$121,0),)","v":1335375},9.0409374868063077E-3]
["Masterton district",5846514500,{"$f":"INDEX(Control!$C$110:$C$121,MATCH(A15,Control!$A$110:$A$121,0),)","v":0},{"$f":"C15/B15*100","v":0}]
["Carterton district",2684833200,{"$f":"INDEX(Control!$C$110:$C$121,MATCH(A16,Control!$A$110:$A$121,0),)","v":23705},8.8292263370402303E-4]
["South Wairarapa district",4507670300,{"$f":"INDEX(Control!$C$110:$C$121,MATCH(A17,Control!$A$110:$A$121,0),)","v":0},0]
["Tararua district",10760500,{"$f":"INDEX(Control!$C$110:$C$121,MATCH(A18,Control!$A$110:$A$121,0),)","v":0},0]
["Region wide",{"$f":"SUM(B10:B18)","v":119678968561},{"$f":"INDEX(ess_base_estract,MATCH(C6,ESSbase!$B$8:$B$25,0),MATCH(year_current,ESSbase!$F$6:$G$6,0))","v":6458970.8070691349},5.3969138310019926E-3]
[]
[]
["Upper Hutt breakdown"]
["Trentham Military Camp",{"$f":"SUMIFS('UHCC Adjustments'!$D$9:$D$27,'UHCC Adjustments'!$B$9:$B$27,\"Total\",'UHCC Adjustments'!$C$9:$C$27,A23)","v":87721000},{"$f":"+C12*'UHCC Adjustments'!$E$34","v":5691.7734801478682},{"$f":"C23/B23*100","v":6.4884958905482926E-3}]
["Rest of Upper Hutt city",{"$f":"SUMIFS('UHCC Adjustments'!$D$9:$D$27,'UHCC Adjustments'!$B$9:$B$27,\"Total\",'UHCC Adjustments'!$C$9:$C$27,A24)","v":8098656260},{"$f":"+C12-C23","v":661370.22651985218},{"$f":"C24/B24*100","v":8.1664192834855816E-3}]
["Total Upper Hutt city",{"$f":"+B24+B23","v":8186377260},{"$f":"+C24+C23","v":667062},{"$f":"C25/B25*100","v":8.1484395210977608E-3}]
[]
[]
["Non district wide"]
["Greytown River Management Rate",{"$f":"INDEX('Capital values'!$F$48:$F$49,MATCH(\"Greytown Urban -CV\",'Capital values'!$A$48:$A$49,0),)","v":739130000},{"$f":"INDEX(Control!$D$125:$D$126,MATCH(A29,Control!$A$125:$A$126,0),)","v":92549},{"$f":"C29/B29*100","v":1.2521342659613331E-2}]
["Donalds Creek Stopbank River Management Rate",{"$f":"INDEX('Capital values'!$F$48:$F$49,MATCH(\"Featherston Urban - LV\",'Capital values'!$A$48:$A$49,0),)","v":162213500},{"$f":"INDEX(Control!$D$125:$D$126,MATCH(A30,Control!$A$125:$A$126,0),)","v":2615},{"$f":"C30/B30*100","v":1.6120729778964142E-3}]
["Total non-district wide rates",null,{"$f":"INDEX(ess_base_estract,MATCH(C6&\" - Non district Wide\",ESSbase!$B$8:$B$25,0),MATCH(year_current,ESSbase!$F$6:$G$6,0))","v":95164}]
[]
[]
["Check Upper Hutt total",{"$f":"B25-B12","v":0},{"$f":"C25-C12","v":0}]
["Check Non district Wide total",null,{"$f":"IF(ABS(C31-SUM(C29:C30))>tolerance_dollar,1,0)","v":0}]
["Check totals",{"$f":"B19-SUM(B10:B18)","v":0},{"$f":"IF(ABS(C19-SUM(C10:C18))>tolerance_dollar,1,0)","v":0}]

{"sheet":"Stadium","index":10,"n_rows":66,"n_cols":8,"rows_kept":66,"cut":false,"hidden":false,"merged":[]}
["Wellington Regional Council"]
[{"$f":"\"Stadium purposes rate \"&year_current","v":"Stadium purposes rate 2018/19"}]
["Printed: ",null,{"$f":"NOW()","v":"2018-11-12T16:52:19.590"}]
[{"$f":"check_total","v":0}]
[]
[{"$f":"Control!A66","v":"TA full name"},{"$f":"Control!B66","v":"Rating area"},{"$f":"Control!C66","v":"Category group"},{"$f":"Control!D66","v":"Concatenated  name"},{"$f":"\"Allocation \"&year_current","v":"Allocation 2018/19"},"CV","Stadium purposes rate","Rates sought"]
[{"$f":"Control!A52","v":0},null,{"$f":"Control!B52","v":0},{"$f":"Control!C52","v":0},"%","$","$","Cents per $"]
[]
["By TA"]
[{"$f":"Control!A42","v":"Wellington city"},null,{"$f":"Control!B42","v":"District wide"},{"$f":"Control!C42","v":"Wellington cityDistrict wide"},{"$f":"SUMIF($A$23:$A$49,$A10,$E$23:$E$49)","v":0.59399999999999997},{"$f":"INDEX(capital_values,MATCH($D10,capital_values_rows,0),MATCH(F$6&\" \"&year_current,capital_values_header,0))","v":51992837451},{"$f":"SUMIF($A$23:$A$49,$A10,$G$23:$G$49)","v":0}]
[{"$f":"Control!A43","v":"Hutt city"},null,{"$f":"Control!B43","v":"District wide"},{"$f":"Control!C43","v":"Hutt cityDistrict wide"},0.19519999999999998,21402530500,{"$f":"SUMIF($A$23:$A$49,$A11,$G$23:$G$49)","v":0}]
[{"$f":"Control!A44","v":"Upper Hutt city"},null,{"$f":"Control!B44","v":"District wide"},{"$f":"Control!C44","v":"Upper Hutt cityDistrict wide"},5.2600000000000008E-2,8186377260,0]
[{"$f":"Control!A45","v":"Porirua city"},null,{"$f":"Control!B45","v":"District wide"},{"$f":"Control!C45","v":"Porirua cityDistrict wide"},7.1800000000000003E-2,10277129250,0]
[{"$f":"Control!A46","v":"Kāpiti Coast district"},null,{"$f":"Control!B46","v":"District wide"},{"$f":"Control!C46","v":"Kāpiti Coast districtDistrict wide"},4.8399999999999999E-2,14770315600,0]
[{"$f":"Control!A47","v":"Masterton district"},null,{"$f":"Control!B47","v":"District wide"},{"$f":"Control!C47","v":"Masterton districtDistrict wide"},1.9999999999999997E-2,5846514500,0]
[{"$f":"Control!A48","v":"Carterton district"},null,{"$f":"Control!B48","v":"District wide"},{"$f":"Control!C48","v":"Carterton districtDistrict wide"},6.9999999999999993E-3,2684833200,0]
[{"$f":"Control!A49","v":"South Wairarapa district"},null,{"$f":"Control!B49","v":"District wide"},{"$f":"Control!C49","v":"South Wairarapa districtDistrict wide"},1.0999999999999999E-2,4507670300,0]
[{"$f":"Control!A50","v":"Tararua district"},null,{"$f":"Control!B50","v":"District wide"},{"$f":"Control!C50","v":"Tararua districtDistrict wide"},0,10760500,{"$f":"SUMIF($A$23:$A$49,$A18,$G$23:$G$49)","v":0}]
["Region wide",null,null,null,{"$f":"SUM(E10:E18)","v":0.99999999999999989},{"$f":"SUM(F10:F18)","v":119678968561},{"$f":"SUM(G10:G18)","v":0}]
[]
[]
["By TA & Category"]
[{"$f":"Control!A67","v":"Wellington city"},{"$f":"Control!B67","v":"Wellington city"},{"$f":"Control!C67","v":"Regional CBD"},{"$f":"Control!D67","v":"Wellington cityRegional CBD"},{"$f":"INDEX(stadium_rate_allocation,MATCH(D23,Control!$C$133:$C$159,0),)","v":0.13798828004744285},{"$f":"INDEX(capital_values,MATCH($D23,capital_values_rows,0),MATCH(F$6&\" \"&year_current,capital_values_header,0))","v":7963363000},{"$f":"$G$50*E23","v":0},{"$f":"G23/F23*100","v":0}]
[{"$f":"Control!A68","v":"Wellington city"},{"$f":"Control!B68","v":"Wellington city"},{"$f":"Control!C68","v":"Business"},{"$f":"Control!D68","v":"Wellington cityBusiness"},{"$f":"INDEX(stadium_rate_allocation,MATCH(D24,Control!$C$133:$C$159,0),)","v":6.7511719952557156E-2},3896130400,0,0]
[{"$f":"Control!A69","v":"Wellington city"},{"$f":"Control!B69","v":"Wellington city"},{"$f":"Control!C69","v":"Residential"},{"$f":"Control!D69","v":"Wellington cityResidential"},{"$f":"INDEX(stadium_rate_allocation,MATCH(D25,Control!$C$133:$C$159,0),)","v":0.3856},39537398501,0,0]
[{"$f":"Control!A70","v":"Wellington city"},{"$f":"Control!B70","v":"Wellington city"},{"$f":"Control!C70","v":"Rural"},{"$f":"Control!D70","v":"Wellington cityRural"},{"$f":"INDEX(stadium_rate_allocation,MATCH(D26,Control!$C$133:$C$159,0),)","v":2.8999999999999998E-3},595945550,0,0]
[{"$f":"Control!A71","v":"Hutt city"},{"$f":"Control!B71","v":"Hutt city"},{"$f":"Control!C71","v":"Business"},{"$f":"Control!D71","v":"Hutt cityBusiness"},{"$f":"INDEX(stadium_rate_allocation,MATCH(D27,Control!$C$133:$C$159,0),)","v":5.0900000000000001E-2},3789029500,0,0]
[{"$f":"Control!A72","v":"Hutt city"},{"$f":"Control!B72","v":"Hutt city"},{"$f":"Control!C72","v":"Residential"},{"$f":"Control!D72","v":"Hutt cityResidential"},{"$f":"INDEX(stadium_rate_allocation,MATCH(D28,Control!$C$133:$C$159,0),)","v":0.14199999999999999},17301952000,0,0]
[{"$f":"Control!A73","v":"Hutt city"},{"$f":"Control!B73","v":"Hutt city"},{"$f":"Control!C73","v":"Rural"},{"$f":"Control!D73","v":"Hutt cityRural"},{"$f":"INDEX(stadium_rate_allocation,MATCH(D29,Control!$C$133:$C$159,0),)","v":2.3E-3},311549000,0,0]
[{"$f":"Control!A74","v":"Upper Hutt city"},{"$f":"Control!B74","v":"Upper Hutt city"},{"$f":"Control!C74","v":"Business"},{"$f":"Control!D74","v":"Upper Hutt cityBusiness"},{"$f":"INDEX(stadium_rate_allocation,MATCH(D30,Control!$C$133:$C$159,0),)","v":7.9000000000000008E-3},1174676500,0,0]
[{"$f":"Control!A75","v":"Upper Hutt city"},{"$f":"Control!B75","v":"Upper Hutt city"},{"$f":"Control!C75","v":"Residential"},{"$f":"Control!D75","v":"Upper Hutt cityResidential"},{"$f":"INDEX(stadium_rate_allocation,MATCH(D31,Control!$C$133:$C$159,0),)","v":4.2700000000000002E-2},6156988420,0,0]
[{"$f":"Control!A76","v":"Upper Hutt city"},{"$f":"Control!B76","v":"Upper Hutt city"},{"$f":"Control!C76","v":"Rural"},{"$f":"Control!D76","v":"Upper Hutt cityRural"},{"$f":"INDEX(stadium_rate_allocation,MATCH(D32,Control!$C$133:$C$159,0),)","v":2E-3},854712340,0,0]
[{"$f":"Control!A77","v":"Porirua city"},{"$f":"Control!B77","v":"Porirua city"},{"$f":"Control!C77","v":"Business"},{"$f":"Control!D77","v":"Porirua cityBusiness"},{"$f":"INDEX(stadium_rate_allocation,MATCH(D33,Control!$C$133:$C$159,0),)","v":1.24E-2},1099995500,0,0]
[{"$f":"Control!A78","v":"Porirua city"},{"$f":"Control!B78","v":"Porirua city"},{"$f":"Control!C78","v":"Residential"},{"$f":"Control!D78","v":"Porirua cityResidential"},{"$f":"INDEX(stadium_rate_allocation,MATCH(D34,Control!$C$133:$C$159,0),)","v":5.8000000000000003E-2},8551317050,{"$f":"$G$50*E34","v":0},{"$f":"G34/F34*100","v":0}]
[{"$f":"Control!A79","v":"Porirua city"},{"$f":"Control!B79","v":"Porirua city"},{"$f":"Control!C79","v":"Rural"},{"$f":"Control!D79","v":"Porirua cityRural"},{"$f":"INDEX(stadium_rate_allocation,MATCH(D35,Control!$C$133:$C$159,0),)","v":1.4E-3},625816700,0,0]
[{"$f":"Control!A80","v":"Kāpiti Coast district"},{"$f":"Control!B80","v":"Kāpiti Coast district"},{"$f":"Control!C80","v":"Business"},{"$f":"Control!D80","v":"Kāpiti Coast districtBusiness"},{"$f":"INDEX(stadium_rate_allocation,MATCH(D36,Control!$C$133:$C$159,0),)","v":5.0945760677369341E-3},1479149500,0,0]
[{"$f":"Control!A81","v":"Kāpiti Coast district"},{"$f":"Control!B81","v":"Kāpiti Coast district excl Ōtaki "},{"$f":"Control!C81","v":"Residential"},{"$f":"Control!D81","v":"Kāpiti Coast district excl Ōtaki Residential"},{"$f":"INDEX(stadium_rate_allocation,MATCH(D37,Control!$C$133:$C$159,0),)","v":3.5200339698579101E-2},10219999500,0,0]
[{"$f":"Control!A82","v":"Kāpiti Coast district"},{"$f":"Control!B82","v":"Ōtaki rating area"},{"$f":"Control!C82","v":"Residential"},{"$f":"Control!D82","v":"Ōtaki rating areaResidential"},{"$f":"INDEX(stadium_rate_allocation,MATCH(D38,Control!$C$133:$C$159,0),)","v":3.8050842336839622E-3},1104760900,0,0]
[{"$f":"Control!A83","v":"Kāpiti Coast district"},{"$f":"Control!B83","v":"Kāpiti Coast district"},{"$f":"Control!C83","v":"Rural"},{"$f":"Control!D83","v":"Kāpiti Coast districtRural"},{"$f":"INDEX(stadium_rate_allocation,MATCH(D39,Control!$C$133:$C$159,0),)","v":4.3E-3},1966405700,0,0]
[{"$f":"Control!A84","v":"Masterton district"},{"$f":"Control!B84","v":"Masterton district"},{"$f":"Control!C84","v":"Business"},{"$f":"Control!D84","v":"Masterton districtBusiness"},{"$f":"INDEX(stadium_rate_allocation,MATCH(D40,Control!$C$133:$C$159,0),)","v":2.0971813053968025E-3},433363100,0,0]
[{"$f":"Control!A85","v":"Masterton district"},{"$f":"Control!B85","v":"Masterton district"},{"$f":"Control!C85","v":"Residential"},{"$f":"Control!D85","v":"Masterton districtResidential"},{"$f":"INDEX(stadium_rate_allocation,MATCH(D41,Control!$C$133:$C$159,0),)","v":1.2602818694603196E-2},2604255800,0,0]
[{"$f":"Control!A86","v":"Masterton district"},{"$f":"Control!B86","v":"Masterton district"},{"$f":"Control!C86","v":"Rural"},{"$f":"Control!D86","v":"Masterton districtRural"},{"$f":"INDEX(stadium_rate_allocation,MATCH(D42,Control!$C$133:$C$159,0),)","v":5.3E-3},2808895600,0,0]
[{"$f":"Control!A87","v":"Carterton district"},{"$f":"Control!B87","v":"Carterton district"},{"$f":"Control!C87","v":"Business"},{"$f":"Control!D87","v":"Carterton districtBusiness"},{"$f":"INDEX(stadium_rate_allocation,MATCH(D43,Control!$C$133:$C$159,0),)","v":4.0076374225732163E-4},96652500,0,0]
[{"$f":"Control!A88","v":"Carterton district"},{"$f":"Control!B88","v":"Carterton district"},{"$f":"Control!C88","v":"Residential"},{"$f":"Control!D88","v":"Carterton districtResidential"},{"$f":"INDEX(stadium_rate_allocation,MATCH(D44,Control!$C$133:$C$159,0),)","v":3.4992362577426781E-3},843913500,0,0]
[{"$f":"Control!A89","v":"Carterton district"},{"$f":"Control!B89","v":"Carterton district"},{"$f":"Control!C89","v":"Rural"},{"$f":"Control!D89","v":"Carterton districtRural"},{"$f":"INDEX(stadium_rate_allocation,MATCH(D45,Control!$C$133:$C$159,0),)","v":3.0999999999999999E-3},1744267200,0,0]
[{"$f":"Control!A90","v":"South Wairarapa district"},{"$f":"Control!B90","v":"South Wairarapa district"},{"$f":"Control!C90","v":"Business"},{"$f":"Control!D90","v":"South Wairarapa districtBusiness"},{"$f":"INDEX(stadium_rate_allocation,MATCH(D46,Control!$C$133:$C$159,0),)","v":9.7467792445382606E-4},206493600,0,0]
[{"$f":"Control!A91","v":"South Wairarapa district"},{"$f":"Control!B91","v":"South Wairarapa district"},{"$f":"Control!C91","v":"Residential"},{"$f":"Control!D91","v":"South Wairarapa districtResidential"},{"$f":"INDEX(stadium_rate_allocation,MATCH(D47,Control!$C$133:$C$159,0),)","v":6.2253220755461736E-3},1318886100,0,0]
[{"$f":"Control!A92","v":"South Wairarapa district"},{"$f":"Control!B92","v":"South Wairarapa district"},{"$f":"Control!C92","v":"Rural"},{"$f":"Control!D92","v":"South Wairarapa districtRural"},{"$f":"INDEX(stadium_rate_allocation,MATCH(D48,Control!$C$133:$C$159,0),)","v":3.8E-3},2982290600,0,0]
[{"$f":"Control!A93","v":"Tararua district"},{"$f":"Control!B93","v":"Tararua district"},{"$f":"Control!C93","v":"Rural"},{"$f":"Control!D93","v":"Tararua districtRural"},{"$f":"INDEX(stadium_rate_allocation,MATCH(D49,Control!$C$133:$C$159,0),)","v":0},10760500,0,0]
["Region wide",null,null,null,{"$f":"SUM(E23:E49)","v":0.99999999999999989},{"$f":"SUM(F23:F49)","v":119678968561},{"$f":"INDEX(ess_base_estract,MATCH(G6,ESSbase!$B$8:$B$25,0),MATCH(year_current,ESSbase!$F$6:$G$6,0))","v":0}]
[]
[]
["Upper Hutt breakdown"]
[{"$f":"$A$12","v":"Upper Hutt city"},"Trentham Military Camp","Business",{"$f":"B54&C54","v":"Trentham Military CampBusiness"},{"$f":"SUMIFS($E$23:$E$49,$A$23:$A$49,A54,$C$23:$C$49,C54)\n  *\n  IF(B54=\"Trentham Military Camp\",\n       INDEX('UHCC Adjustments'!$E$30:$E$32,MATCH(C54,'UHCC Adjustments'!$B$30:$B$32,0),),\n       1-INDEX('UHCC Adjustments'!$E$30:$E$32,MATCH(C54,'UHCC Adjustments'!$B$30:$B$32,0),))","v":5.2547338994855114E-4},{"$f":"SUMIFS('UHCC Adjustments'!$D$9:$D$27,'UHCC Adjustments'!$B$9:$B$27,C54,'UHCC Adjustments'!$C$9:$C$27,B54)","v":56325000},{"$f":"$G$50*E54","v":0},{"$f":"G54/F54*100","v":0}]
["Upper Hutt city","Rest of Upper Hutt City","Business",{"$f":"B55&C55","v":"Rest of Upper Hutt CityBusiness"},{"$f":"SUMIFS($E$23:$E$49,$A$23:$A$49,A55,$C$23:$C$49,C55)\n  *\n  IF(B55=\"Trentham Military Camp\",\n       INDEX('UHCC Adjustments'!$E$30:$E$32,MATCH(C55,'UHCC Adjustments'!$B$30:$B$32,0),),\n       1-INDEX('UHCC Adjustments'!$E$30:$E$32,MATCH(C55,'UHCC Adjustments'!$B$30:$B$32,0),))","v":7.3745266100514496E-3},{"$f":"SUMIFS('UHCC Adjustments'!$D$9:$D$27,'UHCC Adjustments'!$B$9:$B$27,C55,'UHCC Adjustments'!$C$9:$C$27,B55)","v":1118351500},{"$f":"$G$50*E55","v":0},0]
["Upper Hutt city","Trentham Military Camp","Residential","Trentham Military CampResidential",{"$f":"SUMIFS($E$23:$E$49,$A$23:$A$49,A56,$C$23:$C$49,C56)\n  *\n  IF(B56=\"Trentham Military Camp\",\n       INDEX('UHCC Adjustments'!$E$30:$E$32,MATCH(C56,'UHCC Adjustments'!$B$30:$B$32,0),),\n       1-INDEX('UHCC Adjustments'!$E$30:$E$32,MATCH(C56,'UHCC Adjustments'!$B$30:$B$32,0),))","v":1.3628119387793403E-4},{"$f":"SUMIFS('UHCC Adjustments'!$D$9:$D$27,'UHCC Adjustments'!$B$9:$B$27,C56,'UHCC Adjustments'!$C$9:$C$27,B56)","v":26720000},0,0]
["Upper Hutt city","Rest of Upper Hutt City","Residential","Rest of Upper Hutt CityResidential",{"$f":"SUMIFS($E$23:$E$49,$A$23:$A$49,A57,$C$23:$C$49,C57)\n  *\n  IF(B57=\"Trentham Military Camp\",\n       INDEX('UHCC Adjustments'!$E$30:$E$32,MATCH(C57,'UHCC Adjustments'!$B$30:$B$32,0),),\n       1-INDEX('UHCC Adjustments'!$E$30:$E$32,MATCH(C57,'UHCC Adjustments'!$B$30:$B$32,0),))","v":4.2563718806122065E-2},{"$f":"SUMIFS('UHCC Adjustments'!$D$9:$D$27,'UHCC Adjustments'!$B$9:$B$27,C57,'UHCC Adjustments'!$C$9:$C$27,B57)","v":6130268420},0,0]
["Upper Hutt city","Trentham Military Camp","Rural","Trentham Military CampRural",{"$f":"SUMIFS($E$23:$E$49,$A$23:$A$49,A58,$C$23:$C$49,C58)\n  *\n  IF(B58=\"Trentham Military Camp\",\n       INDEX('UHCC Adjustments'!$E$30:$E$32,MATCH(C58,'UHCC Adjustments'!$B$30:$B$32,0),),\n       1-INDEX('UHCC Adjustments'!$E$30:$E$32,MATCH(C58,'UHCC Adjustments'!$B$30:$B$32,0),))","v":1.2901245082778525E-5},{"$f":"SUMIFS('UHCC Adjustments'!$D$9:$D$27,'UHCC Adjustments'!$B$9:$B$27,C58,'UHCC Adjustments'!$C$9:$C$27,B58)","v":4676000},0,0]
["Upper Hutt city","Rest of Upper Hutt City","Rural","Rest of Upper Hutt CityRural",{"$f":"SUMIFS($E$23:$E$49,$A$23:$A$49,A59,$C$23:$C$49,C59)\n  *\n  IF(B59=\"Trentham Military Camp\",\n       INDEX('UHCC Adjustments'!$E$30:$E$32,MATCH(C59,'UHCC Adjustments'!$B$30:$B$32,0),),\n       1-INDEX('UHCC Adjustments'!$E$30:$E$32,MATCH(C59,'UHCC Adjustments'!$B$30:$B$32,0),))","v":1.9870987549172213E-3},{"$f":"SUMIFS('UHCC Adjustments'!$D$9:$D$27,'UHCC Adjustments'!$B$9:$B$27,C59,'UHCC Adjustments'!$C$9:$C$27,B59)","v":850036340},0,0]
["Total",null,null,null,{"$f":"SUM(E54:E59)","v":5.2599999999999994E-2},{"$f":"SUM(F54:F59)","v":8186377260},{"$f":"SUM(G54:G59)","v":0}]
[]
[]
["Check Upper Hutt total",null,null,null,{"$f":"E60-E12","v":0},{"$f":"F60-F12","v":0},{"$f":"G60-G12","v":0}]
["Check TA totals",null,null,null,{"$f":"E19-SUM(E10:E18)","v":0},{"$f":"F19-SUM(F10:F18)","v":0},{"$f":"G19-SUM(G10:G18)","v":0}]
["Check category totals",null,null,null,{"$f":"E50-SUM(E23:E49)","v":0},{"$f":"F50-SUM(F23:F49)","v":0},{"$f":"G50-SUM(G23:G49)","v":0}]
["Category matches TA",null,null,null,null,{"$f":"F50-F19","v":0},{"$f":"G50-G19","v":0}]

{"sheet":"WRS","index":11,"n_rows":54,"n_cols":12,"rows_kept":54,"cut":false,"hidden":false,"merged":[]}
["Wellington Regional Council"]
[{"$f":"\"Wellington regional strategy rate \"&year_current","v":"Wellington regional strategy rate 2018/19"}]
["Printed: ",{"$f":"NOW()","v":"2018-11-12T16:52:19.590"}]
[{"$f":"check_total","v":0}]
[]
[{"$f":"Control!A66","v":"TA full name"},{"$f":"Control!B66","v":"Rating area"},{"$f":"Control!C66","v":"Category group"},{"$f":"Control!D66","v":"Concatenated  name"},"CV assessments","Contiguous assements","Rateable properties","Rating basis","CV","ECV","Wellington regional strategy rate","Rates sought"]
[{"$f":"Control!A52","v":0},null,{"$f":"Control!B52","v":0},{"$f":"Control!C52","v":0},"#","#","#","$","$","$","$","Cents per $"]
[]
["By TA"]
[{"$f":"Control!A42","v":"Wellington city"},null,{"$f":"Control!B42","v":"District wide"},{"$f":"Control!C42","v":"Wellington cityDistrict wide"},null,null,null,null,{"$f":"INDEX(capital_values,MATCH($D10,capital_values_rows,0),MATCH(I$6&\" \"&year_current,capital_values_header,0))","v":51992837451},68975077410,{"$f":"SUMIF($A$23:$A$49,$A10,$K$23:$K$49)","v":2351472.4227200211}]
[{"$f":"Control!A43","v":"Hutt city"},null,{"$f":"Control!B43","v":"District wide"},{"$f":"Control!C43","v":"Hutt cityDistrict wide"},null,null,null,null,21402530500,24118117072,{"$f":"SUMIF($A$23:$A$49,$A11,$K$23:$K$49)","v":883091.45795915532}]
[{"$f":"Control!A44","v":"Upper Hutt city"},null,{"$f":"Control!B44","v":"District wide"},{"$f":"Control!C44","v":"Upper Hutt cityDistrict wide"},null,null,null,null,8186377260,9172479133,351106.94463605288]
[{"$f":"Control!A45","v":"Porirua city"},null,{"$f":"Control!B45","v":"District wide"},{"$f":"Control!C45","v":"Porirua cityDistrict wide"},null,null,null,null,10277129250,11429809803,362532.20642395876]
[{"$f":"Control!A46","v":"Kāpiti Coast district"},null,{"$f":"Control!B46","v":"District wide"},{"$f":"Control!C46","v":"Kāpiti Coast districtDistrict wide"},null,null,null,null,14770315600,14678791680,485529.92728148983]
[{"$f":"Control!A47","v":"Masterton district"},null,{"$f":"Control!B47","v":"District wide"},{"$f":"Control!C47","v":"Masterton districtDistrict wide"},null,null,null,null,5846514500,5891731979,243887.58058216906]
[{"$f":"Control!A48","v":"Carterton district"},null,{"$f":"Control!B48","v":"District wide"},{"$f":"Control!C48","v":"Carterton districtDistrict wide"},null,null,null,null,2684833200,2715649450,90214.335422871896]
[{"$f":"Control!A49","v":"South Wairarapa district"},null,{"$f":"Control!B49","v":"District wide"},{"$f":"Control!C49","v":"South Wairarapa districtDistrict wide"},null,null,null,null,4507670300,4514129051,139773.94584747485]
[{"$f":"Control!A50","v":"Tararua district"},null,{"$f":"Control!B50","v":"District wide"},{"$f":"Control!C50","v":"Tararua districtDistrict wide"},null,null,null,null,10760500,7041800,252]
["Region wide",null,null,null,null,null,null,null,{"$f":"SUM(I10:I18)","v":119678968561},{"$f":"SUM(J10:J18)","v":141502827378},{"$f":"SUM(K10:K18)","v":4907860.8208731934}]
[]
[]
["By TA & Category"]
[{"$f":"Control!A67","v":"Wellington city"},{"$f":"Control!B67","v":"Wellington city"},{"$f":"Control!C67","v":"Regional CBD"},{"$f":"Control!D67","v":"Wellington cityRegional CBD"},{"$f":"INDEX(assessments,MATCH($D23,assessments_rows,0),MATCH(E$6&\" \"&year_current,assessments_header,0))","v":3381},{"$f":"INDEX(assessments_contiguous,MATCH($D23,assessments_contiguous_rows,0),MATCH(F$6&\" \"&year_current,assessments_contiguous_header,0))","v":0},{"$f":"E23-F23","v":3381},{"$f":"INDEX(WRS_value,MATCH($C23,WRS_categories,0),)","v":"Remainder"},{"$f":"INDEX(capital_values,MATCH($D23,capital_values_rows,0),MATCH(I$6&\" \"&year_current,capital_values_header,0))","v":7963363000},{"$f":"INDEX($J$10:$J$18,MATCH(A23,$A$10:$A$18,0),)/INDEX($I$10:$I$18,MATCH(A23,$A$10:$A$18,0),)*I23","v":10564408605.061914},{"$f":"IF(H23=\"Remainder\",\nJ23/(SUMIF($C$23:$C$49,\"Business\",$J$23:$J$49)\n+SUMIF($C$23:$C$49,\"Regional CBD\",$J$23:$J$49))\n*($K$50-SUMPRODUCT($H$23:$H$49,$G$23:$G$49)),\nH23*G23)","v":893930.66496997047},{"$f":"K23/I23*100","v":1.1225542085297009E-2}]
[{"$f":"Control!A68","v":"Wellington city"},{"$f":"Control!B68","v":"Wellington city"},{"$f":"Control!C68","v":"Business"},{"$f":"Control!D68","v":"Wellington cityBusiness"},1899,0,{"$f":"E24-F24","v":1899},"Remainder",3896130400,{"$f":"INDEX($J$10:$J$18,MATCH(A24,$A$10:$A$18,0),)/INDEX($I$10:$I$18,MATCH(A24,$A$10:$A$18,0),)*I24","v":5168709943.8017988},{"$f":"IF(H24=\"Remainder\",\nJ24/(SUMIF($C$23:$C$49,\"Business\",$J$23:$J$49)\n+SUMIF($C$23:$C$49,\"Regional CBD\",$J$23:$J$49))\n*($K$50-SUMPRODUCT($H$23:$H$49,$G$23:$G$49)),\nH24*G24)","v":437361.75775005075},1.1225542085297009E-2]
[{"$f":"Control!A69","v":"Wellington city"},{"$f":"Control!B69","v":"Wellington city"},{"$f":"Control!C69","v":"Residential"},{"$f":"Control!D69","v":"Wellington cityResidential"},71308,0,71308,14,39537398501,52451361685.474648,998312,2.5249815057375368E-3]
[{"$f":"Control!A70","v":"Wellington city"},{"$f":"Control!B70","v":"Wellington city"},{"$f":"Control!C70","v":"Rural"},{"$f":"Control!D70","v":"Wellington cityRural"},781,0,781,28,595945550,790597175.66163385,21868,3.669462755448044E-3]
[{"$f":"Control!A71","v":"Hutt city"},{"$f":"Control!B71","v":"Hutt city"},{"$f":"Control!C71","v":"Business"},{"$f":"Control!D71","v":"Hutt cityBusiness"},2371,0,2371,"Remainder",3789029500,4269787494.0657892,361297.45795915526,9.5353561633435488E-3]
[{"$f":"Control!A72","v":"Hutt city"},{"$f":"Control!B72","v":"Hutt city"},{"$f":"Control!C72","v":"Residential"},{"$f":"Control!D72","v":"Hutt cityResidential"},36436,125,36311,14,{"$f":"INDEX(capital_values,MATCH($D28,capital_values_rows,0),MATCH(I$6&\" \"&year_current,capital_values_header,0))","v":17301952000},19497250753.13522,{"$f":"IF(H28=\"Remainder\",\nJ28/(SUMIF($C$23:$C$49,\"Business\",$J$23:$J$49)\n+SUMIF($C$23:$C$49,\"Regional CBD\",$J$23:$J$49))\n*($K$50-SUMPRODUCT($H$23:$H$49,$G$23:$G$49)),\nH28*G28)","v":508354},2.9381309114717229E-3]
[{"$f":"Control!A73","v":"Hutt city"},{"$f":"Control!B73","v":"Hutt city"},{"$f":"Control!C73","v":"Rural"},{"$f":"Control!D73","v":"Hutt cityRural"},480,0,480,28,311549000,351078824.79898942,13440,4.3139281461343163E-3]
[{"$f":"Control!A74","v":"Upper Hutt city"},{"$f":"Control!B74","v":"Upper Hutt city"},{"$f":"Control!C74","v":"Business"},{"$f":"Control!D74","v":"Upper Hutt cityBusiness"},716,0,716,"Remainder",1174676500,1316173851.0296159,111370.9446360529,9.4809885646007976E-3]
[{"$f":"Control!A75","v":"Upper Hutt city"},{"$f":"Control!B75","v":"Upper Hutt city"},{"$f":"Control!C75","v":"Residential"},{"$f":"Control!D75","v":"Upper Hutt cityResidential"},14823,43,14780,14,6156988420,6898637335.0417328,206920,3.3607339479128015E-3]
[{"$f":"Control!A76","v":"Upper Hutt city"},{"$f":"Control!B76","v":"Upper Hutt city"},{"$f":"Control!C76","v":"Rural"},{"$f":"Control!D76","v":"Upper Hutt cityRural"},1253,81,1172,28,854712340,957667946.92865169,32816,3.8394204066364594E-3]
[{"$f":"Control!A77","v":"Porirua city"},{"$f":"Control!B77","v":"Porirua city"},{"$f":"Control!C77","v":"Business"},{"$f":"Control!D77","v":"Porirua cityBusiness"},797,0,797,"Remainder",1099995500,1223370752.990762,103518.20642395873,9.4107845372057193E-3]
[{"$f":"Control!A78","v":"Porirua city"},{"$f":"Control!B78","v":"Porirua city"},{"$f":"Control!C78","v":"Residential"},{"$f":"Control!D78","v":"Porirua cityResidential"},17255,0,17255,14,8551317050,9510430886.7820301,241570,2.8249449597942343E-3]
[{"$f":"Control!A79","v":"Porirua city"},{"$f":"Control!B79","v":"Porirua city"},{"$f":"Control!C79","v":"Rural"},{"$f":"Control!D79","v":"Porirua cityRural"},623,0,623,28,625816700,696008163.22720754,17444,2.7873976517405175E-3]
[{"$f":"Control!A80","v":"Kāpiti Coast district"},{"$f":"Control!B80","v":"Kāpiti Coast district"},{"$f":"Control!C80","v":"Business"},{"$f":"Control!D80","v":"Kāpiti Coast districtBusiness"},1334,0,1334,"Remainder",1479149500,1469983984.2336314,124385.92728148981,8.4092870451222008E-3]
[{"$f":"Control!A81","v":"Kāpiti Coast district"},{"$f":"Control!B81","v":"Kāpiti Coast district excl Ōtaki "},{"$f":"Control!C81","v":"Residential"},{"$f":"Control!D81","v":"Kāpiti Coast district excl Ōtaki Residential"},17885,166,17719,14,10219999500,10156671508.779688,248066,2.4272603927231111E-3]
[{"$f":"Control!A82","v":"Kāpiti Coast district"},{"$f":"Control!B82","v":"Ōtaki rating area"},{"$f":"Control!C82","v":"Residential"},{"$f":"Control!D82","v":"Ōtaki rating areaResidential"},3151,46,{"$f":"E38-F38","v":3105},14,1104760900,{"$f":"INDEX($J$10:$J$18,MATCH(A38,$A$10:$A$18,0),)/INDEX($I$10:$I$18,MATCH(A38,$A$10:$A$18,0),)*I38","v":1097915274.559828},{"$f":"IF(H38=\"Remainder\",\nJ38/(SUMIF($C$23:$C$49,\"Business\",$J$23:$J$49)\n+SUMIF($C$23:$C$49,\"Regional CBD\",$J$23:$J$49))\n*($K$50-SUMPRODUCT($H$23:$H$49,$G$23:$G$49)),\nH38*G38)","v":43470},{"$f":"K38/I38*100","v":3.9347880613805212E-3}]
[{"$f":"Control!A83","v":"Kāpiti Coast district"},{"$f":"Control!B83","v":"Kāpiti Coast district"},{"$f":"Control!C83","v":"Rural"},{"$f":"Control!D83","v":"Kāpiti Coast districtRural"},2643,157,2486,28,1966405700,1954220912.4268527,69608,3.5398595518717222E-3]
[{"$f":"Control!A84","v":"Masterton district"},{"$f":"Control!B84","v":"Masterton district"},{"$f":"Control!C84","v":"Business"},{"$f":"Control!D84","v":"Masterton districtBusiness"},550,0,550,"Remainder",433363100,436714769.93490309,36953.580582169045,8.5271636145691793E-3]
[{"$f":"Control!A85","v":"Masterton district"},{"$f":"Control!B85","v":"Masterton district"},{"$f":"Control!C85","v":"Residential"},{"$f":"Control!D85","v":"Masterton districtResidential"},7912,15,7897,14,2604255800,2624397353.0479107,110558,4.2452818958874927E-3]
[{"$f":"Control!A86","v":"Masterton district"},{"$f":"Control!B86","v":"Masterton district"},{"$f":"Control!C86","v":"Rural"},{"$f":"Control!D86","v":"Masterton districtRural"},3880,438,3442,28,2808895600,2830619856.0171862,96376,3.4310993972150481E-3]
[{"$f":"Control!A87","v":"Carterton district"},{"$f":"Control!B87","v":"Carterton district"},{"$f":"Control!C87","v":"Business"},{"$f":"Control!D87","v":"Carterton districtBusiness"},227,0,227,"Remainder",96652500,97761867.838242248,8272.3354228718872,8.5588426816397781E-3]
[{"$f":"Control!A88","v":"Carterton district"},{"$f":"Control!B88","v":"Carterton district"},{"$f":"Control!C88","v":"Residential"},{"$f":"Control!D88","v":"Carterton districtResidential"},2392,37,2355,14,843913500,853599855.70894134,32970,3.9067985048230648E-3]
[{"$f":"Control!A89","v":"Carterton district"},{"$f":"Control!B89","v":"Carterton district"},{"$f":"Control!C89","v":"Rural"},{"$f":"Control!D89","v":"Carterton districtRural"},2043,294,1749,28,1744267200,1764287726.4528167,48972,2.8075973681096567E-3]
[{"$f":"Control!A90","v":"South Wairarapa district"},{"$f":"Control!B90","v":"South Wairarapa district"},{"$f":"Control!C90","v":"Business"},{"$f":"Control!D90","v":"South Wairarapa districtBusiness"},304,0,304,"Remainder",206493600,206789471.40512332,17497.945847474839,8.47384415181625E-3]
[{"$f":"Control!A91","v":"South Wairarapa district"},{"$f":"Control!B91","v":"South Wairarapa district"},{"$f":"Control!C91","v":"Residential"},{"$f":"Control!D91","v":"South Wairarapa districtResidential"},3229,69,3160,14,1318886100,1320775847.1088915,44240,3.3543457619274325E-3]
[{"$f":"Control!A92","v":"South Wairarapa district"},{"$f":"Control!B92","v":"South Wairarapa district"},{"$f":"Control!C92","v":"Rural"},{"$f":"Control!D92","v":"South Wairarapa districtRural"},3124,337,2787,28,2982290600,2986563732.4859853,78036,2.6166464126601207E-3]
[{"$f":"Control!A93","v":"Tararua district"},{"$f":"Control!B93","v":"Tararua district"},{"$f":"Control!C93","v":"Rural"},{"$f":"Control!D93","v":"Tararua districtRural"},10,1,9,28,10760500,7041800,252,2.3418986106593558E-3]
["Region wide",null,null,null,{"$f":"SUM(E23:E49)","v":200807},{"$f":"SUM(F23:F49)","v":1809},{"$f":"SUM(G23:G49)","v":198998},null,{"$f":"SUM(I23:I49)","v":119678968561},{"$f":"SUM(J23:J49)","v":141502827378.00003},{"$f":"INDEX(ess_base_estract,MATCH(K6,ESSbase!$B$8:$B$25,0),MATCH(year_current,ESSbase!$F$6:$G$6,0))","v":4907860.8208731934}]
[]
["Check TA totals",null,null,null,null,null,null,null,{"$f":"INDEX(capital_values,MATCH(\"Region wide\",capital_values_rows,0),MATCH(I6&\" \"&year_current,capital_values_header,0))-SUM(I10:I18)","v":0},{"$f":"INDEX(capital_values,MATCH(\"Region wide\",capital_values_rows,0),MATCH(J6&\" \"&year_current,capital_values_header,0))-SUM(J10:J18)","v":0},{"$f":"INDEX(ess_base_estract,MATCH(K6,ESSbase!$B$8:$B$25,0),MATCH(year_current,ESSbase!$F$6:$G$6,0))-SUM(K10:K18)","v":0}]
["Check category totals",null,null,null,{"$f":"INDEX(assessments,MATCH(\"region wide\",assessments_rows,0),MATCH(\"CV assessments \"&year_current,assessments_header,0))-SUM(E23:E49)","v":0},{"$f":"INDEX(assessments_contiguous,MATCH(\"region wide\",assessments_contiguous_rows,0),MATCH(\"Contiguous assements \"&year_current,assessments_contiguous_header,0))-SUM(F23:F49)","v":0},{"$f":"G50-SUM(G23:G49)","v":0},null,{"$f":"INDEX(capital_values,MATCH(\"Region wide\",capital_values_rows,0),MATCH(I6&\" \"&year_current,capital_values_header,0))-SUM(I23:I49)","v":0},{"$f":"INDEX(capital_values,MATCH(\"Region wide\",capital_values_rows,0),MATCH(J6&\" \"&year_current,capital_values_header,0))-SUM(J23:J49)","v":0},{"$f":"INDEX(ess_base_estract,MATCH(K6,ESSbase!$B$8:$B$25,0),MATCH(year_current,ESSbase!$F$6:$G$6,0))-SUM(K23:K49)","v":0}]
["Category matches TA",null,null,null,null,null,null,null,{"$f":"I50-I19","v":0},{"$f":"J50-J19","v":0},{"$f":"K50-K19","v":0}]

{"sheet":"Public transport","index":12,"n_rows":66,"n_cols":10,"rows_kept":66,"cut":false,"hidden":false,"merged":[]}
["Wellington Regional Council"]
[{"$f":"\"Public transport rate \"&year_current","v":"Public transport rate 2018/19"}]
["Printed: ",{"$f":"NOW()","v":"2018-11-12T16:52:19.590"}]
[{"$f":"check_total","v":0}]
[]
[{"$f":"Control!A41","v":"TA full name"},null,{"$f":"Control!B41","v":"Category group"},{"$f":"Control!C41","v":"Concatenated  row"},{"$f":"\"CV\"","v":"CV"},"ECV","Differential","ECV multiplied","Public transport rate","Rates sought"]
[null,null,null,null,"$","$","#","#","$","Cents/$"]
[]
["By TA"]
[{"$f":"Control!A42","v":"Wellington city"},null,{"$f":"Control!B42","v":"District wide"},{"$f":"Control!C42","v":"Wellington cityDistrict wide"},{"$f":"INDEX(capital_values,MATCH($D10,capital_values_rows,0),MATCH(E$6&\" \"&year_current,capital_values_header,0))","v":51992837451},68975077410,null,null,{"$f":"SUMIF($A$23:$A$49,$A10,$I$23:$I$49)","v":40924832.407689974}]
[{"$f":"Control!A43","v":"Hutt city"},null,{"$f":"Control!B43","v":"District wide"},{"$f":"Control!C43","v":"Hutt cityDistrict wide"},21402530500,24118117072,null,null,11715213.077808907]
[{"$f":"Control!A44","v":"Upper Hutt city"},null,{"$f":"Control!B44","v":"District wide"},{"$f":"Control!C44","v":"Upper Hutt cityDistrict wide"},8186377260,9172479133,null,null,4597306.1914495202]
[{"$f":"Control!A45","v":"Porirua city"},null,{"$f":"Control!B45","v":"District wide"},{"$f":"Control!C45","v":"Porirua cityDistrict wide"},10277129250,11429809803,null,null,6086081.3056548676]
[{"$f":"Control!A46","v":"Kāpiti Coast district"},null,{"$f":"Control!B46","v":"District wide"},{"$f":"Control!C46","v":"Kāpiti Coast districtDistrict wide"},14770315600,14678791680,null,null,3594210.5446725246]
[{"$f":"Control!A47","v":"Masterton district"},null,{"$f":"Control!B47","v":"District wide"},{"$f":"Control!C47","v":"Masterton districtDistrict wide"},5846514500,5891731979,null,null,437393.59292990481]
[{"$f":"Control!A48","v":"Carterton district"},null,{"$f":"Control!B48","v":"District wide"},{"$f":"Control!C48","v":"Carterton districtDistrict wide"},2684833200,2715649450,null,null,249139.42310300161]
[{"$f":"Control!A49","v":"South Wairarapa district"},null,{"$f":"Control!B49","v":"District wide"},{"$f":"Control!C49","v":"South Wairarapa districtDistrict wide"},4507670300,4514129051,null,null,505501.25032055634]
[{"$f":"Control!A50","v":"Tararua district"},null,{"$f":"Control!B50","v":"District wide"},{"$f":"Control!C50","v":"Tararua districtDistrict wide"},10760500,7041800,null,null,0]
["Region wide",null,null,null,{"$f":"SUM(E10:E18)","v":119678968561},{"$f":"SUM(F10:F18)","v":141502827378},null,null,{"$f":"SUM(I10:I18)","v":68109677.793629259}]
[]
[]
["By TA & Category"]
[{"$f":"Control!A67","v":"Wellington city"},{"$f":"Control!B67","v":"Wellington city"},{"$f":"Control!C67","v":"Regional CBD"},{"$f":"Control!D67","v":"Wellington cityRegional CBD"},{"$f":"INDEX(capital_values,MATCH($D23,capital_values_rows,0),MATCH(E$6&\" \"&year_current,capital_values_header,0))","v":7963363000},10564408605.061914,{"$f":"INDEX(PT_differentials,MATCH($D23,Concat_rating_category,0),)","v":6.7860042755521404},{"$f":"F23*G23","v":71690121962.629974},{"$f":"I$50*H23/H$50","v":25844164.269209553},{"$f":"I23/E23*100","v":0.32453831715582415}]
[{"$f":"Control!A68","v":"Wellington city"},{"$f":"Control!B68","v":"Wellington city"},{"$f":"Control!C68","v":"Business"},{"$f":"Control!D68","v":"Wellington cityBusiness"},3896130400,5168709943.8017988,{"$f":"INDEX(PT_differentials,MATCH($D24,Concat_rating_category,0),)","v":0.78418518486916788},{"$f":"F24*G24","v":4053225762.81532},1461180.8372846076,3.7503386367268597E-2]
[{"$f":"Control!A69","v":"Wellington city"},{"$f":"Control!B69","v":"Wellington city"},{"$f":"Control!C69","v":"Residential"},{"$f":"Control!D69","v":"Wellington cityResidential"},39537398501,52451361685.474648,0.71751851820250112,37634823314.265213,13567288.342507737,3.431507599612197E-2]
[{"$f":"Control!A70","v":"Wellington city"},{"$f":"Control!B70","v":"Wellington city"},{"$f":"Control!C70","v":"Rural"},{"$f":"Control!D70","v":"Wellington cityRural"},595945550,790597175.66163385,0.18314851735902948,144796700.55066442,52198.958688082472,8.7590147603388378E-3]
[{"$f":"Control!A71","v":"Hutt city"},{"$f":"Control!B71","v":"Hutt city"},{"$f":"Control!C71","v":"Business"},{"$f":"Control!D71","v":"Hutt cityBusiness"},3789029500,4269787494.0657892,1.4169443617879141,6050051315.7490664,2181032.9758243612,5.7561783982530645E-2]
[{"$f":"Control!A72","v":"Hutt city"},{"$f":"Control!B72","v":"Hutt city"},{"$f":"Control!C72","v":"Residential"},{"$f":"Control!D72","v":"Hutt cityResidential"},17301952000,19497250753.13522,1.3502776951212474,26326702808.144428,9490730.5694780909,5.4853525021212005E-2]
[{"$f":"Control!A73","v":"Hutt city"},{"$f":"Control!B73","v":"Hutt city"},{"$f":"Control!C73","v":"Rural"},{"$f":"Control!D73","v":"Hutt cityRural"},311549000,351078824.79898942,0.34330276280399857,{"$f":"F29*G29","v":120526330.51547404},{"$f":"I$50*H29/H$50","v":43449.532506454168},{"$f":"I29/E29*100","v":1.3946291757140664E-2}]
[{"$f":"Control!A74","v":"Upper Hutt city"},{"$f":"Control!B74","v":"Upper Hutt city"},{"$f":"Control!C74","v":"Business"},{"$f":"Control!D74","v":"Upper Hutt cityBusiness"},1174676500,1316173851.0296159,1.5639888652990679,2058481247.8081133,742078.90929759946,6.3173044603990924E-2]
[{"$f":"Control!A75","v":"Upper Hutt city"},{"$f":"Control!B75","v":"Upper Hutt city"},{"$f":"Control!C75","v":"Residential"},{"$f":"Control!D75","v":"Upper Hutt cityResidential"},6156988420,6898637335.0417328,1.4973221986324032,10329482822.072269,3723760.5901796483,6.0480227282604639E-2]
[{"$f":"Control!A76","v":"Upper Hutt city"},{"$f":"Control!B76","v":"Upper Hutt city"},{"$f":"Control!C76","v":"Rural"},{"$f":"Control!D76","v":"Upper Hutt cityRural"},854712340,957667946.92865169,0.38080058746082263,364680516.78283048,131466.69197227218,1.5381396268629067E-2]
[{"$f":"Control!A77","v":"Porirua city"},{"$f":"Control!B77","v":"Porirua city"},{"$f":"Control!C77","v":"Business"},{"$f":"Control!D77","v":"Porirua cityBusiness"},1099995500,1223370752.990762,1.6065069305439641,1965353593.3044472,708506.55183594604,6.4409950025790655E-2]
[{"$f":"Control!A78","v":"Porirua city"},{"$f":"Control!B78","v":"Porirua city"},{"$f":"Control!C78","v":"Residential"},{"$f":"Control!D78","v":"Porirua cityResidential"},8551317050,9510430886.7820301,1.5398402638772972,14644544406.28924,5279332.7856404223,6.1737072251816724E-2]
[{"$f":"Control!A79","v":"Porirua city"},{"$f":"Control!B79","v":"Porirua city"},{"$f":"Control!C79","v":"Rural"},{"$f":"Control!D79","v":"Porirua cityRural"},625816700,696008163.22720754,0.39154307533795868,272517176.69030476,98241.968178499475,1.5698201754363456E-2]
[{"$f":"Control!A80","v":"Kāpiti Coast district"},{"$f":"Control!B80","v":"Kāpiti Coast district"},{"$f":"Control!C80","v":"Business"},{"$f":"Control!D80","v":"Kāpiti Coast districtBusiness"},1479149500,1469983984.2336314,0.81998047547188435,1205358166.3279481,434529.5223524808,2.9376984703201457E-2]
[{"$f":"Control!A81","v":"Kāpiti Coast district"},{"$f":"Control!B81","v":"Kāpiti Coast district excl Ōtaki "},{"$f":"Control!C81","v":"Residential"},{"$f":"Control!D81","v":"Kāpiti Coast district excl Ōtaki Residential"},10219999500,10156671508.779688,0.7533138088052177,7651160899.0622635,2758230.1956271366,2.6988555093639063E-2]
[{"$f":"Control!A82","v":"Kāpiti Coast district"},{"$f":"Control!B82","v":"Ōtaki rating area"},{"$f":"Control!C82","v":"Residential"},{"$f":"Control!D82","v":"Ōtaki rating areaResidential"},1104760900,1097915274.559828,0.66998047547188444,735581797.67743814,265175.95858639781,2.4003018081686076E-2]
[{"$f":"Control!A83","v":"Kāpiti Coast district"},{"$f":"Control!B83","v":"Kāpiti Coast district"},{"$f":"Control!C83","v":"Rural"},{"$f":"Control!D83","v":"Kāpiti Coast districtRural"},1966405700,1954220912.4268527,0.19343672929503264,378018101.6198048,136274.86810650953,6.9301501773774117E-3]
[{"$f":"Control!A84","v":"Masterton district"},{"$f":"Control!B84","v":"Masterton district"},{"$f":"Control!C84","v":"Business"},{"$f":"Control!D84","v":"Masterton districtBusiness"},433363100,436714769.93490309,0.37415618558897079,163399532.50920829,58905.247251236593,1.3592584890415588E-2]
[{"$f":"Control!A85","v":"Masterton district"},{"$f":"Control!B85","v":"Masterton district"},{"$f":"Control!C85","v":"Residential"},{"$f":"Control!D85","v":"Masterton districtResidential"},2604255800,2624397353.0479107,0.29082285225563748,763234723.66553855,275144.79030540778,1.0565198330571358E-2]
[{"$f":"Control!A86","v":"Masterton district"},{"$f":"Control!B86","v":"Masterton district"},{"$f":"Control!C86","v":"Rural"},{"$f":"Control!D86","v":"Masterton districtRural"},2808895600,2830619856.0171862,0.10127416620481691,286668665.76093942,103343.55537326045,3.6791525955347168E-3]
[{"$f":"Control!A87","v":"Carterton district"},{"$f":"Control!B87","v":"Carterton district"},{"$f":"Control!C87","v":"Business"},{"$f":"Control!D87","v":"Carterton districtBusiness"},96652500,97761867.838242248,0.5389184370068979,52685673.014260434,18993.09347979879,1.9650907612114316E-2]
[{"$f":"Control!A88","v":"Carterton district"},{"$f":"Control!B88","v":"Carterton district"},{"$f":"Control!C88","v":"Residential"},{"$f":"Control!D88","v":"Carterton districtResidential"},843913500,853599855.70894134,0.45558510367356447,388887378.75889772,140193.22360905298,1.6612274078925505E-2]
[{"$f":"Control!A89","v":"Carterton district"},{"$f":"Control!B89","v":"Carterton district"},{"$f":"Control!C89","v":"Rural"},{"$f":"Control!D89","v":"Carterton districtRural"},1744267200,1764287726.4528167,0.14143066301924595,249524382.9089399,89953.106014149846,5.1570714632568826E-3]
[{"$f":"Control!A90","v":"South Wairarapa district"},{"$f":"Control!B90","v":"South Wairarapa district"},{"$f":"Control!C90","v":"Business"},{"$f":"Control!D90","v":"South Wairarapa districtBusiness"},206493600,206789471.40512332,0.65854143910329699,136179436.09053999,49092.449839139968,2.3774320288444759E-2]
[{"$f":"Control!A91","v":"South Wairarapa district"},{"$f":"Control!B91","v":"South Wairarapa district"},{"$f":"Control!C91","v":"Residential"},{"$f":"Control!D91","v":"South Wairarapa districtResidential"},1318886100,1320775847.1088915,0.57520810576996362,759720973.16222453,273878.08936080622,2.0765863660312002E-2]
[{"$f":"Control!A92","v":"South Wairarapa district"},{"$f":"Control!B92","v":"South Wairarapa district"},{"$f":"Control!C92","v":"Rural"},{"$f":"Control!D92","v":"South Wairarapa districtRural"},2982290600,2986563732.4859853,0.16953563031481486,506328964.86237764,182530.7111206101,6.1204870887032305E-3]
[{"$f":"Control!A93","v":"Tararua district"},{"$f":"Control!B93","v":"Tararua district"},{"$f":"Control!C93","v":"Rural"},{"$f":"Control!D93","v":"Tararua districtRural"},10760500,7041800,0,0,0,0]
["Region wide",null,null,null,{"$f":"SUM(E23:E49)","v":119678968561},{"$f":"SUM(F23:F49)","v":141502827378.00003},null,{"$f":"SUM(H23:H49)","v":188932056653.03769},{"$f":"INDEX(ess_base_estract,MATCH(I6,ESSbase!$B$8:$B$25,0),MATCH(year_current,ESSbase!$F$6:$G$6,0))","v":68109677.793629244}]
[]
[]
["Upper Hutt breakdown"]
[{"$f":"$A$12","v":"Upper Hutt city"},"Trentham Military Camp","Business",{"$f":"B54&C54","v":"Trentham Military CampBusiness"},{"$f":"SUMIFS('UHCC Adjustments'!$D$9:$D$27,'UHCC Adjustments'!$B$9:$B$27,C54,'UHCC Adjustments'!$C$9:$C$27,B54)","v":56325000},null,null,null,{"$f":"SUMIFS($I$23:$I$49,$A$23:$A$49,A54,$C$23:$C$49,C54)\n*\nIF(B54=\"Trentham Military Camp\",\n       INDEX('UHCC Adjustments'!$E$30:$E$34,MATCH(C54,'UHCC Adjustments'!$B$30:$B$34,0),),\n       1-INDEX('UHCC Adjustments'!$E$30:$E$34,MATCH(C54,'UHCC Adjustments'!$B$30:$B$34,0),))","v":49359.837984548474},{"$f":"I54/E54*100","v":8.7633977779935146E-2}]
["Upper Hutt city","Rest of Upper Hutt City","Business",{"$f":"B55&C55","v":"Rest of Upper Hutt CityBusiness"},{"$f":"SUMIFS('UHCC Adjustments'!$D$9:$D$27,'UHCC Adjustments'!$B$9:$B$27,C55,'UHCC Adjustments'!$C$9:$C$27,B55)","v":1118351500},null,null,null,{"$f":"SUMIFS($I$23:$I$49,$A$23:$A$49,A55,$C$23:$C$49,C55)\n*\nIF(B55=\"Trentham Military Camp\",\n       INDEX('UHCC Adjustments'!$E$30:$E$34,MATCH(C55,'UHCC Adjustments'!$B$30:$B$34,0),),\n       1-INDEX('UHCC Adjustments'!$E$30:$E$34,MATCH(C55,'UHCC Adjustments'!$B$30:$B$34,0),))","v":692719.07131305104},6.1941086618388853E-2]
["Upper Hutt city","Trentham Military Camp","Residential","Trentham Military CampResidential",{"$f":"SUMIFS('UHCC Adjustments'!$D$9:$D$27,'UHCC Adjustments'!$B$9:$B$27,C56,'UHCC Adjustments'!$C$9:$C$27,B56)","v":26720000},null,null,null,{"$f":"SUMIFS($I$23:$I$49,$A$23:$A$49,A56,$C$23:$C$49,C56)\n*\nIF(B56=\"Trentham Military Camp\",\n       INDEX('UHCC Adjustments'!$E$30:$E$34,MATCH(C56,'UHCC Adjustments'!$B$30:$B$34,0),),\n       1-INDEX('UHCC Adjustments'!$E$30:$E$34,MATCH(C56,'UHCC Adjustments'!$B$30:$B$34,0),))","v":11884.743300826291},4.4478829718661267E-2]
["Upper Hutt city","Rest of Upper Hutt City","Residential","Rest of Upper Hutt CityResidential",{"$f":"SUMIFS('UHCC Adjustments'!$D$9:$D$27,'UHCC Adjustments'!$B$9:$B$27,C57,'UHCC Adjustments'!$C$9:$C$27,B57)","v":6130268420},null,null,null,{"$f":"SUMIFS($I$23:$I$49,$A$23:$A$49,A57,$C$23:$C$49,C57)\n*\nIF(B57=\"Trentham Military Camp\",\n       INDEX('UHCC Adjustments'!$E$30:$E$34,MATCH(C57,'UHCC Adjustments'!$B$30:$B$34,0),),\n       1-INDEX('UHCC Adjustments'!$E$30:$E$34,MATCH(C57,'UHCC Adjustments'!$B$30:$B$34,0),))","v":3711875.846878822},6.0549972571654891E-2]
["Upper Hutt city","Trentham Military Camp","Rural","Trentham Military CampRural",{"$f":"SUMIFS('UHCC Adjustments'!$D$9:$D$27,'UHCC Adjustments'!$B$9:$B$27,C58,'UHCC Adjustments'!$C$9:$C$27,B58)","v":4676000},null,null,null,{"$f":"SUMIFS($I$23:$I$49,$A$23:$A$49,A58,$C$23:$C$49,C58)\n*\nIF(B58=\"Trentham Military Camp\",\n       INDEX('UHCC Adjustments'!$E$30:$E$34,MATCH(C58,'UHCC Adjustments'!$B$30:$B$34,0),),\n       1-INDEX('UHCC Adjustments'!$E$30:$E$34,MATCH(C58,'UHCC Adjustments'!$B$30:$B$34,0),))","v":848.0420066782176},1.8136056601330573E-2]
["Upper Hutt city","Rest of Upper Hutt City","Rural","Rest of Upper Hutt CityRural",{"$f":"SUMIFS('UHCC Adjustments'!$D$9:$D$27,'UHCC Adjustments'!$B$9:$B$27,C59,'UHCC Adjustments'!$C$9:$C$27,B59)","v":850036340},null,null,null,{"$f":"SUMIFS($I$23:$I$49,$A$23:$A$49,A59,$C$23:$C$49,C59)\n*\nIF(B59=\"Trentham Military Camp\",\n       INDEX('UHCC Adjustments'!$E$30:$E$34,MATCH(C59,'UHCC Adjustments'!$B$30:$B$34,0),),\n       1-INDEX('UHCC Adjustments'!$E$30:$E$34,MATCH(C59,'UHCC Adjustments'!$B$30:$B$34,0),))","v":130618.64996559396},1.5366243043867274E-2]
["Total",null,null,null,{"$f":"SUM(E54:E59)","v":8186377260},null,null,null,{"$f":"SUM(I54:I59)","v":4597306.1914495192}]
[]
[]
["Check Upper Hutt total",null,null,null,{"$f":"E60-E12","v":0},null,null,null,{"$f":"I60-I12","v":0}]
["Check TA totals",null,null,null,{"$f":"INDEX(capital_values,MATCH(\"Region wide\",capital_values_rows,0),MATCH(E6&\" \"&year_current,capital_values_header,0))-SUM(E10:E18)","v":0},{"$f":"INDEX(capital_values,MATCH(\"Region wide\",capital_values_rows,0),MATCH(F6&\" \"&year_current,capital_values_header,0))-SUM(F10:F18)","v":0},null,null,{"$f":"INDEX(ess_base_estract,MATCH(I6,ESSbase!$B$8:$B$25,0),MATCH(year_current,ESSbase!$F$6:$G$6,0))-SUM(I10:I18)","v":0}]
["Check category totals",null,null,null,{"$f":"INDEX(capital_values,MATCH(\"Region wide\",capital_values_rows,0),MATCH(E6&\" \"&year_current,capital_values_header,0))-SUM(E23:E49)","v":0},{"$f":"INDEX(capital_values,MATCH(\"Region wide\",capital_values_rows,0),MATCH(F6&\" \"&year_current,capital_values_header,0))-SUM(F23:F49)","v":0},null,{"$f":"H50-SUM(H23:H49)","v":0},{"$f":"INDEX(ess_base_estract,MATCH(I6,ESSbase!$B$8:$B$25,0),MATCH(year_current,ESSbase!$F$6:$G$6,0))-SUM(I23:I49)","v":0}]
["Category matches TA",null,null,null,{"$f":"E50-E19","v":0},{"$f":"F50-F19","v":0},null,null,{"$f":"I50-I19","v":0}]

{"sheet":">>Other rates & levies","index":13,"n_rows":0,"n_cols":0,"rows_kept":0,"cut":false,"hidden":false,"merged":[]}

{"sheet":"Pest","index":14,"n_rows":21,"n_cols":4,"rows_kept":21,"cut":false,"hidden":false,"merged":[]}
["Wellington Regional Council"]
[{"$f":"\"Pest management rate \"&year_current","v":"Pest management rate 2018/19"}]
["Printed: ",{"$f":"NOW()","v":"2018-11-12T16:52:19.590"}]
[{"$f":"check_total","v":0}]
[]
["TA full name","Area ha","$ per Hectare","Pest management rate"]
[null,"#","$","Cents per $"]
[]
["By TA"]
[{"$f":"Control!A17","v":"Wellington city"},{"$f":"INDEX(Control!$D$164:$D$172,MATCH(Pest!A10,Control!$A$164:$A$172,0))","v":34055},{"$f":"$C$19","v":0.86682366680113054},{"$f":"B10*C10","v":29519.679972912501}]
[{"$f":"Control!A18","v":"Hutt city"},{"$f":"INDEX(Control!$D$164:$D$172,MATCH(Pest!A11,Control!$A$164:$A$172,0))","v":15578},0.86682366680113054,{"$f":"B11*C11","v":13503.379081428011}]
[{"$f":"Control!A19","v":"Upper Hutt city"},{"$f":"INDEX(Control!$D$164:$D$172,MATCH(Pest!A12,Control!$A$164:$A$172,0))","v":54326.211900000002},{"$f":"$C$19","v":0.86682366680113054},47091.246202573217]
[{"$f":"Control!A20","v":"Porirua city"},{"$f":"INDEX(Control!$D$164:$D$172,MATCH(Pest!A13,Control!$A$164:$A$172,0))","v":11858},0.86682366680113054,10278.795040927806]
[{"$f":"Control!A21","v":"Kāpiti Coast district"},{"$f":"INDEX(Control!$D$164:$D$172,MATCH(Pest!A14,Control!$A$164:$A$172,0))","v":29205.998500000002},0.86682366680113054,25316.450712358321]
[{"$f":"Control!A22","v":"Masterton district"},{"$f":"INDEX(Control!$D$164:$D$172,MATCH(Pest!A15,Control!$A$164:$A$172,0))","v":207207.73449999999},0.86682366680113054,179612.56820884513]
[{"$f":"Control!A23","v":"Carterton district"},{"$f":"INDEX(Control!$D$164:$D$172,MATCH(Pest!A16,Control!$A$164:$A$172,0))","v":78106.069000000003},0.86682366680113054,67704.189130002109]
[{"$f":"Control!A24","v":"South Wairarapa district"},{"$f":"INDEX(Control!$D$164:$D$172,MATCH(Pest!A17,Control!$A$164:$A$172,0))","v":178090.13709999999},0.86682366680113054,154372.74566213804]
[{"$f":"Control!A25","v":"Tararua district"},{"$f":"INDEX(Control!$D$164:$D$172,MATCH(Pest!A18,Control!$A$164:$A$172,0))","v":5307.8222999999998},0.86682366680113054,4600.9459888148103]
["Region wide",{"$f":"SUM(B10:B18)","v":613734.97330000007},{"$f":"D19/B19","v":0.86682366680113054},{"$f":"INDEX(ess_base_estract,MATCH(D6,ESSbase!$B$8:$B$25,0),MATCH(year_current,ESSbase!$F$6:$G$6,0))","v":532000}]
[]
["Check",{"$f":"Control!D173-Pest!B19","v":0},null,{"$f":"D19-SUM(D10:D18)","v":0}]

{"sheet":"Water levy","index":15,"n_rows":21,"n_cols":3,"rows_kept":21,"cut":false,"hidden":false,"merged":[]}
["Wellington Regional Council"]
[{"$f":"\"Water supply levy \"&year_current","v":"Water supply levy 2018/19"}]
["Printed :",{"$f":"NOW()","v":"2018-11-12T16:52:19.590"}]
[{"$f":"check_total","v":0}]
[]
[null,"Share","Bulk Water Levies"]
[null,"%","$"]
[]
["By TA"]
["Wellington city",{"$f":"INDEX(Control!$B$179:$B$187,MATCH(A10,Control!$A$179:$A$187,0),)","v":0.53514217498266803},{"$f":"B10*$C$19","v":17696562.021485113}]
["Hutt city",{"$f":"INDEX(Control!$B$179:$B$187,MATCH(A11,Control!$A$179:$A$187,0),)","v":0.24815885911892197},8206340.0099631855]
["Upper Hutt city",{"$f":"INDEX(Control!$B$179:$B$187,MATCH(A12,Control!$A$179:$A$187,0),)","v":0.10032287740583312},3317567.0040278048]
["Porirua city",{"$f":"INDEX(Control!$B$179:$B$187,MATCH(A13,Control!$A$179:$A$187,0),)","v":0.11637608849257693},{"$f":"B13*$C$19","v":3848429.0046723154}]
["Kāpiti Coast district",{"$f":"INDEX(Control!$B$179:$B$187,MATCH(A14,Control!$A$179:$A$187,0),)","v":0},0]
["Masterton district",{"$f":"INDEX(Control!$B$179:$B$187,MATCH(A15,Control!$A$179:$A$187,0),)","v":0},0]
["Carterton district",{"$f":"INDEX(Control!$B$179:$B$187,MATCH(A16,Control!$A$179:$A$187,0),)","v":0},0]
["South Wairarapa district",{"$f":"INDEX(Control!$B$179:$B$187,MATCH(A17,Control!$A$179:$A$187,0),)","v":0},0]
["Tararua district",{"$f":"INDEX(Control!$B$179:$B$187,MATCH(A18,Control!$A$179:$A$187,0),)","v":0},{"$f":"B18*$C$19","v":0}]
["Region wide",{"$f":"SUM(B10:B18)","v":1},{"$f":"INDEX(ess_base_estract,MATCH(C6,ESSbase!$B$8:$B$25,0),MATCH(year_current,ESSbase!$F$6:$G$6,0))","v":33068898.040148415}]
[]
["Checks",{"$f":"1-B19","v":0},{"$f":"C19-SUM(C10:C18)","v":0}]

{"sheet":">>Output tabs","index":16,"n_rows":0,"n_cols":0,"rows_kept":0,"cut":false,"hidden":false,"merged":[]}

{"sheet":"Comparison - TA","index":17,"n_rows":70,"n_cols":13,"rows_kept":70,"cut":false,"hidden":false,"merged":[[27,1,27,11],[4,1,4,11],[50,1,50,11],[4,0,5,0],[27,0,28,0],[50,0,51,0]]}
["Comparison of proposed vs current"]
[{"$f":"check_total","v":0}]
[]
[{"$f":"year_previous&\" rates\"","v":"2017/18 rates"}]
[null,"TA"]
[null,"Wellington city","Hutt city","Upper Hutt city","Porirua city","Kāpiti Coast district","Masterton District","Carterton District","South Wairarapa District","Tararua District","Other","Region wide"]
["General rate",21189528.406917833,7179456.0529976618,2718137.0908558238,3367756.6064207805,4329462.3984503523,1675353.2248983532,774173.16904683737,1245449.1280744334,2354.4428815298133,0,{"$f":"INDEX(ess_base_estract,MATCH(A7,ESSbase!$B$8:$B$25,0),MATCH(year_previous,ESSbase!$F$6:$G$6,0))","v":42481670.520543598},{"$f":"ROUND(L7-SUM(B7:K7),-1)","v":0}]
["Remission of rates",0,0,0,0,0,0,0,0,0,0,{"$f":"INDEX(ess_base_estract,MATCH(A8,ESSbase!$B$8:$B$25,0),MATCH(year_previous,ESSbase!$F$6:$G$6,0))","v":0},{"$f":"ROUND(L8-SUM(B8:K8),-1)","v":0}]
["Public transport rate",38457358.003260493,11536013.198820936,4596383.5624092557,6066071.2474005194,3090620.0871701711,306748.56603071187,198788.91360953596,404412.54842927179,0,0,{"$f":"INDEX(ess_base_estract,MATCH(A9,ESSbase!$B$8:$B$25,0),MATCH(year_previous,ESSbase!$F$6:$G$6,0))","v":64656396.127130903},0]
["River management rate",43255,3685586,678045,28308,1368226,0,23240,0,0,0,{"$f":"INDEX(ess_base_estract,MATCH(A10,ESSbase!$B$8:$B$25,0),MATCH(year_previous,ESSbase!$F$6:$G$6,0))","v":5826660.417418221},{"$f":"ROUND(L10-SUM(B10:K10),-1)","v":0}]
["Stadium purposes rate",580986,190924,51447,70226,47340,19562,6846,10760,0,0,{"$f":"INDEX(ess_base_estract,MATCH(A11,ESSbase!$B$8:$B$25,0),MATCH(year_previous,ESSbase!$F$6:$G$6,0))","v":978091.35},0]
["Wellington regional strategy rate",2299850.9726340426,862252.31806421571,343198.01081979473,354526.17078167095,491419.64592721401,241562.29325001914,90904.663577743515,138051.14376879905,252,0,{"$f":"INDEX(ess_base_estract,MATCH(A12,ESSbase!$B$8:$B$25,0),MATCH(year_previous,ESSbase!$F$6:$G$6,0))","v":4822017.2188234972},0]
["District-Wide Rates",{"$f":"SUM(B7:B12)","v":62570978.382812366},23454231.569882814,8387210.6640848741,9886888.0246029701,9327068.131547736,2243226.0841790843,1093952.7462341168,1798672.8202725044,2606.4428815298133,0,{"$f":"INDEX(ess_base_estract,MATCH(A13,ESSbase!$B$8:$B$25,0),MATCH(year_previous,ESSbase!$F$6:$G$6,0))","v":118764835.63391621},{"$f":"ROUND(L13-SUM(B13:K13),-1)","v":0}]
["Rates Penalties",0,0,0,0,0,0,0,0,0,0,{"$f":"INDEX(ess_base_estract,MATCH(A14,ESSbase!$B$8:$B$25,0),MATCH(year_previous,ESSbase!$F$6:$G$6,0))","v":0},0]
["Remission of Rates Penalties",0,0,0,0,0,0,0,0,0,0,{"$f":"INDEX(ess_base_estract,MATCH(A15,ESSbase!$B$8:$B$25,0),MATCH(year_previous,ESSbase!$F$6:$G$6,0))","v":0},0]
["Pest management rate",26190.392757922371,11980.441591041395,41780.203397771729,9119.5324423269267,22461.211910212649,159355.51164393779,60068.378325866543,136962.28562505482,4082.0423058657721,0,{"$f":"INDEX(ess_base_estract,MATCH(A16,ESSbase!$B$8:$B$25,0),MATCH(year_previous,ESSbase!$F$6:$G$6,0))","v":472000},{"$f":"ROUND(L16-SUM(B16:K16),-1)","v":0}]
["River management rate - Non district wide",0,0,0,0,0,0,0,93297,0,0,{"$f":"INDEX(ess_base_estract,MATCH(A17,ESSbase!$B$8:$B$25,0),MATCH(year_previous,ESSbase!$F$6:$G$6,0))","v":93297.36},0]
["Special rates",0,0,0,0,0,0,0,0,0,1451758,{"$f":"INDEX(ess_base_estract,MATCH(A18,ESSbase!$B$8:$B$25,0),MATCH(year_previous,ESSbase!$F$6:$G$6,0))","v":1451756.1159999999},0]
["Total Other Rates",{"$f":"SUM(B14:B18)","v":26190.392757922371},11980.441591041395,41780.203397771729,9119.5324423269267,22461.211910212649,159355.51164393779,60068.378325866543,230259.28562505482,4082.0423058657721,1451758,{"$f":"INDEX(ess_base_estract,MATCH(A19,ESSbase!$B$8:$B$25,0),MATCH(year_previous,ESSbase!$F$6:$G$6,0))","v":2017053.4759999998},0]
["Total Regnl Rates",{"$f":"SUM(B19,B13)","v":62597168.775570288},23466212.011473857,8428990.8674826454,9896007.5570452977,9349529.3434579484,2402581.5958230221,1154021.1245599834,2028932.1058975591,6688.4851873955849,1451758,{"$f":"INDEX(ess_base_estract,MATCH(A20,ESSbase!$B$8:$B$25,0),MATCH(year_previous,ESSbase!$F$6:$G$6,0))","v":120781889.10991621},0]
["Bulk Water Levies",16514665.785679923,7660138.3816216718,3095535.3733950593,3592425.8969410262,0,0,0,0,0,0,{"$f":"INDEX(ess_base_estract,MATCH(A21,ESSbase!$B$8:$B$25,0),MATCH(year_previous,ESSbase!$F$6:$G$6,0))","v":30862765.437637679},0]
["Total Regnl Rates & levies",{"$f":"SUM(B20:B21)","v":79111834.56125021},{"$f":"SUM(C20:C21)","v":31126350.393095531},11524526.240877705,13488433.453986324,9349529.3434579484,2402581.5958230221,1154021.1245599834,2028932.1058975591,6688.4851873955849,1451758,{"$f":"INDEX(ess_base_estract,MATCH(A22,ESSbase!$B$8:$B$25,0),MATCH(year_previous,ESSbase!$F$6:$G$6,0))","v":151644654.5475539},0]
["Warm Greater Wellington rate",null,null,null,null,null,null,null,null,null,3181767.0725559997,{"$f":"INDEX(ess_base_estract,MATCH(A23,ESSbase!$B$8:$B$25,0),MATCH(year_previous,ESSbase!$F$6:$G$6,0))","v":3181767},0]
["Total Rates & Levies",{"$f":"SUM(B22:B23)","v":79111834.56125021},31126350.393095531,11524526.240877705,13488433.453986324,9349529.3434579484,2402581.5958230221,1154021.1245599834,2028932.1058975591,6688.4851873955849,4633525.0725560002,{"$f":"INDEX(ess_base_estract,MATCH(A24,ESSbase!$B$8:$B$25,0),MATCH(year_previous,ESSbase!$F$6:$G$6,0))","v":154826421.5475539},0]
[]
[]
[{"$f":"year_current&\" rates\"","v":"2018/19 rates"}]
[null,"TA"]
[null,"Wellington city","Hutt city","Upper Hutt city","Porirua city","Kāpiti Coast district","Masterton District","Carterton District","South Wairarapa District","Tararua District","Other","Region wide"]
["General rate",{"$f":"IFERROR(INDEX(Gen!$D$10:$D$18,MATCH(B$29,Gen!$A$10:$A$18,0),),0)","v":23048092.376524467},{"$f":"IFERROR(INDEX(Gen!$D$10:$D$18,MATCH(C$29,Gen!$A$10:$A$18,0),),0)","v":8059093.3870078828},{"$f":"IFERROR(INDEX(Gen!$D$10:$D$18,MATCH(D$29,Gen!$A$10:$A$18,0),),0)","v":3064993.2456397233},{"$f":"IFERROR(INDEX(Gen!$D$10:$D$18,MATCH(E$29,Gen!$A$10:$A$18,0),),0)","v":3819282.5884013595},{"$f":"IFERROR(INDEX(Gen!$D$10:$D$18,MATCH(F$29,Gen!$A$10:$A$18,0),),0)","v":4904933.1921061305},{"$f":"IFERROR(INDEX(Gen!$D$10:$D$18,MATCH(G$29,Gen!$A$10:$A$18,0),),0)","v":1968728.2422683882},{"$f":"IFERROR(INDEX(Gen!$D$10:$D$18,MATCH(H$29,Gen!$A$10:$A$18,0),),0)","v":907437.02995516302},{"$f":"IFERROR(INDEX(Gen!$D$10:$D$18,MATCH(I$29,Gen!$A$10:$A$18,0),),0)","v":1508400.8206117172},{"$f":"IFERROR(INDEX(Gen!$D$10:$D$18,MATCH(J$29,Gen!$A$10:$A$18,0),),0)","v":2353.0246429774902},{"$f":"IFERROR(INDEX(Gen!$D$10:$D$18,MATCH(K$29,Gen!$A$10:$A$18,0),),0)","v":0},{"$f":"INDEX(ess_base_estract,MATCH(A30,ESSbase!$B$8:$B$25,0),MATCH(year_current,ESSbase!$F$6:$G$6,0))","v":47283313.907157809},{"$f":"ROUND(L30-SUM(B30:K30),-1)","v":0}]
["Remission of rates",0,0,0,0,0,0,0,0,0,0,{"$f":"INDEX(ess_base_estract,MATCH(A31,ESSbase!$B$8:$B$25,0),MATCH(year_current,ESSbase!$F$6:$G$6,0))","v":0},0]
["Public transport rate",{"$f":"IFERROR(INDEX('Public transport'!$I$10:$I$18,MATCH(B$29,'Public transport'!$A$10:$A$18,0),),0)","v":40924832.407689974},{"$f":"IFERROR(INDEX('Public transport'!$I$10:$I$18,MATCH(C$29,'Public transport'!$A$10:$A$18,0),),0)","v":11715213.077808907},{"$f":"IFERROR(INDEX('Public transport'!$I$10:$I$18,MATCH(D$29,'Public transport'!$A$10:$A$18,0),),0)","v":4597306.1914495202},{"$f":"IFERROR(INDEX('Public transport'!$I$10:$I$18,MATCH(E$29,'Public transport'!$A$10:$A$18,0),),0)","v":6086081.3056548676},{"$f":"IFERROR(INDEX('Public transport'!$I$10:$I$18,MATCH(F$29,'Public transport'!$A$10:$A$18,0),),0)","v":3594210.5446725246},{"$f":"IFERROR(INDEX('Public transport'!$I$10:$I$18,MATCH(G$29,'Public transport'!$A$10:$A$18,0),),0)","v":437393.59292990481},{"$f":"IFERROR(INDEX('Public transport'!$I$10:$I$18,MATCH(H$29,'Public transport'!$A$10:$A$18,0),),0)","v":249139.42310300161},{"$f":"IFERROR(INDEX('Public transport'!$I$10:$I$18,MATCH(I$29,'Public transport'!$A$10:$A$18,0),),0)","v":505501.25032055634},{"$f":"IFERROR(INDEX('Public transport'!$I$10:$I$18,MATCH(J$29,'Public transport'!$A$10:$A$18,0),),0)","v":0},{"$f":"IFERROR(INDEX('Public transport'!$I$10:$I$18,MATCH(K$29,'Public transport'!$A$10:$A$18,0),),0)","v":0},{"$f":"INDEX(ess_base_estract,MATCH(A32,ESSbase!$B$8:$B$25,0),MATCH(year_current,ESSbase!$F$6:$G$6,0))","v":68109677.793629244},0]
["River management rate",{"$f":"IFERROR(INDEX('River management'!$C$10:$C$18,MATCH(B$29,'River management'!$A$10:$A$18,0),),0)","v":42679},{"$f":"IFERROR(INDEX('River management'!$C$10:$C$18,MATCH(C$29,'River management'!$A$10:$A$18,0),),0)","v":4356562},{"$f":"IFERROR(INDEX('River management'!$C$10:$C$18,MATCH(D$29,'River management'!$A$10:$A$18,0),),0)","v":667062},{"$f":"IFERROR(INDEX('River management'!$C$10:$C$18,MATCH(E$29,'River management'!$A$10:$A$18,0),),0)","v":33588},{"$f":"IFERROR(INDEX('River management'!$C$10:$C$18,MATCH(F$29,'River management'!$A$10:$A$18,0),),0)","v":1335375},{"$f":"IFERROR(INDEX('River management'!$C$10:$C$18,MATCH(G$29,'River management'!$A$10:$A$18,0),),0)","v":0},{"$f":"IFERROR(INDEX('River management'!$C$10:$C$18,MATCH(H$29,'River management'!$A$10:$A$18,0),),0)","v":23705},{"$f":"IFERROR(INDEX('River management'!$C$10:$C$18,MATCH(I$29,'River management'!$A$10:$A$18,0),),0)","v":0},{"$f":"IFERROR(INDEX('River management'!$C$10:$C$18,MATCH(J$29,'River management'!$A$10:$A$18,0),),0)","v":0},{"$f":"IFERROR(INDEX('River management'!$C$10:$C$18,MATCH(K$29,'River management'!$A$10:$A$18,0),),0)","v":0},{"$f":"INDEX(ess_base_estract,MATCH(A33,ESSbase!$B$8:$B$25,0),MATCH(year_current,ESSbase!$F$6:$G$6,0))","v":6458970.8070691349},0]
["Stadium purposes rate",{"$f":"IFERROR(INDEX(Stadium!$G$10:$G$18,MATCH(B$29,Stadium!$A$10:$A$18,0),),0)","v":0},{"$f":"IFERROR(INDEX(Stadium!$G$10:$G$18,MATCH(C$29,Stadium!$A$10:$A$18,0),),0)","v":0},{"$f":"IFERROR(INDEX(Stadium!$G$10:$G$18,MATCH(D$29,Stadium!$A$10:$A$18,0),),0)","v":0},{"$f":"IFERROR(INDEX(Stadium!$G$10:$G$18,MATCH(E$29,Stadium!$A$10:$A$18,0),),0)","v":0},{"$f":"IFERROR(INDEX(Stadium!$G$10:$G$18,MATCH(F$29,Stadium!$A$10:$A$18,0),),0)","v":0},{"$f":"IFERROR(INDEX(Stadium!$G$10:$G$18,MATCH(G$29,Stadium!$A$10:$A$18,0),),0)","v":0},{"$f":"IFERROR(INDEX(Stadium!$G$10:$G$18,MATCH(H$29,Stadium!$A$10:$A$18,0),),0)","v":0},{"$f":"IFERROR(INDEX(Stadium!$G$10:$G$18,MATCH(I$29,Stadium!$A$10:$A$18,0),),0)","v":0},{"$f":"IFERROR(INDEX(Stadium!$G$10:$G$18,MATCH(J$29,Stadium!$A$10:$A$18,0),),0)","v":0},{"$f":"IFERROR(INDEX(Stadium!$G$10:$G$18,MATCH(K$29,Stadium!$A$10:$A$18,0),),0)","v":0},{"$f":"INDEX(ess_base_estract,MATCH(A34,ESSbase!$B$8:$B$25,0),MATCH(year_current,ESSbase!$F$6:$G$6,0))","v":0},0]
["Wellington regional strategy rate",{"$f":"IFERROR(INDEX(WRS!$K$10:$K$18,MATCH(B$29,WRS!$A$10:$A$18,0),),0)","v":2351472.4227200211},{"$f":"IFERROR(INDEX(WRS!$K$10:$K$18,MATCH(C$29,WRS!$A$10:$A$18,0),),0)","v":883091.45795915532},{"$f":"IFERROR(INDEX(WRS!$K$10:$K$18,MATCH(D$29,WRS!$A$10:$A$18,0),),0)","v":351106.94463605288},{"$f":"IFERROR(INDEX(WRS!$K$10:$K$18,MATCH(E$29,WRS!$A$10:$A$18,0),),0)","v":362532.20642395876},{"$f":"IFERROR(INDEX(WRS!$K$10:$K$18,MATCH(F$29,WRS!$A$10:$A$18,0),),0)","v":485529.92728148983},{"$f":"IFERROR(INDEX(WRS!$K$10:$K$18,MATCH(G$29,WRS!$A$10:$A$18,0),),0)","v":243887.58058216906},{"$f":"IFERROR(INDEX(WRS!$K$10:$K$18,MATCH(H$29,WRS!$A$10:$A$18,0),),0)","v":90214.335422871896},{"$f":"IFERROR(INDEX(WRS!$K$10:$K$18,MATCH(I$29,WRS!$A$10:$A$18,0),),0)","v":139773.94584747485},{"$f":"IFERROR(INDEX(WRS!$K$10:$K$18,MATCH(J$29,WRS!$A$10:$A$18,0),),0)","v":252},{"$f":"IFERROR(INDEX(WRS!$K$10:$K$18,MATCH(K$29,WRS!$A$10:$A$18,0),),0)","v":0},{"$f":"INDEX(ess_base_estract,MATCH(A35,ESSbase!$B$8:$B$25,0),MATCH(year_current,ESSbase!$F$6:$G$6,0))","v":4907860.8208731934},0]
["District-Wide Rates",{"$f":"SUM(B30:B35)","v":66367076.20693446},25013959.922775947,8680468.3817252964,10301484.100480186,10320048.664060144,2650009.4157804619,1270495.7884810364,2153676.0167797483,2605.0246429774902,0,{"$f":"INDEX(ess_base_estract,MATCH(A36,ESSbase!$B$8:$B$25,0),MATCH(year_current,ESSbase!$F$6:$G$6,0))","v":126759823.32872939},0]
["Rates Penalties",0,0,0,0,0,0,0,0,0,0,{"$f":"INDEX(ess_base_estract,MATCH(A37,ESSbase!$B$8:$B$25,0),MATCH(year_current,ESSbase!$F$6:$G$6,0))","v":0},0]
["Remission of Rates Penalties",0,0,0,0,0,0,0,0,0,0,{"$f":"INDEX(ess_base_estract,MATCH(A38,ESSbase!$B$8:$B$25,0),MATCH(year_current,ESSbase!$F$6:$G$6,0))","v":0},0]
["Pest management rate",{"$f":"IFERROR(INDEX(Pest!$D$10:$D$18,MATCH(B$29,Pest!$A$10:$A$18,0),),0)","v":29519.679972912501},{"$f":"IFERROR(INDEX(Pest!$D$10:$D$18,MATCH(C$29,Pest!$A$10:$A$18,0),),0)","v":13503.379081428011},{"$f":"IFERROR(INDEX(Pest!$D$10:$D$18,MATCH(D$29,Pest!$A$10:$A$18,0),),0)","v":47091.246202573217},{"$f":"IFERROR(INDEX(Pest!$D$10:$D$18,MATCH(E$29,Pest!$A$10:$A$18,0),),0)","v":10278.795040927806},{"$f":"IFERROR(INDEX(Pest!$D$10:$D$18,MATCH(F$29,Pest!$A$10:$A$18,0),),0)","v":25316.450712358321},{"$f":"IFERROR(INDEX(Pest!$D$10:$D$18,MATCH(G$29,Pest!$A$10:$A$18,0),),0)","v":179612.56820884513},{"$f":"IFERROR(INDEX(Pest!$D$10:$D$18,MATCH(H$29,Pest!$A$10:$A$18,0),),0)","v":67704.189130002109},{"$f":"IFERROR(INDEX(Pest!$D$10:$D$18,MATCH(I$29,Pest!$A$10:$A$18,0),),0)","v":154372.74566213804},{"$f":"IFERROR(INDEX(Pest!$D$10:$D$18,MATCH(J$29,Pest!$A$10:$A$18,0),),0)","v":4600.9459888148103},{"$f":"IFERROR(INDEX(Pest!$D$10:$D$18,MATCH(K$29,Pest!$A$10:$A$18,0),),0)","v":0},{"$f":"INDEX(ess_base_estract,MATCH(A39,ESSbase!$B$8:$B$25,0),MATCH(year_current,ESSbase!$F$6:$G$6,0))","v":532000},0]
["River management rate - Non district wide",0,0,0,0,0,0,0,{"$f":"'River management'!C31","v":95164},0,0,{"$f":"INDEX(ess_base_estract,MATCH(A40,ESSbase!$B$8:$B$25,0),MATCH(year_current,ESSbase!$F$6:$G$6,0))","v":95164},0]
["Special Rates",0,0,0,0,0,0,0,0,0,{"$f":"'Class Rates'!B140","v":1487363},{"$f":"INDEX(ess_base_estract,MATCH(A41,ESSbase!$B$8:$B$25,0),MATCH(year_current,ESSbase!$F$6:$G$6,0))","v":1487363},0]
["Total Other Rates",{"$f":"SUM(B37:B41)","v":29519.679972912501},13503.379081428011,47091.246202573217,10278.795040927806,25316.450712358321,179612.56820884513,67704.189130002109,249536.74566213804,4600.9459888148103,1487363,{"$f":"INDEX(ess_base_estract,MATCH(A42,ESSbase!$B$8:$B$25,0),MATCH(year_current,ESSbase!$F$6:$G$6,0))","v":2114527},0]
["Total Regnl Rates",{"$f":"SUM(B42,B36)","v":66396595.886907369},25027463.301857375,8727559.6279278696,10311762.895521114,10345365.114772502,2829621.9839893072,1338199.9776110386,2403212.7624418861,7205.970631792301,1487363,{"$f":"INDEX(ess_base_estract,MATCH(A43,ESSbase!$B$8:$B$25,0),MATCH(year_current,ESSbase!$F$6:$G$6,0))","v":128874350.32872939},0]
["Bulk Water Levies",{"$f":"IFERROR(INDEX('Water levy'!$C$10:$C$18,MATCH('Comparison - TA'!B29,'Water levy'!$A$10:$A$18,0),),0)","v":17696562.021485113},{"$f":"IFERROR(INDEX('Water levy'!$C$10:$C$18,MATCH('Comparison - TA'!C29,'Water levy'!$A$10:$A$18,0),),0)","v":8206340.0099631855},{"$f":"IFERROR(INDEX('Water levy'!$C$10:$C$18,MATCH('Comparison - TA'!D29,'Water levy'!$A$10:$A$18,0),),0)","v":3317567.0040278048},{"$f":"IFERROR(INDEX('Water levy'!$C$10:$C$18,MATCH('Comparison - TA'!E29,'Water levy'!$A$10:$A$18,0),),0)","v":3848429.0046723154},{"$f":"IFERROR(INDEX('Water levy'!$C$10:$C$18,MATCH('Comparison - TA'!F29,'Water levy'!$A$10:$A$18,0),),0)","v":0},{"$f":"IFERROR(INDEX('Water levy'!$C$10:$C$18,MATCH('Comparison - TA'!G29,'Water levy'!$A$10:$A$18,0),),0)","v":0},{"$f":"IFERROR(INDEX('Water levy'!$C$10:$C$18,MATCH('Comparison - TA'!H29,'Water levy'!$A$10:$A$18,0),),0)","v":0},{"$f":"IFERROR(INDEX('Water levy'!$C$10:$C$18,MATCH('Comparison - TA'!I29,'Water levy'!$A$10:$A$18,0),),0)","v":0},{"$f":"IFERROR(INDEX('Water levy'!$C$10:$C$18,MATCH('Comparison - TA'!J29,'Water levy'!$A$10:$A$18,0),),0)","v":0},{"$f":"IFERROR(INDEX('Water levy'!$C$10:$C$18,MATCH('Comparison - TA'!K29,'Water levy'!$A$10:$A$18,0),),0)","v":0},{"$f":"INDEX(ess_base_estract,MATCH(A44,ESSbase!$B$8:$B$25,0),MATCH(year_current,ESSbase!$F$6:$G$6,0))","v":33068898.040148415},{"$f":"ROUND(L44-SUM(B44:K44),-1)","v":0}]
["Total Regnl Rates & levies",{"$f":"SUM(B43:B44)","v":84093157.908392489},{"$f":"SUM(C43:C44)","v":33233803.311820559},{"$f":"SUM(D43:D44)","v":12045126.631955674},{"$f":"SUM(E43:E44)","v":14160191.900193429},{"$f":"SUM(F43:F44)","v":10345365.114772502},{"$f":"SUM(G43:G44)","v":2829621.9839893072},{"$f":"SUM(H43:H44)","v":1338199.9776110386},{"$f":"SUM(I43:I44)","v":2403212.7624418861},{"$f":"SUM(J43:J44)","v":7205.970631792301},{"$f":"SUM(K43:K44)","v":1487363},{"$f":"INDEX(ess_base_estract,MATCH(A45,ESSbase!$B$8:$B$25,0),MATCH(year_current,ESSbase!$F$6:$G$6,0))","v":161943248.3688778},0]
["Warm Greater Wellington rate",null,null,null,null,null,null,null,null,null,{"$f":"L46","v":3237058},{"$f":"INDEX(ess_base_estract,MATCH(A46,ESSbase!$B$8:$B$25,0),MATCH(year_current,ESSbase!$F$6:$G$6,0))","v":3237058},0]
["Total Rates & Levies",{"$f":"SUM(B45:B46)","v":84093157.908392489},{"$f":"SUM(C45:C46)","v":33233803.311820559},12045126.631955674,14160191.900193429,10345365.114772502,2829621.9839893072,1338199.9776110386,2403212.7624418861,7205.970631792301,4724421,{"$f":"INDEX(ess_base_estract,MATCH(A47,ESSbase!$B$8:$B$25,0),MATCH(year_current,ESSbase!$F$6:$G$6,0))","v":165180306.3688778},0]
[]
[]
["Delta"]
[null,"TA"]
[null,"Wellington city","Hutt city","Upper Hutt city","Porirua city","Kāpiti Coast district","Masterton District","Carterton District","South Wairarapa District","Tararua District","Other","Region wide"]
["General rate",{"$f":"B30-B7","v":1858563.9696066342},879637.33401022106,346856.15478389943,451525.98198057897,575470.79365577828,293375.01737003494,133263.86090832565,262951.69253728376,-1.418238552323146,0,4801643.3866142109,{"$f":"ROUND(L53-SUM(B53:K53),-1)","v":0}]
["Remission of rates",{"$f":"B31-B8","v":0},0,0,0,0,0,0,0,0,0,0,0]
["Public transport rate",{"$f":"B32-B9","v":2467474.4044294804},179199.87898797169,922.62904026452452,20010.058254348114,503590.45750235347,130645.02689919295,50350.509493465652,101088.70189128455,0,0,3453281.6664983407,0]
["River management rate",{"$f":"B33-B10","v":-576},670976,-10983,5280,-32851,0,465,0,0,0,632310.38965091389,{"$f":"ROUND(L56-SUM(B56:K56),-1)","v":0}]
["Stadium purposes rate",{"$f":"B34-B11","v":-580986},-190924,-51447,-70226,-47340,-19562,-6846,-10760,0,0,-978091.35,{"$f":"ROUND(L57-SUM(B57:K57),-1)","v":0}]
["Wellington regional strategy rate",{"$f":"B35-B12","v":51621.450085978489},20839.13989493961,7908.9338162581553,8006.0356422878103,-5889.7186457241769,2325.287332149921,-690.32815487161861,1722.8020786757988,0,0,85843.602049696259,{"$f":"ROUND(L58-SUM(B58:K58),-1)","v":0}]
["District-Wide Rates",{"$f":"B36-B13","v":3796097.8241220936},1559728.3528931327,293257.71764042228,414596.07587721571,992980.53251240775,406783.33160137758,176543.04224691959,355003.19650724391,-1.418238552323146,0,7994987.694813177,0]
["Rates Penalties",{"$f":"B37-B14","v":0},0,0,0,0,0,0,0,0,0,0,0]
["Remission of Rates Penalties",{"$f":"B38-B15","v":0},0,0,0,0,0,0,0,0,0,0,0]
["Pest management rate",{"$f":"B39-B16","v":3329.2872149901305},1522.9374903866155,5311.0428048014874,1159.2625986008788,2855.2388021456718,20257.05656490734,7635.8108041355663,17410.46003708322,518.90368294903828,0,60000,0]
["River management rate - Non district wide",{"$f":"B40-B17","v":0},0,0,0,0,0,0,1867,0,0,1866.6399999999994,{"$f":"ROUND(L63-SUM(B63:K63),-1)","v":0}]
["Special Rates",{"$f":"B41-B18","v":0},0,0,0,0,0,0,0,0,35605,35606.884000000078,{"$f":"ROUND(L64-SUM(B64:K64),-1)","v":0}]
["Total Other Rates",{"$f":"B42-B19","v":3329.2872149901305},1522.9374903866155,5311.0428048014874,1159.2625986008788,2855.2388021456718,20257.05656490734,7635.8108041355663,19277.46003708322,518.90368294903828,35605,97473.524000000209,0]
["Total Regnl Rates",{"$f":"B43-B20","v":3799427.1113370806},1561251.2903835177,298568.76044522412,415755.33847581595,995835.77131455392,427040.38816628512,184178.85305105522,374280.65654432704,517.48544439671605,35605,8092461.2188131809,{"$f":"ROUND(L66-SUM(B66:K66),-1)","v":0}]
["Bulk Water Levies",{"$f":"B44-B21","v":1181896.2358051892},546201.62834151369,222031.63063274557,256003.10773128923,0,0,0,0,0,0,2206132.6025107354,0]
["Total Regnl Rates & levies",{"$f":"B45-B22","v":4981323.3471422791},2107452.9187250286,520600.39107796922,671758.44620710425,995835.77131455392,427040.38816628512,184178.85305105522,374280.65654432704,517.48544439671605,35605,10298593.821323901,{"$f":"ROUND(L68-SUM(B68:K68),-1)","v":0}]
["Warm Greater Wellington rate",{"$f":"B46-B23","v":0},0,0,0,0,0,0,0,0,55290.927444000263,55291,0]
["Total Rates & Levies",{"$f":"B47-B24","v":4981323.3471422791},2107452.9187250286,520600.39107796922,671758.44620710425,995835.77131455392,427040.38816628512,184178.85305105522,374280.65654432704,517.48544439671605,90895.927443999797,10353884.821323901,0]

{"sheet":"Comparison - Category","index":18,"n_rows":179,"n_cols":29,"rows_kept":179,"cut":false,"hidden":false,"merged":[[1,0,1,3],[5,23,5,28],[64,23,64,28],[123,23,123,28],[64,9,64,14],[64,16,64,21],[5,9,5,14],[5,16,5,21],[123,9,123,14],[123,16,123,21]]}
["Comparison of proposed vs current"]
[{"$f":"check_total","v":0}]
[]
[]
[{"$f":"year_previous&\" rates\"","v":"2017/18 rates"}]
[null,null,null,null,null,null,null,null,null,"Rates",null,null,null,null,null,null,"Rates for average property",null,null,null,null,null,null,"Cents/$ OR Regional Strategy Rate $/property"]
[{"$f":"Control!A$66","v":"TA full name"},{"$f":"Control!B$66","v":"Rating area"},{"$f":"Control!C$66","v":"Category group"},{"$f":"Control!D$66","v":"Concatenated  name"},null,"CV","CV Assessments","Average CV",null,"General rate","River management rate","Public transport rate","Stadium purposes rate","Wellington regional strategy rate","District-Wide rates",null,"General rate","River management rate","Public transport rate","Stadium purposes rate","Wellington regional strategy rate","District-Wide rates",null,"General rate","River management rate","Public transport rate","Stadium purposes rate","Wellington regional strategy rate","District-Wide rates"]
[]
["By TA"]
[{"$f":"Control!A42","v":"Wellington city"},null,{"$f":"Control!B42","v":"District wide"},{"$f":"Control!C42","v":"Wellington cityDistrict wide"},null,51319125451,76971,666733.25604448433,null,21189528.406917833,43255.424103945203,38457358.003260493,580986.26189999992,2299850.9726045812,62570979.068786852,null,{"$f":"J10/$F10*$H10","v":275.29236214831343},{"$f":"K10/$F10*$H10","v":0.56197040578848145},{"$f":"L10/$F10*$H10","v":499.63438182251099},{"$f":"M10/$F10*$H10","v":7.5481189266087219},{"$f":"N10/$F10*$H10","v":29.879447747912607},{"$f":"IF('Comparison - Category'!C10=\"Residential\",SUM(Q10:T10,Control!$B$103),IF('Comparison - Category'!C10=\"Rural\",SUM(Q10:T10,Control!$B$104),O10/$F10*$H10))","v":812.91628105113432}]
[{"$f":"Control!A43","v":"Hutt city"},null,{"$f":"Control!B43","v":"District wide"},{"$f":"Control!C43","v":"Hutt cityDistrict wide"},null,21170821500,39049,542160.40103459754,null,7179456.0529976618,3685586.3029764807,11536013.198820936,190923.43151999998,862252.31807783083,23454231.304392911,null,183.85761614888119,94.383628338151567,295.42403643680848,4.8893295992214902,22.08129063683656,{"$f":"IF('Comparison - Category'!C11=\"Residential\",SUM(Q11:T11,Control!$B$103),IF('Comparison - Category'!C11=\"Rural\",SUM(Q11:T11,Control!$B$104),O11/$F11*$H11))","v":600.63590115989939}]
[{"$f":"Control!A44","v":"Upper Hutt city"},null,{"$f":"Control!B44","v":"District wide"},{"$f":"Control!C44","v":"Upper Hutt cityDistrict wide"},null,8012247760,16570,483539.39408569701,null,2718137.0908558238,678045.43376824516,4596383.5624092557,51447.605009999999,343198.01082399383,8387211.7028673189,null,164.03965545297669,40.920062387944789,277.39188668734187,3.1048645147857572,20.712010309233182,{"$f":"IF('Comparison - Category'!C12=\"Residential\",SUM(Q12:T12,Control!$B$103),IF('Comparison - Category'!C12=\"Rural\",SUM(Q12:T12,Control!$B$104),O12/$F12*$H12))","v":506.16847935228236}]
[{"$f":"Control!A45","v":"Porirua city"},null,{"$f":"Control!B45","v":"District wide"},{"$f":"Control!C45","v":"Porirua cityDistrict wide"},null,10044595300,18514,542540.52608836559,null,3367756.6064207805,28307.679875423506,6066071.2474005194,70226.958930000008,354526.17078555212,9886888.6634122767,null,181.90324113755972,1.5289877862927248,327.64779342122284,3.7931813184617056,19.149085599306044,{"$f":"IF('Comparison - Category'!C13=\"Residential\",SUM(Q13:T13,Control!$B$103),IF('Comparison - Category'!C13=\"Rural\",SUM(Q13:T13,Control!$B$104),O13/$F13*$H13))","v":534.02228926284317}]
[{"$f":"Control!A46","v":"Kāpiti Coast district"},null,{"$f":"Control!B46","v":"District wide"},{"$f":"Control!C46","v":"Kāpiti Coast districtDistrict wide"},null,10974506450,24761,443217.41650175682,null,4329462.3984503523,1368225.7946305373,3090620.0871701711,47339.621339999991,491419.64593250601,9327067.5475235656,null,174.85006253585689,55.257291491883905,124.81806418037118,1.9118622567747665,19.846518554683009,{"$f":"IF('Comparison - Category'!C14=\"Residential\",SUM(Q14:T14,Control!$B$103),IF('Comparison - Category'!C14=\"Rural\",SUM(Q14:T14,Control!$B$104),O14/$F14*$H14))","v":376.68379901956973}]
[{"$f":"Control!A47","v":"Masterton district"},null,{"$f":"Control!B47","v":"District wide"},{"$f":"Control!C47","v":"Masterton districtDistrict wide"},null,4724008400,12296,384190.66363044892,null,1675353.2248983532,0,306748.56603071187,19561.826999999997,241562.29325144846,2243225.9111805134,null,136.2518888173677,0,24.947020659621977,1.5909098080676642,19.645599646344213,{"$f":"IF('Comparison - Category'!C15=\"Residential\",SUM(Q15:T15,Control!$B$103),IF('Comparison - Category'!C15=\"Rural\",SUM(Q15:T15,Control!$B$104),O15/$F15*$H15))","v":182.43541893140156}]
[{"$f":"Control!A48","v":"Carterton district"},null,{"$f":"Control!B48","v":"District wide"},{"$f":"Control!C48","v":"Carterton districtDistrict wide"},null,2188251200,4561,479774.43543082656,null,774173.16904683737,23239.68,198788.91360953596,6846.6394500000006,90904.663578091597,1093953.065684465,null,169.73759461671506,5.0953036614777458,43.584501997267253,1.5011268252576191,19.930862437643409,{"$f":"IF('Comparison - Category'!C16=\"Residential\",SUM(Q16:T16,Control!$B$103),IF('Comparison - Category'!C16=\"Rural\",SUM(Q16:T16,Control!$B$104),O16/$F16*$H16))","v":239.84938953836109}]
[{"$f":"Control!A49","v":"South Wairarapa district"},null,{"$f":"Control!B49","v":"District wide"},{"$f":"Control!C49","v":"South Wairarapa districtDistrict wide"},null,3612556200,6598,547522.91603516217,null,1245449.1280744334,0,404412.54842927179,10759.004849999999,138051.14376949321,1798671.8251231983,null,188.76161383365164,0,61.293202247540428,1.6306463852682629,20.923180322748287,{"$f":"IF('Comparison - Category'!C17=\"Residential\",SUM(Q17:T17,Control!$B$103),IF('Comparison - Category'!C17=\"Rural\",SUM(Q17:T17,Control!$B$104),O17/$F17*$H17))","v":272.6086427892086}]
[{"$f":"Control!A50","v":"Tararua district"},null,{"$f":"Control!B50","v":"District wide"},{"$f":"Control!C50","v":"Tararua districtDistrict wide"},null,6806000,12,567166.66666666663,null,2354.4428815298133,0,0,0,252,2606.4428815298133,null,196.20357346081778,0,0,0,20.999999999999996,{"$f":"IF('Comparison - Category'!C18=\"Residential\",SUM(Q18:T18,Control!$B$103),IF('Comparison - Category'!C18=\"Rural\",SUM(Q18:T18,Control!$B$104),O18/$F18*$H18))","v":217.20357346081778}]
[{"$f":"Control!A51","v":"Region wide"},null,{"$f":"Control!B51","v":0},{"$f":"Control!C51","v":"Region wide"},null,112052918261,199332,562142.14607288339,null,42481670.520543605,5826660.3153546322,64656396.127130903,978091.35,4822017.2188234972,118764835.53185262,null,213.120173983824,29.230932892634559,324.36536094119811,4.9068456143519352,24.190883645493432,{"$f":"IF('Comparison - Category'!C19=\"Residential\",SUM(Q19:T19,Control!$B$103),IF('Comparison - Category'!C19=\"Rural\",SUM(Q19:T19,Control!$B$104),O19/$F19*$H19))","v":595.81419707750183}]
[]
["By TA & Category"]
[{"$f":"Control!A67","v":"Wellington city"},{"$f":"Control!B67","v":"Wellington city"},{"$f":"Control!C67","v":"Regional CBD"},{"$f":"Control!D67","v":"Wellington cityRegional CBD"},null,7854191500,3401,2309377.094972067,null,3242974.474721483,6620.073536726286,25019166.072671905,135230.61302423512,865036.74131845124,29269027.975272797,null,{"$f":"J22/$F22*$H22","v":953.53557033857192},{"$f":"K22/$F22*$H22","v":1.9465079496401898},{"$f":"L22/$F22*$H22","v":7356.4146053137038},{"$f":"M22/$F22*$H22","v":39.762015002715415},{"$f":"IF('Comparison - Category'!C22=\"Residential\",Control!$B$103,IF('Comparison - Category'!C22=\"Rural\",Control!$B$104,N22/$F22*$H22))","v":254.34776281048258},{"$f":"IF('Comparison - Category'!C22=\"Residential\",SUM(Q22:T22,Control!$B$103),IF('Comparison - Category'!C22=\"Rural\",SUM(Q22:T22,Control!$B$104),O22/$F22*$H22))","v":8606.0064614151124},null,{"$f":"J22/$F22*100","v":4.1289730136086993E-2},{"$f":"K22/$F22*100","v":8.4287141925763908E-5},{"$f":"L22/$F22*100","v":0.31854540435730277},{"$f":"M22/$F22*100","v":1.7217636344139956E-3},{"$f":"IF(OR('Comparison - Category'!C22=\"Residential\",'Comparison - Category'!C22=\"Rural\"),U22,N22/$F22*100)","v":1.1013695570300918E-2},{"$f":"O22/$F22*100","v":0.3726548808400304}]
[{"$f":"Control!A68","v":"Wellington city"},{"$f":"Control!B68","v":"Wellington city"},{"$f":"Control!C68","v":"Business"},{"$f":"Control!D68","v":"Wellington cityBusiness"},null,3819755400,1907,2003018.0388044049,null,1577166.6965186102,3219.5626552150316,1192769.6658868904,65767.159400764853,420696.23128613003,3259619.3157476103,null,827.040742799481,1.6882866571657218,625.46914834131644,34.487236182886662,{"$f":"IF('Comparison - Category'!C23=\"Residential\",Control!$B$103,IF('Comparison - Category'!C23=\"Rural\",Control!$B$104,N23/$F23*$H23))","v":220.606309012129},{"$f":"IF('Comparison - Category'!C23=\"Residential\",SUM(Q23:T23,Control!$B$103),IF('Comparison - Category'!C23=\"Rural\",SUM(Q23:T23,Control!$B$104),O23/$F23*$H23))","v":1709.2917229929787},null,4.1289730136086993E-2,8.4287141925763921E-5,3.1226336269775033E-2,1.7217636344139956E-3,{"$f":"IF(OR('Comparison - Category'!C23=\"Residential\",'Comparison - Category'!C23=\"Rural\"),U23,N23/$F23*100)","v":1.1013695570300915E-2},8.5335812752502696E-2]
[{"$f":"Control!A69","v":"Wellington city"},{"$f":"Control!B69","v":"Wellington city"},{"$f":"Control!C69","v":"Residential"},{"$f":"Control!D69","v":"Wellington cityResidential"},null,39066389001,70889,551092.39798840438,null,16130406.59242687,32927.942742543899,12199001.997910665,377152.02455999999,992446,29731934.557640079,null,227.54456392990267,0.4645000316345822,172.08596535302607,5.3203180262099901,{"$f":"IF('Comparison - Category'!C24=\"Residential\",Control!$B$103,IF('Comparison - Category'!C24=\"Rural\",Control!$B$104,N24/$F24*$H24))","v":14},{"$f":"IF('Comparison - Category'!C24=\"Residential\",SUM(Q24:T24,Control!$B$103),IF('Comparison - Category'!C24=\"Rural\",SUM(Q24:T24,Control!$B$104),O24/$F24*$H24))","v":419.41534734077328},null,4.1289730136086993E-2,8.4287141925763921E-5,3.1226336269775026E-2,9.6541306786850935E-4,{"$f":"IF(OR('Comparison - Category'!C24=\"Residential\",'Comparison - Category'!C24=\"Rural\"),U24,N24/$F24*100)","v":14},7.6106175456551711E-2]
[{"$f":"Control!A70","v":"Wellington city"},{"$f":"Control!B70","v":"Wellington city"},{"$f":"Control!C70","v":"Rural"},{"$f":"Control!D70","v":"Wellington cityRural"},null,578789550,774,747790.1162790698,null,238980.64325087226,487.8451694599903,46420.266791032431,2836.4649149999996,21672,310397.22012636473,null,308.76052099595898,0.63029091661497461,59.974504897974725,3.6646833527131779,{"$f":"IF('Comparison - Category'!C25=\"Residential\",Control!$B$103,IF('Comparison - Category'!C25=\"Rural\",Control!$B$104,N25/$F25*$H25))","v":28},{"$f":"IF('Comparison - Category'!C25=\"Residential\",SUM(Q25:T25,Control!$B$103),IF('Comparison - Category'!C25=\"Rural\",SUM(Q25:T25,Control!$B$104),O25/$F25*$H25))","v":401.03000016326183},null,4.1289730136086986E-2,8.4287141925763908E-5,8.02023236097342E-3,4.9006843938353755E-4,{"$f":"IF(OR('Comparison - Category'!C25=\"Residential\",'Comparison - Category'!C25=\"Rural\"),U25,N25/$F25*100)","v":28},5.3628684230108289E-2]
[{"$f":"Control!A71","v":"Hutt city"},{"$f":"Control!B71","v":"Hutt city"},{"$f":"Control!C71","v":"Business"},{"$f":"Control!D71","v":"Hutt cityBusiness"},null,3796856000,2357,1610885.0233347476,null,1287591.0739486651,660987.12645487417,2092334.5898406077,49784.849714999997,343454.31807783077,4434151.9580369778,null,546.28386675802506,280.43577702794835,887.7108993808265,21.122125462452271,{"$f":"IF('Comparison - Category'!C26=\"Residential\",Control!$B$103,IF('Comparison - Category'!C26=\"Rural\",Control!$B$104,N26/$F26*$H26))","v":145.71672383446364},{"$f":"IF('Comparison - Category'!C26=\"Residential\",SUM(Q26:T26,Control!$B$103),IF('Comparison - Category'!C26=\"Rural\",SUM(Q26:T26,Control!$B$104),O26/$F26*$H26))","v":1881.2693924637156},null,3.391203337573679E-2,1.74088015572588E-2,5.5107030391476734E-2,1.3112124798780886E-3,{"$f":"IF(OR('Comparison - Category'!C26=\"Residential\",'Comparison - Category'!C26=\"Rural\"),U26,N26/$F26*100)","v":9.0457557009755111E-3},0.11678483350532592]
[{"$f":"Control!A72","v":"Hutt city"},{"$f":"Control!B72","v":"Hutt city"},{"$f":"Control!C72","v":"Residential"},{"$f":"Control!D72","v":"Hutt cityResidential"},null,17055925500,36202,471132.13358377991,null,5784011.1481008036,2969232.2240489009,9399014.0488326307,138888.97169999999,505078,18796224.392682336,null,159.77048638475233,82.018458208079693,259.62692803802634,3.8364999640903816,{"$f":"IF('Comparison - Category'!C27=\"Residential\",Control!$B$103,IF('Comparison - Category'!C27=\"Rural\",Control!$B$104,N27/$F27*$H27))","v":14},{"$f":"IF('Comparison - Category'!C27=\"Residential\",SUM(Q27:T27,Control!$B$103),IF('Comparison - Category'!C27=\"Rural\",SUM(Q27:T27,Control!$B$104),O27/$F27*$H27))","v":519.25237259494872},null,3.3912033375736797E-2,1.74088015572588E-2,5.5107030391476734E-2,8.1431507014966735E-4,{"$f":"IF(OR('Comparison - Category'!C27=\"Residential\",'Comparison - Category'!C27=\"Rural\"),U27,N27/$F27*100)","v":14},0.11020348554338101]
[{"$f":"Control!A73","v":"Hutt city"},{"$f":"Control!B73","v":"Hutt city"},{"$f":"Control!C73","v":"Rural"},{"$f":"Control!D73","v":"Hutt cityRural"},null,318040000,490,649061.22448979598,null,107853.83094819332,55366.952472705889,44664.560147696888,2249.6101049999997,13720,223854.95367359612,null,220.1098590779456,112.99378055654265,91.152163566728348,4.5910410306122449,{"$f":"IF('Comparison - Category'!C28=\"Residential\",Control!$B$103,IF('Comparison - Category'!C28=\"Rural\",Control!$B$104,N28/$F28*$H28))","v":28},{"$f":"IF('Comparison - Category'!C28=\"Residential\",SUM(Q28:T28,Control!$B$103),IF('Comparison - Category'!C28=\"Rural\",SUM(Q28:T28,Control!$B$104),O28/$F28*$H28))","v":456.84684423182881},null,3.3912033375736804E-2,1.74088015572588E-2,1.4043692663720566E-2,7.0733558829078102E-4,{"$f":"IF(OR('Comparison - Category'!C28=\"Residential\",'Comparison - Category'!C28=\"Rural\"),U28,N28/$F28*100)","v":28},7.0385785962016126E-2]
[{"$f":"Control!A74","v":"Upper Hutt city"},{"$f":"Control!B74","v":"Upper Hutt city"},{"$f":"Control!C74","v":"Business"},{"$f":"Control!D74","v":"Upper Hutt cityBusiness"},null,1170562500,722,1621277.7008310249,null,397110.70397739671,99060.161622528438,725473.26340738265,7726.9216650000008,105926.0108239938,1335297.0614963016,null,550.014825453458,137.20243992039948,1004.8106141376492,10.702107569252078,{"$f":"IF('Comparison - Category'!C29=\"Residential\",Control!$B$103,IF('Comparison - Category'!C29=\"Rural\",Control!$B$104,N29/$F29*$H29))","v":146.71192634902187},{"$f":"IF('Comparison - Category'!C29=\"Residential\",SUM(Q29:T29,Control!$B$103),IF('Comparison - Category'!C29=\"Rural\",SUM(Q29:T29,Control!$B$104),O29/$F29*$H29))","v":1849.4419134297805},null,3.3924775821658107E-2,8.4626119171362854E-3,6.197646545206964E-2,6.6010329777350637E-4,{"$f":"IF(OR('Comparison - Category'!C29=\"Residential\",'Comparison - Category'!C29=\"Rural\"),U29,N29/$F29*100)","v":9.0491546435148736E-3},0.11407311113215242]
[{"$f":"Control!A75","v":"Upper Hutt city"},{"$f":"Control!B75","v":"Upper Hutt city"},{"$f":"Control!C75","v":"Residential"},{"$f":"Control!D75","v":"Upper Hutt cityResidential"},null,6041952920,14604,413719.04409750755,null,2049718.9833601261,511307.02783568384,3744588.864094113,41764.500645,204288,6551667.3759349221,null,140.35325824158627,35.011437129258006,256.40844043372454,2.8597987294576828,{"$f":"IF('Comparison - Category'!C30=\"Residential\",Control!$B$103,IF('Comparison - Category'!C30=\"Rural\",Control!$B$104,N30/$F30*$H30))","v":14},{"$f":"IF('Comparison - Category'!C30=\"Residential\",SUM(Q30:T30,Control!$B$103),IF('Comparison - Category'!C30=\"Rural\",SUM(Q30:T30,Control!$B$104),O30/$F30*$H30))","v":448.6329345340265},null,3.3924775821658107E-2,8.4626119171362871E-3,6.197646545206964E-2,6.9124174249606701E-4,{"$f":"IF(OR('Comparison - Category'!C30=\"Residential\",'Comparison - Category'!C30=\"Rural\"),U30,N30/$F30*100)","v":14},0.10843625335523008]
[{"$f":"Control!A76","v":"Upper Hutt city"},{"$f":"Control!B76","v":"Upper Hutt city"},{"$f":"Control!C76","v":"Rural"},{"$f":"Control!D76","v":"Upper Hutt cityRural"},null,799732340,1244,642871.655948553,null,271307.40351830062,67678.244310032882,126321.43490776002,1956.1827000000001,32984,500247.2654360935,null,218.09276810152781,54.403733368193635,101.5445618229582,1.5724941318327974,{"$f":"IF('Comparison - Category'!C31=\"Residential\",Control!$B$103,IF('Comparison - Category'!C31=\"Rural\",Control!$B$104,N31/$F31*$H31))","v":28},{"$f":"IF('Comparison - Category'!C31=\"Residential\",SUM(Q31:T31,Control!$B$103),IF('Comparison - Category'!C31=\"Rural\",SUM(Q31:T31,Control!$B$104),O31/$F31*$H31))","v":403.61355742451246},null,3.3924775821658107E-2,8.4626119171362871E-3,1.5795464130881592E-2,2.4460467610950935E-4,{"$f":"IF(OR('Comparison - Category'!C31=\"Residential\",'Comparison - Category'!C31=\"Rural\"),U31,N31/$F31*100)","v":28},6.2551836460195354E-2]
[{"$f":"Control!A77","v":"Porirua city"},{"$f":"Control!B77","v":"Porirua city"},{"$f":"Control!C77","v":"Business"},{"$f":"Control!D77","v":"Porirua cityBusiness"},null,1094739500,796,1375300.8793969848,null,367044.77117507975,3085.1950115880913,691972.22117957263,12128.33274,97906.170785552094,1172136.6908917925,null,461.11152157673331,3.8758731301357927,869.31183565272943,15.236598919597988,{"$f":"IF('Comparison - Category'!C32=\"Residential\",Control!$B$103,IF('Comparison - Category'!C32=\"Rural\",Control!$B$104,N32/$F32*$H32))","v":122.9977019918996},{"$f":"IF('Comparison - Category'!C32=\"Residential\",SUM(Q32:T32,Control!$B$103),IF('Comparison - Category'!C32=\"Rural\",SUM(Q32:T32,Control!$B$104),O32/$F32*$H32))","v":1472.5335312710961},null,3.3528046733956318E-2,2.8182001394743604E-4,6.320884750934562E-2,1.1078738585754875E-3,{"$f":"IF(OR('Comparison - Category'!C32=\"Residential\",'Comparison - Category'!C32=\"Rural\"),U32,N32/$F32*100)","v":8.9433304256905048E-3},0.10706991854151536]
[{"$f":"Control!A78","v":"Porirua city"},{"$f":"Control!B78","v":"Porirua city"},{"$f":"Control!C78","v":"Residential"},{"$f":"Control!D78","v":"Porirua cityResidential"},null,8349049050,17106,488077.22728867066,null,2799273.0673249364,23529.291197188279,5277337.6824949672,56729.298300000002,239484,8396353.3393170908,null,163.64276086314374,1.3754993100191908,308.50799032473793,3.316339196773062,{"$f":"IF('Comparison - Category'!C33=\"Residential\",Control!$B$103,IF('Comparison - Category'!C33=\"Rural\",Control!$B$104,N33/$F33*$H33))","v":14},{"$f":"IF('Comparison - Category'!C33=\"Residential\",SUM(Q33:T33,Control!$B$103),IF('Comparison - Category'!C33=\"Rural\",SUM(Q33:T33,Control!$B$104),O33/$F33*$H33))","v":490.8425896946739},null,3.3528046733956325E-2,2.8182001394743604E-4,6.3208847509345592E-2,6.7947017630708498E-4,{"$f":"IF(OR('Comparison - Category'!C33=\"Residential\",'Comparison - Category'!C33=\"Rural\"),U33,N33/$F33*100)","v":14},0.10056658296093123]
[{"$f":"Control!A79","v":"Porirua city"},{"$f":"Control!B79","v":"Porirua city"},{"$f":"Control!C79","v":"Rural"},{"$f":"Control!D79","v":"Porirua cityRural"},null,600806750,612,981710.37581699342,null,201438.76792076413,1693.1936666471372,96761.343725979576,1369.32789,17136,318398.63320339087,null,329.14831359601982,2.7666563180508779,158.10677079408427,2.2374638725490197,{"$f":"IF('Comparison - Category'!C34=\"Residential\",Control!$B$103,IF('Comparison - Category'!C34=\"Rural\",Control!$B$104,N34/$F34*$H34))","v":28},{"$f":"IF('Comparison - Category'!C34=\"Residential\",SUM(Q34:T34,Control!$B$103),IF('Comparison - Category'!C34=\"Rural\",SUM(Q34:T34,Control!$B$104),O34/$F34*$H34))","v":520.25920458070402},null,3.3528046733956325E-2,2.8182001394743604E-4,1.6105235789374801E-2,2.2791486447181229E-4,{"$f":"IF(OR('Comparison - Category'!C34=\"Residential\",'Comparison - Category'!C34=\"Rural\"),U34,N34/$F34*100)","v":28},5.2995182428191907E-2]
[{"$f":"Control!A80","v":"Kāpiti Coast district"},{"$f":"Control!B80","v":"Kāpiti Coast district"},{"$f":"Control!C80","v":"Business"},{"$f":"Control!D80","v":"Kāpiti Coast districtBusiness"},null,1268607000,1389,913323.97408207343,null,500467.72763169743,158161.17367618496,403085.53282028827,5889.2255613069892,133495.64593250601,1201099.3056219837,null,360.3079392596814,113.8669356919978,290.19836776118666,4.2399032118840818,{"$f":"IF('Comparison - Category'!C35=\"Residential\",Control!$B$103,IF('Comparison - Category'!C35=\"Rural\",Control!$B$104,N35/$F35*$H35))","v":96.109176337297342},{"$f":"IF('Comparison - Category'!C35=\"Residential\",SUM(Q35:T35,Control!$B$103),IF('Comparison - Category'!C35=\"Rural\",SUM(Q35:T35,Control!$B$104),O35/$F35*$H35))","v":864.72232226204733},null,3.9450178631498758E-2,1.246731049696123E-2,3.1773869513591541E-2,4.642277365099664E-4,{"$f":"IF(OR('Comparison - Category'!C35=\"Residential\",'Comparison - Category'!C35=\"Rural\"),U35,N35/$F35*100)","v":1.0523010351709081E-2},9.4678596730270584E-2]
[{"$f":"Control!A81","v":"Kāpiti Coast district"},{"$f":"Control!B81","v":"Kāpiti Coast district excl Ōtaki "},{"$f":"Control!C81","v":"Residential"},{"$f":"Control!D81","v":"Kāpiti Coast district excl Ōtaki Residential"},null,7258515350,17518,414346.12113254936,null,2863497.2715697568,904941.64615409204,2306311.1959330132,33696.041513533462,241682,6350128.155170395,null,163.46028493947694,51.65781745371001,131.65379586328424,1.9235096194504775,{"$f":"IF('Comparison - Category'!C36=\"Residential\",Control!$B$103,IF('Comparison - Category'!C36=\"Rural\",Control!$B$104,N36/$F36*$H36))","v":14},{"$f":"IF('Comparison - Category'!C36=\"Residential\",SUM(Q36:T36,Control!$B$103),IF('Comparison - Category'!C36=\"Rural\",SUM(Q36:T36,Control!$B$104),O36/$F36*$H36))","v":362.69540787592172},null,3.9450178631498752E-2,1.2467310496961228E-2,3.1773869513591554E-2,4.642277365099664E-4,{"$f":"IF(OR('Comparison - Category'!C36=\"Residential\",'Comparison - Category'!C36=\"Rural\"),U36,N36/$F36*100)","v":14},8.748522044760014E-2]
[{"$f":"Control!A82","v":"Kāpiti Coast district"},{"$f":"Control!B82","v":"Ōtaki rating area"},{"$f":"Control!C82","v":"Residential"},{"$f":"Control!D82","v":"Ōtaki rating areaResidential"},null,764401000,3065,249396.73735725938,null,301557.55996096274,95300.246111876681,242879.77630058862,3548.5614601595444,42910,686196.14383358764,null,{"$f":"J37/$F37*$H37","v":98.387458388568589},{"$f":"K37/$F37*$H37","v":31.093065615620446},{"$f":"L37/$F37*$H37","v":79.24299389905012},{"$f":"M37/$F37*$H37","v":1.1577688287633097},{"$f":"IF('Comparison - Category'!C37=\"Residential\",Control!$B$103,IF('Comparison - Category'!C37=\"Rural\",Control!$B$104,N37/$F37*$H37))","v":14},{"$f":"IF('Comparison - Category'!C37=\"Residential\",SUM(Q37:T37,Control!$B$103),IF('Comparison - Category'!C37=\"Rural\",SUM(Q37:T37,Control!$B$104),O37/$F37*$H37))","v":223.88128673200248},null,{"$f":"J37/$F37*100","v":3.9450178631498745E-2},{"$f":"K37/$F37*100","v":1.2467310496961238E-2},{"$f":"L37/$F37*100","v":3.1773869513591506E-2},{"$f":"M37/$F37*100","v":4.6422773650996586E-4},{"$f":"IF(OR('Comparison - Category'!C37=\"Residential\",'Comparison - Category'!C37=\"Rural\"),U37,N37/$F37*100)","v":14},{"$f":"O37/$F37*100","v":8.9769132148386471E-2}]
[{"$f":"Control!A83","v":"Kāpiti Coast district"},{"$f":"Control!B83","v":"Kāpiti Coast district"},{"$f":"Control!C83","v":"Rural"},{"$f":"Control!D83","v":"Kāpiti Coast districtRural"},null,1682983100,2789,603436.0344209394,null,663939.83928793529,209822.72868838353,138343.58211628126,4205.792805,73332,1089643.9428976001,null,238.05659350589289,75.232244061808359,49.603292261126299,1.5079931176048764,{"$f":"IF('Comparison - Category'!C38=\"Residential\",Control!$B$103,IF('Comparison - Category'!C38=\"Rural\",Control!$B$104,N38/$F38*$H38))","v":28},{"$f":"IF('Comparison - Category'!C38=\"Residential\",SUM(Q38:T38,Control!$B$103),IF('Comparison - Category'!C38=\"Rural\",SUM(Q38:T38,Control!$B$104),O38/$F38*$H38))","v":392.40012294643242},null,3.9450178631498752E-2,1.246731049696123E-2,8.2201408984012535E-3,2.4990107179329371E-4,{"$f":"IF(OR('Comparison - Category'!C38=\"Residential\",'Comparison - Category'!C38=\"Rural\"),U38,N38/$F38*100)","v":28},6.4744794103850478E-2]
[{"$f":"Control!A84","v":"Masterton district"},{"$f":"Control!B84","v":"Masterton district"},{"$f":"Control!C84","v":"Business"},{"$f":"Control!D84","v":"Masterton districtBusiness"},null,381148600,546,698074.358974359,null,135173.03148222441,0,38506.176018556216,2325.988066294557,36056.293251448456,212061.48881852365,null,247.56965472934874,0,70.524131902117617,4.2600514034698849,{"$f":"IF('Comparison - Category'!C39=\"Residential\",Control!$B$103,IF('Comparison - Category'!C39=\"Rural\",Control!$B$104,N39/$F39*$H39))","v":66.037167127194977},{"$f":"IF('Comparison - Category'!C39=\"Residential\",SUM(Q39:T39,Control!$B$103),IF('Comparison - Category'!C39=\"Rural\",SUM(Q39:T39,Control!$B$104),O39/$F39*$H39))","v":388.39100516213119},null,3.5464653807523998E-2,0,1.0102667573370652E-2,6.1025753900042059E-4,{"$f":"IF(OR('Comparison - Category'!C39=\"Residential\",'Comparison - Category'!C39=\"Rural\"),U39,N39/$F39*100)","v":9.459904418236997E-3},5.5637483338132065E-2]
[{"$f":"Control!A85","v":"Masterton district"},{"$f":"Control!B85","v":"Masterton district"},{"$f":"Control!C85","v":"Residential"},{"$f":"Control!D85","v":"Masterton districtResidential"},null,1974896500,7842,251835.81994389187,null,700390.20678190805,0,199517.22831313196,12051.954778705442,109550,1021509.3898737455,null,89.31270170644072,0,25.442135719603666,1.5368470771111249,{"$f":"IF('Comparison - Category'!C40=\"Residential\",Control!$B$103,IF('Comparison - Category'!C40=\"Rural\",Control!$B$104,N40/$F40*$H40))","v":14},{"$f":"IF('Comparison - Category'!C40=\"Residential\",SUM(Q40:T40,Control!$B$103),IF('Comparison - Category'!C40=\"Rural\",SUM(Q40:T40,Control!$B$104),O40/$F40*$H40))","v":130.29168450315552},null,3.5464653807523991E-2,0,1.0102667573370652E-2,6.1025753900042059E-4,{"$f":"IF(OR('Comparison - Category'!C40=\"Residential\",'Comparison - Category'!C40=\"Rural\"),U40,N40/$F40*100)","v":14},5.1724705060429525E-2]
[{"$f":"Control!A86","v":"Masterton district"},{"$f":"Control!B86","v":"Masterton district"},{"$f":"Control!C86","v":"Rural"},{"$f":"Control!D86","v":"Masterton districtRural"},null,2367963300,3908,605927.1494370522,null,839789.9866342207,0,68725.161699023694,5183.8841549999997,95956,1009655.0324882444,null,214.88996587364909,0,17.585762973138099,1.3264800806038894,{"$f":"IF('Comparison - Category'!C41=\"Residential\",Control!$B$103,IF('Comparison - Category'!C41=\"Rural\",Control!$B$104,N41/$F41*$H41))","v":28},{"$f":"IF('Comparison - Category'!C41=\"Residential\",SUM(Q41:T41,Control!$B$103),IF('Comparison - Category'!C41=\"Rural\",SUM(Q41:T41,Control!$B$104),O41/$F41*$H41))","v":261.80220892739106},null,3.5464653807523991E-2,0,2.9022899847739908E-3,2.1891741966609027E-4,{"$f":"IF(OR('Comparison - Category'!C41=\"Residential\",'Comparison - Category'!C41=\"Rural\"),U41,N41/$F41*100)","v":28},4.2638119961075596E-2]
[{"$f":"Control!A87","v":"Carterton district"},{"$f":"Control!B87","v":"Carterton district"},{"$f":"Control!C87","v":"Business"},{"$f":"Control!D87","v":"Carterton districtBusiness"},null,93045500,225,413535.55555555556,null,32918.217799011152,988.16244014398353,16823.535173389577,506.46234923245612,8780.6635780915949,60017.04133986876,null,146.30319021782734,4.3918330673065942,74.771267437287008,2.2509437743664718,{"$f":"IF('Comparison - Category'!C42=\"Residential\",Control!$B$103,IF('Comparison - Category'!C42=\"Rural\",Control!$B$104,N42/$F42*$H42))","v":39.025171458184872},{"$f":"IF('Comparison - Category'!C42=\"Residential\",SUM(Q42:T42,Control!$B$103),IF('Comparison - Category'!C42=\"Rural\",SUM(Q42:T42,Control!$B$104),O42/$F42*$H42))","v":266.74240595497224},null,3.5378624220420277E-2,1.0620206674626753E-3,1.8080976697840923E-2,5.4431686565439071E-4,{"$f":"IF(OR('Comparison - Category'!C42=\"Residential\",'Comparison - Category'!C42=\"Rural\"),U42,N42/$F42*100)","v":9.4369567341694074E-3},6.4502895185547665E-2]
[{"$f":"Control!A88","v":"Carterton district"},{"$f":"Control!B88","v":"Carterton district"},{"$f":"Control!C88","v":"Residential"},{"$f":"Control!D88","v":"Carterton districtResidential"},null,607751500,2299,264354.71944323619,null,215014.11937896756,6454.4465368144201,109887.40709577865,3308.0939157675439,31080,365744.06692732818,null,93.525062800768836,2.8075017559001392,47.797915222174268,1.4389273230828812,{"$f":"IF('Comparison - Category'!C43=\"Residential\",Control!$B$103,IF('Comparison - Category'!C43=\"Rural\",Control!$B$104,N43/$F43*$H43))","v":14},{"$f":"IF('Comparison - Category'!C43=\"Residential\",SUM(Q43:T43,Control!$B$103),IF('Comparison - Category'!C43=\"Rural\",SUM(Q43:T43,Control!$B$104),O43/$F43*$H43))","v":159.56940710192612},null,3.5378624220420277E-2,1.0620206674626751E-3,1.8080976697840919E-2,5.4431686565439071E-4,{"$f":"IF(OR('Comparison - Category'!C43=\"Residential\",'Comparison - Category'!C43=\"Rural\"),U43,N43/$F43*100)","v":14},6.0179870708229957E-2]
[{"$f":"Control!A89","v":"Carterton district"},{"$f":"Control!B89","v":"Carterton district"},{"$f":"Control!C89","v":"Rural"},{"$f":"Control!D89","v":"Carterton districtRural"},null,1487454200,2037,730218.06578301429,null,526240.83186885866,15797.071023041597,72077.971340367745,3032.083185,51044,668191.95741726796,null,258.34110548299395,7.7550667761618062,35.384374737539396,1.4885042636229748,{"$f":"IF('Comparison - Category'!C44=\"Residential\",Control!$B$103,IF('Comparison - Category'!C44=\"Rural\",Control!$B$104,N44/$F44*$H44))","v":28},{"$f":"IF('Comparison - Category'!C44=\"Residential\",SUM(Q44:T44,Control!$B$103),IF('Comparison - Category'!C44=\"Rural\",SUM(Q44:T44,Control!$B$104),O44/$F44*$H44))","v":330.96905126031817},null,3.5378624220420277E-2,1.0620206674626753E-3,4.8457271047651585E-3,2.0384380137553141E-4,{"$f":"IF(OR('Comparison - Category'!C44=\"Residential\",'Comparison - Category'!C44=\"Rural\"),U44,N44/$F44*100)","v":28},4.4921850865543823E-2]
[{"$f":"Control!A90","v":"South Wairarapa district"},{"$f":"Control!B90","v":"South Wairarapa district"},{"$f":"Control!C90","v":"Business"},{"$f":"Control!D90","v":"South Wairarapa districtBusiness"},null,190419802,312,610319.87820512825,null,65648.300881521587,0,44332.499023699995,1243.6926154320026,17511.143769493217,128735.63629014679,null,210.41122077410768,0,142.09134302467947,3.9861942802307779,{"$f":"IF('Comparison - Category'!C45=\"Residential\",Control!$B$103,IF('Comparison - Category'!C45=\"Rural\",Control!$B$104,N45/$F45*$H45))","v":56.125460799657745},{"$f":"IF('Comparison - Category'!C45=\"Residential\",SUM(Q45:T45,Control!$B$103),IF('Comparison - Category'!C45=\"Rural\",SUM(Q45:T45,Control!$B$104),O45/$F45*$H45))","v":412.61421887867567},null,3.4475564091554715E-2,0,2.328145421750832E-2,6.5313197596540012E-4,{"$f":"IF(OR('Comparison - Category'!C45=\"Residential\",'Comparison - Category'!C45=\"Rural\"),U45,N45/$F45*100)","v":9.1960728798012384E-3},6.7606223164829671E-2]
[{"$f":"Control!A91","v":"South Wairarapa district"},{"$f":"Control!B91","v":"South Wairarapa district"},{"$f":"Control!C91","v":"Residential"},{"$f":"Control!D91","v":"South Wairarapa districtResidential"},null,887809098,3147,282112.83698760724,null,306077.19459164375,0,206694.86868974354,5798.565104567997,43008,561578.62838595523,null,97.259991926165782,0,65.679970984983655,1.8425691466692078,{"$f":"IF('Comparison - Category'!C46=\"Residential\",Control!$B$103,IF('Comparison - Category'!C46=\"Rural\",Control!$B$104,N46/$F46*$H46))","v":14},{"$f":"IF('Comparison - Category'!C46=\"Residential\",SUM(Q46:T46,Control!$B$103),IF('Comparison - Category'!C46=\"Rural\",SUM(Q46:T46,Control!$B$104),O46/$F46*$H46))","v":178.78253205781866},null,3.4475564091554708E-2,0,2.3281454217508317E-2,6.5313197596540023E-4,{"$f":"IF(OR('Comparison - Category'!C46=\"Residential\",'Comparison - Category'!C46=\"Rural\"),U46,N46/$F46*100)","v":14},6.3254434951279942E-2]
[{"$f":"Control!A92","v":"South Wairarapa district"},{"$f":"Control!B92","v":"South Wairarapa district"},{"$f":"Control!C92","v":"Rural"},{"$f":"Control!D92","v":"South Wairarapa districtRural"},null,2534327300,3139,807367.72857597959,null,873723.63260126801,0,153385.18071582823,3716.7471299999997,77532,1108357.5604470964,null,278.34457871974132,0,48.864345560951968,1.1840545173622172,{"$f":"IF('Comparison - Category'!C47=\"Residential\",Control!$B$103,IF('Comparison - Category'!C47=\"Rural\",Control!$B$104,N47/$F47*$H47))","v":28},{"$f":"IF('Comparison - Category'!C47=\"Residential\",SUM(Q47:T47,Control!$B$103),IF('Comparison - Category'!C47=\"Rural\",SUM(Q47:T47,Control!$B$104),O47/$F47*$H47))","v":356.39297879805548},null,3.4475564091554708E-2,0,6.0523035330057109E-3,1.466561611832852E-4,{"$f":"IF(OR('Comparison - Category'!C47=\"Residential\",'Comparison - Category'!C47=\"Rural\"),U47,N47/$F47*100)","v":28},4.3733797147949137E-2]
[{"$f":"Control!A93","v":"Tararua district"},{"$f":"Control!B93","v":"Tararua district"},{"$f":"Control!C93","v":"Rural"},{"$f":"Control!D93","v":"Tararua districtRural"},null,6806000,12,567166.66666666663,null,2354.4428815298133,0,0,0,252,2606.4428815298133,null,196.20357346081778,0,0,0,{"$f":"IF('Comparison - Category'!C48=\"Residential\",Control!$B$103,IF('Comparison - Category'!C48=\"Rural\",Control!$B$104,N48/$F48*$H48))","v":28},{"$f":"IF('Comparison - Category'!C48=\"Residential\",SUM(Q48:T48,Control!$B$103),IF('Comparison - Category'!C48=\"Rural\",SUM(Q48:T48,Control!$B$104),O48/$F48*$H48))","v":224.20357346081778},null,3.4593636225827409E-2,0,0,0,{"$f":"IF(OR('Comparison - Category'!C48=\"Residential\",'Comparison - Category'!C48=\"Rural\"),U48,N48/$F48*100)","v":28},3.8296251565233815E-2]
[{"$f":"Control!A94","v":"Region wide"},null,{"$f":"Control!C94","v":0},{"$f":"Control!D94","v":"Region wide"},null,112052918261,199332,562142.14607288339,null,42481670.520543598,5826660.3153546313,64656396.127130896,978091.35,4822017.2188234963,118764835.53185265,null,213.12017398382395,29.230932892634552,324.36536094119805,4.9068456143519352,{"$f":"N49/$F49*$H49","v":24.190883645493429},{"$f":"IF('Comparison - Category'!C49=\"Residential\",SUM(Q49:T49,Control!$B$103),IF('Comparison - Category'!C49=\"Rural\",SUM(Q49:T49,Control!$B$104),O49/$F49*$H49))","v":595.81419707750206},null,3.7912150062520356E-2,5.1999184008602473E-3,5.7701661974148284E-2,8.7288342434935456E-4,{"$f":"IF(OR(C49=\"Residential\",C49=\"Rural\"),\"n/a\",N49/$F49*100)","v":4.3033392558253416E-3},0.10598995311770362]
[]
["By category"]
["Region Wide",null,{"$f":"C22","v":"Regional CBD"},{"$f":"A52&C52","v":"Region WideRegional CBD"},null,{"$f":"SUMIF($C$22:$C$48,$C52,F$22:F$48)","v":7854191500},3401,{"$f":"F52/G52","v":2309377.094972067},null,{"$f":"SUMIF($C$22:$C$48,$C52,J$22:J$48)","v":3242974.474721483},6620.073536726286,25019166.072671905,135230.61302423512,865036.74131845124,29269027.975272797,null,{"$f":"J52/$F52*$H52","v":953.53557033857192},1.9465079496401898,7356.4146053137038,39.762015002715415,254.34776281048258,{"$f":"IF('Comparison - Category'!C52=\"Residential\",SUM(Q52:T52,Control!$B$103),IF('Comparison - Category'!C52=\"Rural\",SUM(Q52:T52,Control!$B$104),O52/$F52*$H52))","v":8606.0064614151124}]
["Region Wide",null,{"$f":"C23","v":"Business"},{"$f":"A53&C53","v":"Region WideBusiness"},null,11815134302,8254,1431443.457959777,null,4363120.5234142058,925501.38186053466,5205297.4833503868,145372.63211303085,1163826.4775050462,11803118.498243205,null,528.60679954133821,112.12762077302334,630.63938494673937,17.612385766056562,141.00151169191253,{"$f":"IF('Comparison - Category'!C53=\"Residential\",SUM(Q53:T53,Control!$B$103),IF('Comparison - Category'!C53=\"Rural\",SUM(Q53:T53,Control!$B$104),O53/$F53*$H53))","v":1429.9877027190701}]
["Region Wide",null,{"$f":"C24","v":"Residential"},{"$f":"A54&C54","v":"Region WideResidential"},null,82006689919,172672,474927.55003127316,null,31149946.143495981,4543692.8246270996,33685233.069664635,672938.01197773393,2409526,72461336.049765453,null,180.39952130916407,26.314010520681403,195.08219670626758,3.8972040167353934,13.954352761304671,{"$f":"IF('Comparison - Category'!C54=\"Residential\",SUM(Q54:T54,Control!$B$103),IF('Comparison - Category'!C54=\"Rural\",SUM(Q54:T54,Control!$B$104),O54/$F54*$H54))","v":419.69293255284845}]
["Region Wide",null,{"$f":"C25","v":"Rural"},{"$f":"A55&C55","v":"Region WideRural"},null,10376902540,15005,691562.9816727757,null,3725629.3789119427,350846.03533027106,746699.50144396978,24550.092884999998,383628,5231353.0085711842,null,248.29252775154566,23.381941708115363,49.763378969941336,1.6361274831722756,25.566677774075309,{"$f":"IF('Comparison - Category'!C55=\"Residential\",SUM(Q55:T55,Control!$B$103),IF('Comparison - Category'!C55=\"Rural\",SUM(Q55:T55,Control!$B$104),O55/$F55*$H55))","v":351.0739759127747}]
["Region Wide",null,"Total",{"$f":"A56&C56","v":"Region WideTotal"},null,{"$f":"SUM(F52:F55)","v":112052918261},{"$f":"SUM(G52:G55)","v":199332},562142.14607288339,null,{"$f":"SUM(J52:J55)","v":42481670.520543613},5826660.3153546322,64656396.127130896,978091.35,4822017.2188234972,118764835.53185263,null,213.12017398382403,29.230932892634559,324.36536094119805,4.9068456143519352,24.190883645493432,{"$f":"IF('Comparison - Category'!C56=\"Residential\",SUM(Q56:T56,Control!$B$103),IF('Comparison - Category'!C56=\"Rural\",SUM(Q56:T56,Control!$B$104),O56/$F56*$H56))","v":595.81419707750194}]
[]
[]
[null,null,null,null,null,null,null,null,null,{"$f":"IF(ABS(J19-SUM(J10:J18))>tolerance_dollar,1,0)","v":0},0,0,0,0,0]
[null,null,null,null,null,null,null,null,null,{"$f":"J49-SUM(J22:J48)","v":0},{"$f":"K49-SUM(K22:K48)","v":0},{"$f":"L49-SUM(L22:L48)","v":0},{"$f":"M49-SUM(M22:M48)","v":0},0,0]
[null,null,null,null,null,{"$f":"F49-F19","v":0},{"$f":"G49-G19","v":0},null,null,{"$f":"IF(ABS(J49-J19)>tolerance_dollar,1,0)","v":0},0,0,0,0,0,null,{"$f":"IF(ABS(Q49-Q19)>tolerance_dollar,1,0)","v":0},0,0,0,0,0]
[]
[]
[{"$f":"year_current&\" rates\"","v":"2018/19 rates"}]
[null,null,null,null,null,null,null,null,null,"Rates",null,null,null,null,null,null,"Rates / average CV",null,null,null,null,null,null,"Cents/$ OR Regional Strategy Rate $/property"]
[{"$f":"Control!A$66","v":"TA full name"},{"$f":"Control!B$66","v":"Rating area"},{"$f":"Control!C$66","v":"Category group"},{"$f":"Control!D$66","v":"Concatenated  name"},null,"CV","CV Assessments","Average CV",null,"General rate","River management rate","Public transport rate","Stadium purposes rate","Wellington regional strategy rate","District-Wide rates",null,"General rate","River management rate","Public transport rate","Stadium purposes rate","Wellington regional strategy rate","District-Wide rates",null,"General rate","River management rate","Public transport rate","Stadium purposes rate","Wellington regional strategy rate","District-Wide rates"]
[]
["By TA"]
[{"$f":"Control!A42","v":"Wellington city"},null,{"$f":"Control!B42","v":"District wide"},{"$f":"Control!C42","v":"Wellington cityDistrict wide"},null,{"$f":"INDEX(capital_values,MATCH($D69,capital_values_rows,0),MATCH(F$66&\" \"&year_current,capital_values_header,0))","v":51992837451},{"$f":"INDEX(assessments,MATCH($D69,assessments_rows,0),MATCH(G$66&\" \"&year_current,assessments_header,0))","v":77369},{"$f":"F69/G69","v":672011.23771794909},null,{"$f":"INDEX(Gen!$D$10:$D$18,MATCH($A69,Gen!$A$10:$A$18,0),)","v":23048092.376524467},{"$f":"INDEX('River management'!$C$10:$C$18,MATCH($A69,'River management'!$A$10:$A$18,0),)","v":42679},{"$f":"INDEX('Public transport'!$I$10:$I$18,MATCH($A69,'Public transport'!$A$10:$A$18,0),)","v":40924832.407689974},{"$f":"INDEX(Stadium!$G$10:$G$18,MATCH($A69,Stadium!$A$10:$A$18,0),)","v":0},{"$f":"INDEX(WRS!$K$10:$K$18,MATCH($A69,WRS!$A$10:$A$18,0),)","v":2351472.4227200211},{"$f":"SUM(J69:N69)","v":66367076.20693446},null,{"$f":"J69/$F69*$H69","v":297.89828453934348},{"$f":"K69/$F69*$H69","v":0.55162920549574124},{"$f":"L69/$F69*$H69","v":528.95646069730742},{"$f":"M69/$F69*$H69","v":0},{"$f":"N69/$F69*$H69","v":30.392953543667634},{"$f":"IF('Comparison - Category'!C69=\"Residential\",SUM(Q69:T69,Control!$B$103),IF('Comparison - Category'!C69=\"Rural\",SUM(Q69:T69,Control!$B$104),O69/$F69*$H69))","v":857.79932798581433}]
[{"$f":"Control!A43","v":"Hutt city"},null,{"$f":"Control!B43","v":"District wide"},{"$f":"Control!C43","v":"Hutt cityDistrict wide"},null,21402530500,39287,{"$f":"F70/G70","v":544773.85649196932},null,{"$f":"INDEX(Gen!$D$10:$D$18,MATCH($A70,Gen!$A$10:$A$18,0),)","v":8059093.3870078828},{"$f":"INDEX('River management'!$C$10:$C$18,MATCH($A70,'River management'!$A$10:$A$18,0),)","v":4356562},{"$f":"INDEX('Public transport'!$I$10:$I$18,MATCH($A70,'Public transport'!$A$10:$A$18,0),)","v":11715213.077808907},{"$f":"INDEX(Stadium!$G$10:$G$18,MATCH($A70,Stadium!$A$10:$A$18,0),)","v":0},{"$f":"INDEX(WRS!$K$10:$K$18,MATCH($A70,WRS!$A$10:$A$18,0),)","v":883091.45795915532},25013959.922775947,null,205.13384547071252,110.8906763051391,298.1956646679285,0,22.477956014945281,{"$f":"IF('Comparison - Category'!C70=\"Residential\",SUM(Q70:T70,Control!$B$103),IF('Comparison - Category'!C70=\"Rural\",SUM(Q70:T70,Control!$B$104),O70/$F70*$H70))","v":636.69814245872533}]
[{"$f":"Control!A44","v":"Upper Hutt city"},null,{"$f":"Control!B44","v":"District wide"},{"$f":"Control!C44","v":"Upper Hutt cityDistrict wide"},null,8186377260,16792,487516.51143401623,null,{"$f":"INDEX(Gen!$D$10:$D$18,MATCH($A71,Gen!$A$10:$A$18,0),)","v":3064993.2456397233},{"$f":"INDEX('River management'!$C$10:$C$18,MATCH($A71,'River management'!$A$10:$A$18,0),)","v":667062},{"$f":"INDEX('Public transport'!$I$10:$I$18,MATCH($A71,'Public transport'!$A$10:$A$18,0),)","v":4597306.1914495202},{"$f":"INDEX(Stadium!$G$10:$G$18,MATCH($A71,Stadium!$A$10:$A$18,0),)","v":0},{"$f":"INDEX(WRS!$K$10:$K$18,MATCH($A71,WRS!$A$10:$A$18,0),)","v":351106.94463605288},8680468.3817252964,null,182.5269917603456,39.724988089566466,273.77954927641258,0,20.90917964721611,{"$f":"IF('Comparison - Category'!C71=\"Residential\",SUM(Q71:T71,Control!$B$103),IF('Comparison - Category'!C71=\"Rural\",SUM(Q71:T71,Control!$B$104),O71/$F71*$H71))","v":516.94070877354079}]
[{"$f":"Control!A45","v":"Porirua city"},null,{"$f":"Control!B45","v":"District wide"},{"$f":"Control!C45","v":"Porirua cityDistrict wide"},null,10277129250,18675,550314.81927710841,null,{"$f":"INDEX(Gen!$D$10:$D$18,MATCH($A72,Gen!$A$10:$A$18,0),)","v":3819282.5884013595},{"$f":"INDEX('River management'!$C$10:$C$18,MATCH($A72,'River management'!$A$10:$A$18,0),)","v":33588},{"$f":"INDEX('Public transport'!$I$10:$I$18,MATCH($A72,'Public transport'!$A$10:$A$18,0),)","v":6086081.3056548676},{"$f":"INDEX(Stadium!$G$10:$G$18,MATCH($A72,Stadium!$A$10:$A$18,0),)","v":0},{"$f":"INDEX(WRS!$K$10:$K$18,MATCH($A72,WRS!$A$10:$A$18,0),)","v":362532.20642395876},10301484.100480186,null,204.51312387691348,1.7985542168674697,325.89458129343336,0,19.412701816543976,{"$f":"IF('Comparison - Category'!C72=\"Residential\",SUM(Q72:T72,Control!$B$103),IF('Comparison - Category'!C72=\"Rural\",SUM(Q72:T72,Control!$B$104),O72/$F72*$H72))","v":551.6189612037582}]
[{"$f":"Control!A46","v":"Kāpiti Coast district"},null,{"$f":"Control!B46","v":"District wide"},{"$f":"Control!C46","v":"Kāpiti Coast districtDistrict wide"},null,14770315600,25013,590505.56110822374,null,{"$f":"INDEX(Gen!$D$10:$D$18,MATCH($A73,Gen!$A$10:$A$18,0),)","v":4904933.1921061305},{"$f":"INDEX('River management'!$C$10:$C$18,MATCH($A73,'River management'!$A$10:$A$18,0),)","v":1335375},{"$f":"INDEX('Public transport'!$I$10:$I$18,MATCH($A73,'Public transport'!$A$10:$A$18,0),)","v":3594210.5446725246},{"$f":"INDEX(Stadium!$G$10:$G$18,MATCH($A73,Stadium!$A$10:$A$18,0),)","v":0},{"$f":"INDEX(WRS!$K$10:$K$18,MATCH($A73,WRS!$A$10:$A$18,0),)","v":485529.92728148983},10320048.664060144,null,196.09535809803427,53.387238635909327,143.69370106234857,0,19.411103317534476,{"$f":"IF('Comparison - Category'!C73=\"Residential\",SUM(Q73:T73,Control!$B$103),IF('Comparison - Category'!C73=\"Rural\",SUM(Q73:T73,Control!$B$104),O73/$F73*$H73))","v":412.58740111382656}]
[{"$f":"Control!A47","v":"Masterton district"},null,{"$f":"Control!B47","v":"District wide"},{"$f":"Control!C47","v":"Masterton districtDistrict wide"},null,5846514500,12342,473708.83973424078,null,{"$f":"INDEX(Gen!$D$10:$D$18,MATCH($A74,Gen!$A$10:$A$18,0),)","v":1968728.2422683882},{"$f":"INDEX('River management'!$C$10:$C$18,MATCH($A74,'River management'!$A$10:$A$18,0),)","v":0},{"$f":"INDEX('Public transport'!$I$10:$I$18,MATCH($A74,'Public transport'!$A$10:$A$18,0),)","v":437393.59292990481},{"$f":"INDEX(Stadium!$G$10:$G$18,MATCH($A74,Stadium!$A$10:$A$18,0),)","v":0},{"$f":"INDEX(WRS!$K$10:$K$18,MATCH($A74,WRS!$A$10:$A$18,0),)","v":243887.58058216906},2650009.4157804619,null,159.51452295157901,0,35.439441981032637,0,19.760782740412335,{"$f":"IF('Comparison - Category'!C74=\"Residential\",SUM(Q74:T74,Control!$B$103),IF('Comparison - Category'!C74=\"Rural\",SUM(Q74:T74,Control!$B$104),O74/$F74*$H74))","v":214.71474767302396}]
[{"$f":"Control!A48","v":"Carterton district"},null,{"$f":"Control!B48","v":"District wide"},{"$f":"Control!C48","v":"Carterton districtDistrict wide"},null,2684833200,4662,575897.29729729728,null,{"$f":"INDEX(Gen!$D$10:$D$18,MATCH($A75,Gen!$A$10:$A$18,0),)","v":907437.02995516302},{"$f":"INDEX('River management'!$C$10:$C$18,MATCH($A75,'River management'!$A$10:$A$18,0),)","v":23705},{"$f":"INDEX('Public transport'!$I$10:$I$18,MATCH($A75,'Public transport'!$A$10:$A$18,0),)","v":249139.42310300161},{"$f":"INDEX(Stadium!$G$10:$G$18,MATCH($A75,Stadium!$A$10:$A$18,0),)","v":0},{"$f":"INDEX(WRS!$K$10:$K$18,MATCH($A75,WRS!$A$10:$A$18,0),)","v":90214.335422871896},1270495.7884810364,null,194.64543757082004,5.0847275847275846,53.440459696053544,0,19.350994299200323,{"$f":"IF('Comparison - Category'!C75=\"Residential\",SUM(Q75:T75,Control!$B$103),IF('Comparison - Category'!C75=\"Rural\",SUM(Q75:T75,Control!$B$104),O75/$F75*$H75))","v":272.52161915080148}]
[{"$f":"Control!A49","v":"South Wairarapa district"},null,{"$f":"Control!B49","v":"District wide"},{"$f":"Control!C49","v":"South Wairarapa districtDistrict wide"},null,4507670300,6657,677132.38696109364,null,{"$f":"INDEX(Gen!$D$10:$D$18,MATCH($A76,Gen!$A$10:$A$18,0),)","v":1508400.8206117172},{"$f":"INDEX('River management'!$C$10:$C$18,MATCH($A76,'River management'!$A$10:$A$18,0),)","v":0},{"$f":"INDEX('Public transport'!$I$10:$I$18,MATCH($A76,'Public transport'!$A$10:$A$18,0),)","v":505501.25032055634},{"$f":"INDEX(Stadium!$G$10:$G$18,MATCH($A76,Stadium!$A$10:$A$18,0),)","v":0},{"$f":"INDEX(WRS!$K$10:$K$18,MATCH($A76,WRS!$A$10:$A$18,0),)","v":139773.94584747485},2153676.0167797483,null,226.58867667293333,0,75.935293723983236,0,20.996536855561793,{"$f":"IF('Comparison - Category'!C76=\"Residential\",SUM(Q76:T76,Control!$B$103),IF('Comparison - Category'!C76=\"Rural\",SUM(Q76:T76,Control!$B$104),O76/$F76*$H76))","v":323.52050725247835}]
[{"$f":"Control!A50","v":"Tararua district"},null,{"$f":"Control!B50","v":"District wide"},{"$f":"Control!C50","v":"Tararua districtDistrict wide"},null,10760500,10,1076050,null,{"$f":"INDEX(Gen!$D$10:$D$18,MATCH($A77,Gen!$A$10:$A$18,0),)","v":2353.0246429774902},{"$f":"INDEX('River management'!$C$10:$C$18,MATCH($A77,'River management'!$A$10:$A$18,0),)","v":0},{"$f":"INDEX('Public transport'!$I$10:$I$18,MATCH($A77,'Public transport'!$A$10:$A$18,0),)","v":0},{"$f":"INDEX(Stadium!$G$10:$G$18,MATCH($A77,Stadium!$A$10:$A$18,0),)","v":0},{"$f":"INDEX(WRS!$K$10:$K$18,MATCH($A77,WRS!$A$10:$A$18,0),)","v":252},2605.0246429774902,null,235.30246429774903,0,0,0,25.2,{"$f":"IF('Comparison - Category'!C77=\"Residential\",SUM(Q77:T77,Control!$B$103),IF('Comparison - Category'!C77=\"Rural\",SUM(Q77:T77,Control!$B$104),O77/$F77*$H77))","v":260.50246429774904}]
["Region wide",null,null,{"$f":"Control!C51","v":"Region wide"},null,{"$f":"SUM(F69:F77)","v":119678968561},{"$f":"SUM(G69:G77)","v":200807},{"$f":"F78/G78","v":595990.0230619451},null,{"$f":"INDEX(ess_base_estract,MATCH(J66,ESSbase!$B$8:$B$25,0),MATCH(year_current,ESSbase!$F$6:$G$6,0))","v":47283313.907157809},{"$f":"INDEX(ess_base_estract,MATCH(K66,ESSbase!$B$8:$B$25,0),MATCH(year_current,ESSbase!$F$6:$G$6,0))","v":6458970.8070691349},{"$f":"INDEX(ess_base_estract,MATCH(L66,ESSbase!$B$8:$B$25,0),MATCH(year_current,ESSbase!$F$6:$G$6,0))","v":68109677.793629244},{"$f":"INDEX(ess_base_estract,MATCH(M66,ESSbase!$B$8:$B$25,0),MATCH(year_current,ESSbase!$F$6:$G$6,0))","v":0},{"$f":"INDEX(ess_base_estract,MATCH(N66,ESSbase!$B$8:$B$25,0),MATCH(year_current,ESSbase!$F$6:$G$6,0))","v":4907860.8208731934},{"$f":"INDEX(ess_base_estract,MATCH(O66,ESSbase!$B$8:$B$25,0),MATCH(year_current,ESSbase!$F$6:$G$6,0))","v":126759823.32872939},null,235.46646236016579,32.165067986022081,339.1797984812743,0,24.440685936611739,{"$f":"IF('Comparison - Category'!C78=\"Residential\",SUM(Q78:T78,Control!$B$103),IF('Comparison - Category'!C78=\"Rural\",SUM(Q78:T78,Control!$B$104),O78/$F78*$H78))","v":631.25201476407392}]
[]
["By TA & Category"]
[{"$f":"Control!A67","v":"Wellington city"},{"$f":"Control!B67","v":"Wellington city"},{"$f":"Control!C67","v":"Regional CBD"},{"$f":"Control!D67","v":"Wellington cityRegional CBD"},null,{"$f":"INDEX(capital_values,MATCH($D81,capital_values_rows,0),MATCH(F$66&\" \"&year_current,capital_values_header,0))","v":7963363000},{"$f":"INDEX(assessments,MATCH($D81,assessments_rows,0),MATCH(G$66&\" \"&year_current,assessments_header,0))","v":3381},{"$f":"F81/G81","v":2355327.7136941734},null,{"$f":"($F81/INDEX($F$69:$F$77,MATCH($A81,$A$69:$A$77,0),))\n*\nINDEX(J$69:J$77,MATCH($A81,$A$69:$A$77,0),)","v":3530107.896588108},{"$f":"($F81/INDEX($F$69:$F$77,MATCH($A81,$A$69:$A$77,0),))\n*\nINDEX(K$69:K$77,MATCH($A81,$A$69:$A$77,0),)","v":6536.8305739671296},{"$f":"INDEX('Public transport'!$I$23:$I$49,MATCH($D81,'Public transport'!$D$23:$D$49,0),)","v":25844164.269209553},{"$f":"INDEX(Stadium!$G$23:$G$49,MATCH($D81,Stadium!$D$23:$D$49,0),)","v":0},{"$f":"INDEX(WRS!$K$23:$K$49,MATCH($D81,WRS!$D$23:$D$49,0),)","v":893930.66496997047},{"$f":"SUM(J81:N81)","v":30274739.661341596},null,{"$f":"J81/$F81*$H81","v":1044.1017144596594},{"$f":"K81/$F81*$H81","v":1.9334015303067524},{"$f":"L81/$F81*$H81","v":7643.9409255278188},{"$f":"M81/$F81*$H81","v":0},{"$f":"IF('Comparison - Category'!C81=\"Residential\",Control!$B$103,IF('Comparison - Category'!C81=\"Rural\",Control!$B$104,N81/$F81*$H81))","v":264.3983037474033},{"$f":"IF('Comparison - Category'!C81=\"Residential\",SUM(Q81:T81,Control!$B$103),IF('Comparison - Category'!C81=\"Rural\",SUM(Q81:T81,Control!$B$104),O81/$F81*$H81))","v":8954.374345265187},null,{"$f":"J81/$F81*100","v":4.4329360555183883E-2},{"$f":"K81/$F81*100","v":8.2086306676803879E-5},{"$f":"L81/$F81*100","v":0.32453831715582415},{"$f":"M81/$F81*100","v":0},{"$f":"IF(OR('Comparison - Category'!C81=\"Residential\",'Comparison - Category'!C81=\"Rural\"),U81,N81/$F81*100)","v":1.1225542085297009E-2},{"$f":"O81/$F81*100","v":0.38017530610298178}]
[{"$f":"Control!A68","v":"Wellington city"},{"$f":"Control!B68","v":"Wellington city"},{"$f":"Control!C68","v":"Business"},{"$f":"Control!D68","v":"Wellington cityBusiness"},null,3896130400,1899,2051674.776197999,null,{"$f":"($F82/INDEX($F$69:$F$77,MATCH($A82,$A$69:$A$77,0),))\n*\nINDEX(J$69:J$77,MATCH($A82,$A$69:$A$77,0),)","v":1727129.692716128},{"$f":"($F82/INDEX($F$69:$F$77,MATCH($A82,$A$69:$A$77,0),))\n*\nINDEX(K$69:K$77,MATCH($A82,$A$69:$A$77,0),)","v":3198.1895486721855},{"$f":"INDEX('Public transport'!$I$23:$I$49,MATCH($D82,'Public transport'!$D$23:$D$49,0),)","v":1461180.8372846076},{"$f":"INDEX(Stadium!$G$23:$G$49,MATCH($D82,Stadium!$D$23:$D$49,0),)","v":0},{"$f":"INDEX(WRS!$K$23:$K$49,MATCH($D82,WRS!$D$23:$D$49,0),)","v":437361.75775005075},3628870.4772994583,null,909.49430896057288,1.684144048800519,769.4475183173289,0,{"$f":"IF('Comparison - Category'!C82=\"Residential\",Control!$B$103,IF('Comparison - Category'!C82=\"Rural\",Control!$B$104,N82/$F82*$H82))","v":230.31161545552962},{"$f":"IF('Comparison - Category'!C82=\"Residential\",SUM(Q82:T82,Control!$B$103),IF('Comparison - Category'!C82=\"Rural\",SUM(Q82:T82,Control!$B$104),O82/$F82*$H82))","v":1910.9375867822318},null,4.4329360555183883E-2,8.2086306676803879E-5,3.7503386367268597E-2,0,{"$f":"IF(OR('Comparison - Category'!C82=\"Residential\",'Comparison - Category'!C82=\"Rural\"),U82,N82/$F82*100)","v":1.1225542085297009E-2},9.3140375314426288E-2]
[{"$f":"Control!A69","v":"Wellington city"},{"$f":"Control!B69","v":"Wellington city"},{"$f":"Control!C69","v":"Residential"},{"$f":"Control!D69","v":"Wellington cityResidential"},null,39537398501,71308,554459.5066612442,null,17526675.935648158,32454.79018556092,{"$f":"INDEX('Public transport'!$I$23:$I$49,MATCH($D83,'Public transport'!$D$23:$D$49,0),)","v":13567288.342507737},{"$f":"INDEX(Stadium!$G$23:$G$49,MATCH($D83,Stadium!$D$23:$D$49,0),)","v":0},{"$f":"INDEX(WRS!$K$23:$K$49,MATCH($D83,WRS!$D$23:$D$49,0),)","v":998312},32124731.068341456,null,245.78835384035676,0.45513533103664272,190.26320107852888,0,{"$f":"IF('Comparison - Category'!C83=\"Residential\",Control!$B$103,IF('Comparison - Category'!C83=\"Rural\",Control!$B$104,N83/$F83*$H83))","v":14},{"$f":"IF('Comparison - Category'!C83=\"Residential\",SUM(Q83:T83,Control!$B$103),IF('Comparison - Category'!C83=\"Rural\",SUM(Q83:T83,Control!$B$104),O83/$F83*$H83))","v":450.50669024992226},null,4.4329360555183883E-2,8.2086306676803879E-5,3.431507599612197E-2,0,{"$f":"IF(OR('Comparison - Category'!C83=\"Residential\",'Comparison - Category'!C83=\"Rural\"),U83,N83/$F83*100)","v":14},8.1251504363720195E-2]
[{"$f":"Control!A70","v":"Wellington city"},{"$f":"Control!B70","v":"Wellington city"},{"$f":"Control!C70","v":"Rural"},{"$f":"Control!D70","v":"Wellington cityRural"},null,595945550,781,763054.48143405886,null,264178.85157207365,489.18969179976557,{"$f":"INDEX('Public transport'!$I$23:$I$49,MATCH($D84,'Public transport'!$D$23:$D$49,0),)","v":52198.958688082472},{"$f":"INDEX(Stadium!$G$23:$G$49,MATCH($D84,Stadium!$D$23:$D$49,0),)","v":0},{"$f":"INDEX(WRS!$K$23:$K$49,MATCH($D84,WRS!$D$23:$D$49,0),)","v":21868},338734.99995195586,null,338.25717230739264,0.62636324174105706,66.836054658236193,0,{"$f":"IF('Comparison - Category'!C84=\"Residential\",Control!$B$103,IF('Comparison - Category'!C84=\"Rural\",Control!$B$104,N84/$F84*$H84))","v":28},{"$f":"IF('Comparison - Category'!C84=\"Residential\",SUM(Q84:T84,Control!$B$103),IF('Comparison - Category'!C84=\"Rural\",SUM(Q84:T84,Control!$B$104),O84/$F84*$H84))","v":433.71959020736989},null,4.4329360555183883E-2,8.2086306676803879E-5,8.7590147603388378E-3,0,{"$f":"IF(OR('Comparison - Category'!C84=\"Residential\",'Comparison - Category'!C84=\"Rural\"),U84,N84/$F84*100)","v":28},5.6839924377647573E-2]
[{"$f":"Control!A71","v":"Hutt city"},{"$f":"Control!B71","v":"Hutt city"},{"$f":"Control!C71","v":"Business"},{"$f":"Control!D71","v":"Hutt cityBusiness"},null,3789029500,2371,1598072.3323492198,null,1426753.840468901,771270.57179425587,{"$f":"INDEX('Public transport'!$I$23:$I$49,MATCH($D85,'Public transport'!$D$23:$D$49,0),)","v":2181032.9758243612},{"$f":"INDEX(Stadium!$G$23:$G$49,MATCH($D85,Stadium!$D$23:$D$49,0),)","v":0},{"$f":"INDEX(WRS!$K$23:$K$49,MATCH($D85,WRS!$D$23:$D$49,0),)","v":361297.45795915526},4740354.8460466741,null,601.75193608979373,325.29336642524498,919.87894383144715,0,{"$f":"IF('Comparison - Category'!C85=\"Residential\",Control!$B$103,IF('Comparison - Category'!C85=\"Rural\",Control!$B$104,N85/$F85*$H85))","v":152.38188863734933},{"$f":"IF('Comparison - Category'!C85=\"Residential\",SUM(Q85:T85,Control!$B$103),IF('Comparison - Category'!C85=\"Rural\",SUM(Q85:T85,Control!$B$104),O85/$F85*$H85))","v":1999.3061349838358},null,3.7654862293072695E-2,2.0355359381452581E-2,5.7561783982530645E-2,0,{"$f":"IF(OR('Comparison - Category'!C85=\"Residential\",'Comparison - Category'!C85=\"Rural\"),U85,N85/$F85*100)","v":9.5353561633435488E-3},0.1251073618203995]
[{"$f":"Control!A72","v":"Hutt city"},{"$f":"Control!B72","v":"Hutt city"},{"$f":"Control!C72","v":"Residential"},{"$f":"Control!D72","v":"Hutt cityResidential"},null,17301952000,36436,474858.71116478206,null,6515026.1996135367,3521874.5096064224,{"$f":"INDEX('Public transport'!$I$23:$I$49,MATCH($D86,'Public transport'!$D$23:$D$49,0),)","v":9490730.5694780909},{"$f":"INDEX(Stadium!$G$23:$G$49,MATCH($D86,Stadium!$D$23:$D$49,0),)","v":0},{"$f":"INDEX(WRS!$K$23:$K$49,MATCH($D86,WRS!$D$23:$D$49,0),)","v":508354},20035985.278698049,null,178.8073937757585,96.659197211725271,260.47674194417857,0,{"$f":"IF('Comparison - Category'!C86=\"Residential\",Control!$B$103,IF('Comparison - Category'!C86=\"Rural\",Control!$B$104,N86/$F86*$H86))","v":14},{"$f":"IF('Comparison - Category'!C86=\"Residential\",SUM(Q86:T86,Control!$B$103),IF('Comparison - Category'!C86=\"Rural\",SUM(Q86:T86,Control!$B$104),O86/$F86*$H86))","v":549.94333293166233},null,3.7654862293072695E-2,2.0355359381452581E-2,5.4853525021212005E-2,0,{"$f":"IF(OR('Comparison - Category'!C86=\"Residential\",'Comparison - Category'!C86=\"Rural\"),U86,N86/$F86*100)","v":14},0.115801877607209]
[{"$f":"Control!A73","v":"Hutt city"},{"$f":"Control!B73","v":"Hutt city"},{"$f":"Control!C73","v":"Rural"},{"$f":"Control!D73","v":"Hutt cityRural"},null,311549000,480,649060.41666666663,null,117313.34692544505,63416.918599321703,{"$f":"INDEX('Public transport'!$I$23:$I$49,MATCH($D87,'Public transport'!$D$23:$D$49,0),)","v":43449.532506454168},{"$f":"INDEX(Stadium!$G$23:$G$49,MATCH($D87,Stadium!$D$23:$D$49,0),)","v":0},{"$f":"INDEX(WRS!$K$23:$K$49,MATCH($D87,WRS!$D$23:$D$49,0),)","v":13440},237619.79803122091,null,244.40280609467717,132.11858041525355,90.519859388446179,0,{"$f":"IF('Comparison - Category'!C87=\"Residential\",Control!$B$103,IF('Comparison - Category'!C87=\"Rural\",Control!$B$104,N87/$F87*$H87))","v":28},{"$f":"IF('Comparison - Category'!C87=\"Residential\",SUM(Q87:T87,Control!$B$103),IF('Comparison - Category'!C87=\"Rural\",SUM(Q87:T87,Control!$B$104),O87/$F87*$H87))","v":495.04124589837693},null,3.7654862293072695E-2,2.0355359381452581E-2,1.3946291757140664E-2,0,{"$f":"IF(OR('Comparison - Category'!C87=\"Residential\",'Comparison - Category'!C87=\"Rural\"),U87,N87/$F87*100)","v":28},7.6270441577800246E-2]
[{"$f":"Control!A74","v":"Upper Hutt city"},{"$f":"Control!B74","v":"Upper Hutt city"},{"$f":"Control!C74","v":"Business"},{"$f":"Control!D74","v":"Upper Hutt cityBusiness"},null,1174676500,716,1640609.6368715083,null,439800.83301361441,95717.80417104793,{"$f":"INDEX('Public transport'!$I$23:$I$49,MATCH($D88,'Public transport'!$D$23:$D$49,0),)","v":742078.90929759946},{"$f":"INDEX(Stadium!$G$23:$G$49,MATCH($D88,Stadium!$D$23:$D$49,0),)","v":0},{"$f":"INDEX(WRS!$K$23:$K$49,MATCH($D88,WRS!$D$23:$D$49,0),)","v":111370.9446360529},1388968.4911183147,null,614.24697348270161,133.68408403777644,1036.4230576782115,0,{"$f":"IF('Comparison - Category'!C88=\"Residential\",Control!$B$103,IF('Comparison - Category'!C88=\"Rural\",Control!$B$104,N88/$F88*$H88))","v":155.54601206152637},{"$f":"IF('Comparison - Category'!C88=\"Residential\",SUM(Q88:T88,Control!$B$103),IF('Comparison - Category'!C88=\"Rural\",SUM(Q88:T88,Control!$B$104),O88/$F88*$H88))","v":1939.9001272602159},null,3.7440166123491395E-2,8.1484395210977591E-3,6.3173044603990924E-2,0,{"$f":"IF(OR('Comparison - Category'!C88=\"Residential\",'Comparison - Category'!C88=\"Rural\"),U88,N88/$F88*100)","v":9.4809885646007976E-3},0.11824263881318087]
[{"$f":"Control!A75","v":"Upper Hutt city"},{"$f":"Control!B75","v":"Upper Hutt city"},{"$f":"Control!C75","v":"Residential"},{"$f":"Control!D75","v":"Upper Hutt cityResidential"},null,6156988420,14823,415367.22795655398,null,2305186.6926521282,501698.47772469255,{"$f":"INDEX('Public transport'!$I$23:$I$49,MATCH($D89,'Public transport'!$D$23:$D$49,0),)","v":3723760.5901796483},{"$f":"INDEX(Stadium!$G$23:$G$49,MATCH($D89,Stadium!$D$23:$D$49,0),)","v":0},{"$f":"INDEX(WRS!$K$23:$K$49,MATCH($D89,WRS!$D$23:$D$49,0),)","v":206920},6737565.7605564687,null,155.514180169475,33.84594736050007,251.21504352557835,0,{"$f":"IF('Comparison - Category'!C89=\"Residential\",Control!$B$103,IF('Comparison - Category'!C89=\"Rural\",Control!$B$104,N89/$F89*$H89))","v":14},{"$f":"IF('Comparison - Category'!C89=\"Residential\",SUM(Q89:T89,Control!$B$103),IF('Comparison - Category'!C89=\"Rural\",SUM(Q89:T89,Control!$B$104),O89/$F89*$H89))","v":454.57517105555343},null,3.7440166123491395E-2,8.1484395210977591E-3,6.0480227282604639E-2,0,{"$f":"IF(OR('Comparison - Category'!C89=\"Residential\",'Comparison - Category'!C89=\"Rural\"),U89,N89/$F89*100)","v":14},0.10942956687510659]
[{"$f":"Control!A76","v":"Upper Hutt city"},{"$f":"Control!B76","v":"Upper Hutt city"},{"$f":"Control!C76","v":"Rural"},{"$f":"Control!D76","v":"Upper Hutt cityRural"},null,854712340,1253,682132.75339185959,null,320005.71997398062,69645.718104259475,{"$f":"INDEX('Public transport'!$I$23:$I$49,MATCH($D90,'Public transport'!$D$23:$D$49,0),)","v":131466.69197227218},{"$f":"INDEX(Stadium!$G$23:$G$49,MATCH($D90,Stadium!$D$23:$D$49,0),)","v":0},{"$f":"INDEX(WRS!$K$23:$K$49,MATCH($D90,WRS!$D$23:$D$49,0),)","v":32816},553934.13005051226,null,255.39163605265816,55.583174863734619,104.92154187731221,0,{"$f":"IF('Comparison - Category'!C90=\"Residential\",Control!$B$103,IF('Comparison - Category'!C90=\"Rural\",Control!$B$104,N90/$F90*$H90))","v":28},{"$f":"IF('Comparison - Category'!C90=\"Residential\",SUM(Q90:T90,Control!$B$103),IF('Comparison - Category'!C90=\"Rural\",SUM(Q90:T90,Control!$B$104),O90/$F90*$H90))","v":443.89635279370498},null,3.7440166123491402E-2,8.1484395210977608E-3,1.5381396268629067E-2,0,{"$f":"IF(OR('Comparison - Category'!C90=\"Residential\",'Comparison - Category'!C90=\"Rural\"),U90,N90/$F90*100)","v":28},6.480942231985469E-2]
[{"$f":"Control!A77","v":"Porirua city"},{"$f":"Control!B77","v":"Porirua city"},{"$f":"Control!C77","v":"Business"},{"$f":"Control!D77","v":"Porirua cityBusiness"},null,1099995500,797,1380170.0125470515,null,408790.58327205991,3595.0359244533192,{"$f":"INDEX('Public transport'!$I$23:$I$49,MATCH($D91,'Public transport'!$D$23:$D$49,0),)","v":708506.55183594604},{"$f":"INDEX(Stadium!$G$23:$G$49,MATCH($D91,Stadium!$D$23:$D$49,0),)","v":0},{"$f":"INDEX(WRS!$K$23:$K$49,MATCH($D91,WRS!$D$23:$D$49,0),)","v":103518.20642395873},1224410.377456418,null,512.91164776920948,4.5107100683228598,888.96681535250457,0,{"$f":"IF('Comparison - Category'!C91=\"Residential\",Control!$B$103,IF('Comparison - Category'!C91=\"Rural\",Control!$B$104,N91/$F91*$H91))","v":129.88482612792816},{"$f":"IF('Comparison - Category'!C91=\"Residential\",SUM(Q91:T91,Control!$B$103),IF('Comparison - Category'!C91=\"Rural\",SUM(Q91:T91,Control!$B$104),O91/$F91*$H91))","v":1536.2739993179648},null,3.7162932327637697E-2,3.2682278467987543E-4,6.4409950025790655E-2,0,{"$f":"IF(OR('Comparison - Category'!C91=\"Residential\",'Comparison - Category'!C91=\"Rural\"),U91,N91/$F91*100)","v":9.4107845372057193E-3},0.11131048967531394]
[{"$f":"Control!A78","v":"Porirua city"},{"$f":"Control!B78","v":"Porirua city"},{"$f":"Control!C78","v":"Residential"},{"$f":"Control!D78","v":"Porirua cityResidential"},null,8551317050,17255,495584.87684729067,null,3177920.1684132442,27947.652509614978,{"$f":"INDEX('Public transport'!$I$23:$I$49,MATCH($D92,'Public transport'!$D$23:$D$49,0),)","v":5279332.7856404223},{"$f":"INDEX(Stadium!$G$23:$G$49,MATCH($D92,Stadium!$D$23:$D$49,0),)","v":0},{"$f":"INDEX(WRS!$K$23:$K$49,MATCH($D92,WRS!$D$23:$D$49,0),)","v":241570},8726770.6065632813,null,184.17387240876525,1.6196842949646466,305.95959348828876,0,{"$f":"IF('Comparison - Category'!C92=\"Residential\",Control!$B$103,IF('Comparison - Category'!C92=\"Rural\",Control!$B$104,N92/$F92*$H92))","v":14},{"$f":"IF('Comparison - Category'!C92=\"Residential\",SUM(Q92:T92,Control!$B$103),IF('Comparison - Category'!C92=\"Rural\",SUM(Q92:T92,Control!$B$104),O92/$F92*$H92))","v":505.75315019201867},null,3.7162932327637697E-2,3.2682278467987543E-4,6.1737072251816724E-2,0,{"$f":"IF(OR('Comparison - Category'!C92=\"Residential\",'Comparison - Category'!C92=\"Rural\"),U92,N92/$F92*100)","v":14},0.10205177232392852]
[{"$f":"Control!A79","v":"Porirua city"},{"$f":"Control!B79","v":"Porirua city"},{"$f":"Control!C79","v":"Rural"},{"$f":"Control!D79","v":"Porirua cityRural"},null,625816700,623,1004521.1878009631,null,232571.8367160554,2045.311565931702,{"$f":"INDEX('Public transport'!$I$23:$I$49,MATCH($D93,'Public transport'!$D$23:$D$49,0),)","v":98241.968178499475},{"$f":"INDEX(Stadium!$G$23:$G$49,MATCH($D93,Stadium!$D$23:$D$49,0),)","v":0},{"$f":"INDEX(WRS!$K$23:$K$49,MATCH($D93,WRS!$D$23:$D$49,0),)","v":17444},350303.11646048661,null,373.30952923925423,3.2830041186704686,157.69176272632339,0,{"$f":"IF('Comparison - Category'!C93=\"Residential\",Control!$B$103,IF('Comparison - Category'!C93=\"Rural\",Control!$B$104,N93/$F93*$H93))","v":28},{"$f":"IF('Comparison - Category'!C93=\"Residential\",SUM(Q93:T93,Control!$B$103),IF('Comparison - Category'!C93=\"Rural\",SUM(Q93:T93,Control!$B$104),O93/$F93*$H93))","v":562.28429608424813},null,3.716293232763769E-2,3.2682278467987543E-4,1.5698201754363456E-2,0,{"$f":"IF(OR('Comparison - Category'!C93=\"Residential\",'Comparison - Category'!C93=\"Rural\"),U93,N93/$F93*100)","v":28},5.5975354518421547E-2]
[{"$f":"Control!A80","v":"Kāpiti Coast district"},{"$f":"Control!B80","v":"Kāpiti Coast district"},{"$f":"Control!C80","v":"Business"},{"$f":"Control!D80","v":"Kāpiti Coast districtBusiness"},null,1479149500,1334,1108807.7211394303,null,491196.64569910662,133728.98163140807,{"$f":"INDEX('Public transport'!$I$23:$I$49,MATCH($D94,'Public transport'!$D$23:$D$49,0),)","v":434529.5223524808},{"$f":"INDEX(Stadium!$G$23:$G$49,MATCH($D94,Stadium!$D$23:$D$49,0),)","v":0},{"$f":"INDEX(WRS!$K$23:$K$49,MATCH($D94,WRS!$D$23:$D$49,0),)","v":124385.92728148981},1183841.0769644852,null,368.21337758553716,100.24661291709749,325.73427462704711,0,{"$f":"IF('Comparison - Category'!C94=\"Residential\",Control!$B$103,IF('Comparison - Category'!C94=\"Rural\",Control!$B$104,N94/$F94*$H94))","v":93.242824049092818},{"$f":"IF('Comparison - Category'!C94=\"Residential\",SUM(Q94:T94,Control!$B$103),IF('Comparison - Category'!C94=\"Rural\",SUM(Q94:T94,Control!$B$104),O94/$F94*$H94))","v":887.4370891787745},null,3.3208045954726456E-2,9.0409374868063077E-3,2.9376984703201457E-2,0,{"$f":"IF(OR('Comparison - Category'!C94=\"Residential\",'Comparison - Category'!C94=\"Rural\"),U94,N94/$F94*100)","v":8.4092870451222008E-3},8.0035255189856408E-2]
[{"$f":"Control!A81","v":"Kāpiti Coast district"},{"$f":"Control!B81","v":"Kāpiti Coast district excl Ōtaki "},{"$f":"Control!C81","v":"Residential"},{"$f":"Control!D81","v":"Kāpiti Coast district excl Ōtaki Residential"},null,10219999500,17885,571428.5434721834,null,3393862.1305328137,923983.76594691724,{"$f":"INDEX('Public transport'!$I$23:$I$49,MATCH($D95,'Public transport'!$D$23:$D$49,0),)","v":2758230.1956271366},{"$f":"INDEX(Stadium!$G$23:$G$49,MATCH($D95,Stadium!$D$23:$D$49,0),)","v":0},{"$f":"INDEX(WRS!$K$23:$K$49,MATCH($D95,WRS!$D$23:$D$49,0),)","v":248066},7324142.0921068676,null,189.76025331466667,51.662497397087911,154.22030727576944,0,{"$f":"IF('Comparison - Category'!C95=\"Residential\",Control!$B$103,IF('Comparison - Category'!C95=\"Rural\",Control!$B$104,N95/$F95*$H95))","v":14},{"$f":"IF('Comparison - Category'!C95=\"Residential\",SUM(Q95:T95,Control!$B$103),IF('Comparison - Category'!C95=\"Rural\",SUM(Q95:T95,Control!$B$104),O95/$F95*$H95))","v":409.643057987524},null,3.3208045954726449E-2,9.0409374868063094E-3,2.6988555093639063E-2,0,{"$f":"IF(OR('Comparison - Category'!C95=\"Residential\",'Comparison - Category'!C95=\"Rural\"),U95,N95/$F95*100)","v":14},7.1664798927894929E-2]
[{"$f":"Control!A82","v":"Kāpiti Coast district"},{"$f":"Control!B82","v":"Ōtaki rating area"},{"$f":"Control!C82","v":"Residential"},{"$f":"Control!D82","v":"Ōtaki rating areaResidential"},null,1104760900,3151,{"$f":"F96/G96","v":350606.44239923835},null,366869.50736184954,99880.742347678737,{"$f":"INDEX('Public transport'!$I$23:$I$49,MATCH($D96,'Public transport'!$D$23:$D$49,0),)","v":265175.95858639781},{"$f":"INDEX(Stadium!$G$23:$G$49,MATCH($D96,Stadium!$D$23:$D$49,0),)","v":0},{"$f":"INDEX(WRS!$K$23:$K$49,MATCH($D96,WRS!$D$23:$D$49,0),)","v":43470},{"$f":"SUM(J96:N96)","v":775396.2082959261},null,{"$f":"J96/$F96*$H96","v":116.4295485121706},{"$f":"K96/$F96*$H96","v":31.698109282030703},{"$f":"L96/$F96*$H96","v":84.156127764645447},{"$f":"M96/$F96*$H96","v":0},{"$f":"IF('Comparison - Category'!C96=\"Residential\",Control!$B$103,IF('Comparison - Category'!C96=\"Rural\",Control!$B$104,N96/$F96*$H96))","v":14},{"$f":"IF('Comparison - Category'!C96=\"Residential\",SUM(Q96:T96,Control!$B$103),IF('Comparison - Category'!C96=\"Rural\",SUM(Q96:T96,Control!$B$104),O96/$F96*$H96))","v":246.28378555884674},null,{"$f":"J96/$F96*100","v":3.3208045954726449E-2},{"$f":"K96/$F96*100","v":9.0409374868063077E-3},{"$f":"L96/$F96*100","v":2.4003018081686076E-2},{"$f":"M96/$F96*100","v":0},{"$f":"IF(OR('Comparison - Category'!C96=\"Residential\",'Comparison - Category'!C96=\"Rural\"),U96,N96/$F96*100)","v":14},{"$f":"O96/$F96*100","v":7.0186789584599354E-2}]
[{"$f":"Control!A83","v":"Kāpiti Coast district"},{"$f":"Control!B83","v":"Kāpiti Coast district"},{"$f":"Control!C83","v":"Rural"},{"$f":"Control!D83","v":"Kāpiti Coast districtRural"},null,1966405700,2643,744005.18350359437,null,653004.90851236042,177781.51007399597,{"$f":"INDEX('Public transport'!$I$23:$I$49,MATCH($D97,'Public transport'!$D$23:$D$49,0),)","v":136274.86810650953},{"$f":"INDEX(Stadium!$G$23:$G$49,MATCH($D97,Stadium!$D$23:$D$49,0),)","v":0},{"$f":"INDEX(WRS!$K$23:$K$49,MATCH($D97,WRS!$D$23:$D$49,0),)","v":69608},1036669.2866928659,null,247.06958324342051,67.265043539158512,51.560676544271487,0,{"$f":"IF('Comparison - Category'!C97=\"Residential\",Control!$B$103,IF('Comparison - Category'!C97=\"Rural\",Control!$B$104,N97/$F97*$H97))","v":28},{"$f":"IF('Comparison - Category'!C97=\"Residential\",SUM(Q97:T97,Control!$B$103),IF('Comparison - Category'!C97=\"Rural\",SUM(Q97:T97,Control!$B$104),O97/$F97*$H97))","v":393.89530332685047},null,3.3208045954726456E-2,9.0409374868063077E-3,6.9301501773774117E-3,0,{"$f":"IF(OR('Comparison - Category'!C97=\"Residential\",'Comparison - Category'!C97=\"Rural\"),U97,N97/$F97*100)","v":28},5.2718993170781894E-2]
[{"$f":"Control!A84","v":"Masterton district"},{"$f":"Control!B84","v":"Masterton district"},{"$f":"Control!C84","v":"Business"},{"$f":"Control!D84","v":"Masterton districtBusiness"},null,433363100,550,787932.90909090906,null,145928.68522381663,0,{"$f":"INDEX('Public transport'!$I$23:$I$49,MATCH($D98,'Public transport'!$D$23:$D$49,0),)","v":58905.247251236593},{"$f":"INDEX(Stadium!$G$23:$G$49,MATCH($D98,Stadium!$D$23:$D$49,0),)","v":0},{"$f":"INDEX(WRS!$K$23:$K$49,MATCH($D98,WRS!$D$23:$D$49,0),)","v":36953.580582169045},241787.5130572223,null,265.32488222512114,0,107.10044954770289,0,{"$f":"IF('Comparison - Category'!C98=\"Residential\",Control!$B$103,IF('Comparison - Category'!C98=\"Rural\",Control!$B$104,N98/$F98*$H98))","v":67.188328331216439},{"$f":"IF('Comparison - Category'!C98=\"Residential\",SUM(Q98:T98,Control!$B$103),IF('Comparison - Category'!C98=\"Rural\",SUM(Q98:T98,Control!$B$104),O98/$F98*$H98))","v":439.61366010404049},null,3.3673537323278477E-2,0,1.3592584890415588E-2,0,{"$f":"IF(OR('Comparison - Category'!C98=\"Residential\",'Comparison - Category'!C98=\"Rural\"),U98,N98/$F98*100)","v":8.5271636145691793E-3},5.5793285828263248E-2]
[{"$f":"Control!A85","v":"Masterton district"},{"$f":"Control!B85","v":"Masterton district"},{"$f":"Control!C85","v":"Residential"},{"$f":"Control!D85","v":"Masterton districtResidential"},null,2604255800,7912,329152.65419615776,null,876945.04880664451,0,{"$f":"INDEX('Public transport'!$I$23:$I$49,MATCH($D99,'Public transport'!$D$23:$D$49,0),)","v":275144.79030540778},{"$f":"INDEX(Stadium!$G$23:$G$49,MATCH($D99,Stadium!$D$23:$D$49,0),)","v":0},{"$f":"INDEX(WRS!$K$23:$K$49,MATCH($D99,WRS!$D$23:$D$49,0),)","v":110558},1262647.8391120522,null,110.83734186130494,0,34.775630726163776,0,{"$f":"IF('Comparison - Category'!C99=\"Residential\",Control!$B$103,IF('Comparison - Category'!C99=\"Rural\",Control!$B$104,N99/$F99*$H99))","v":14},{"$f":"IF('Comparison - Category'!C99=\"Residential\",SUM(Q99:T99,Control!$B$103),IF('Comparison - Category'!C99=\"Rural\",SUM(Q99:T99,Control!$B$104),O99/$F99*$H99))","v":159.6129725874687},null,3.3673537323278477E-2,0,1.0565198330571358E-2,0,{"$f":"IF(OR('Comparison - Category'!C99=\"Residential\",'Comparison - Category'!C99=\"Rural\"),U99,N99/$F99*100)","v":14},4.8484017549737322E-2]
[{"$f":"Control!A86","v":"Masterton district"},{"$f":"Control!B86","v":"Masterton district"},{"$f":"Control!C86","v":"Rural"},{"$f":"Control!D86","v":"Masterton districtRural"},null,2808895600,3880,723942.16494845366,null,945854.50823792699,0,{"$f":"INDEX('Public transport'!$I$23:$I$49,MATCH($D100,'Public transport'!$D$23:$D$49,0),)","v":103343.55537326045},{"$f":"INDEX(Stadium!$G$23:$G$49,MATCH($D100,Stadium!$D$23:$D$49,0),)","v":0},{"$f":"INDEX(WRS!$K$23:$K$49,MATCH($D100,WRS!$D$23:$D$49,0),)","v":96376},1145574.0636111875,null,243.77693511286779,0,26.634936951871254,0,{"$f":"IF('Comparison - Category'!C100=\"Residential\",Control!$B$103,IF('Comparison - Category'!C100=\"Rural\",Control!$B$104,N100/$F100*$H100))","v":28},{"$f":"IF('Comparison - Category'!C100=\"Residential\",SUM(Q100:T100,Control!$B$103),IF('Comparison - Category'!C100=\"Rural\",SUM(Q100:T100,Control!$B$104),O100/$F100*$H100))","v":298.41187206473904},null,3.3673537323278477E-2,0,3.6791525955347168E-3,0,{"$f":"IF(OR('Comparison - Category'!C100=\"Residential\",'Comparison - Category'!C100=\"Rural\"),U100,N100/$F100*100)","v":28},4.0783789316028246E-2]
[{"$f":"Control!A87","v":"Carterton district"},{"$f":"Control!B87","v":"Carterton district"},{"$f":"Control!C87","v":"Business"},{"$f":"Control!D87","v":"Carterton districtBusiness"},null,96652500,227,425781.93832599121,null,32667.227721163978,853.36679854078091,{"$f":"INDEX('Public transport'!$I$23:$I$49,MATCH($D101,'Public transport'!$D$23:$D$49,0),)","v":18993.09347979879},{"$f":"INDEX(Stadium!$G$23:$G$49,MATCH($D101,Stadium!$D$23:$D$49,0),)","v":0},{"$f":"INDEX(WRS!$K$23:$K$49,MATCH($D101,WRS!$D$23:$D$49,0),)","v":8272.3354228718872},60786.023422375431,null,143.90849216371797,3.7593251037038806,83.670015329510093,0,{"$f":"IF('Comparison - Category'!C101=\"Residential\",Control!$B$103,IF('Comparison - Category'!C101=\"Rural\",Control!$B$104,N101/$F101*$H101))","v":36.442006268158096},{"$f":"IF('Comparison - Category'!C101=\"Residential\",SUM(Q101:T101,Control!$B$103),IF('Comparison - Category'!C101=\"Rural\",SUM(Q101:T101,Control!$B$104),O101/$F101*$H101))","v":267.77983886509003},null,3.3798637098020202E-2,8.8292263370402303E-4,1.9650907612114316E-2,0,{"$f":"IF(OR('Comparison - Category'!C101=\"Residential\",'Comparison - Category'!C101=\"Rural\"),U101,N101/$F101*100)","v":8.5588426816397781E-3},6.289131002547832E-2]
[{"$f":"Control!A88","v":"Carterton district"},{"$f":"Control!B88","v":"Carterton district"},{"$f":"Control!C88","v":"Residential"},{"$f":"Control!D88","v":"Carterton districtResidential"},null,843913500,2392,352806.64715719066,null,285231.26128620078,7451.1033003838011,{"$f":"INDEX('Public transport'!$I$23:$I$49,MATCH($D102,'Public transport'!$D$23:$D$49,0),)","v":140193.22360905298},{"$f":"INDEX(Stadium!$G$23:$G$49,MATCH($D102,Stadium!$D$23:$D$49,0),)","v":0},{"$f":"INDEX(WRS!$K$23:$K$49,MATCH($D102,WRS!$D$23:$D$49,0),)","v":32970},465845.58819563757,null,119.24383833035151,3.1150097409631279,58.609207194420151,0,{"$f":"IF('Comparison - Category'!C102=\"Residential\",Control!$B$103,IF('Comparison - Category'!C102=\"Rural\",Control!$B$104,N102/$F102*$H102))","v":14},{"$f":"IF('Comparison - Category'!C102=\"Residential\",SUM(Q102:T102,Control!$B$103),IF('Comparison - Category'!C102=\"Rural\",SUM(Q102:T102,Control!$B$104),O102/$F102*$H102))","v":194.96805526573479},null,3.3798637098020209E-2,8.8292263370402314E-4,1.6612274078925505E-2,0,{"$f":"IF(OR('Comparison - Category'!C102=\"Residential\",'Comparison - Category'!C102=\"Rural\"),U102,N102/$F102*100)","v":14},5.52006323154728E-2]
[{"$f":"Control!A89","v":"Carterton district"},{"$f":"Control!B89","v":"Carterton district"},{"$f":"Control!C89","v":"Rural"},{"$f":"Control!D89","v":"Carterton districtRural"},null,1744267200,2043,853777.38619676942,null,589538.54094779829,15400.529901075417,{"$f":"INDEX('Public transport'!$I$23:$I$49,MATCH($D103,'Public transport'!$D$23:$D$49,0),)","v":89953.106014149846},{"$f":"INDEX(Stadium!$G$23:$G$49,MATCH($D103,Stadium!$D$23:$D$49,0),)","v":0},{"$f":"INDEX(WRS!$K$23:$K$49,MATCH($D103,WRS!$D$23:$D$49,0),)","v":48972},743864.17686302355,null,288.56512038560857,7.5381937841778841,44.029909943294101,0,{"$f":"IF('Comparison - Category'!C103=\"Residential\",Control!$B$103,IF('Comparison - Category'!C103=\"Rural\",Control!$B$104,N103/$F103*$H103))","v":28},{"$f":"IF('Comparison - Category'!C103=\"Residential\",SUM(Q103:T103,Control!$B$103),IF('Comparison - Category'!C103=\"Rural\",SUM(Q103:T103,Control!$B$104),O103/$F103*$H103))","v":368.13322411308059},null,3.3798637098020202E-2,8.8292263370402303E-4,5.1570714632568826E-3,0,{"$f":"IF(OR('Comparison - Category'!C103=\"Residential\",'Comparison - Category'!C103=\"Rural\"),U103,N103/$F103*100)","v":28},4.2646228563090763E-2]
[{"$f":"Control!A90","v":"South Wairarapa district"},{"$f":"Control!B90","v":"South Wairarapa district"},{"$f":"Control!C90","v":"Business"},{"$f":"Control!D90","v":"South Wairarapa districtBusiness"},null,206493600,304,679255.26315789472,null,69098.912511651011,0,{"$f":"INDEX('Public transport'!$I$23:$I$49,MATCH($D104,'Public transport'!$D$23:$D$49,0),)","v":49092.449839139968},{"$f":"INDEX(Stadium!$G$23:$G$49,MATCH($D104,Stadium!$D$23:$D$49,0),)","v":0},{"$f":"INDEX(WRS!$K$23:$K$49,MATCH($D104,WRS!$D$23:$D$49,0),)","v":17497.945847474839},135689.30819826582,null,227.29905431464147,0,161.48832183927621,0,{"$f":"IF('Comparison - Category'!C104=\"Residential\",Control!$B$103,IF('Comparison - Category'!C104=\"Rural\",Control!$B$104,N104/$F104*$H104))","v":57.559032393009339},{"$f":"IF('Comparison - Category'!C104=\"Residential\",SUM(Q104:T104,Control!$B$103),IF('Comparison - Category'!C104=\"Rural\",SUM(Q104:T104,Control!$B$104),O104/$F104*$H104))","v":446.34640854692702},null,3.3462980214229887E-2,0,2.3774320288444759E-2,0,{"$f":"IF(OR('Comparison - Category'!C104=\"Residential\",'Comparison - Category'!C104=\"Rural\"),U104,N104/$F104*100)","v":8.47384415181625E-3},6.5711144654490891E-2]
[{"$f":"Control!A91","v":"South Wairarapa district"},{"$f":"Control!B91","v":"South Wairarapa district"},{"$f":"Control!C91","v":"Residential"},{"$f":"Control!D91","v":"South Wairarapa districtResidential"},null,1318886100,3229,408450.32517807372,null,441338.59469122824,0,{"$f":"INDEX('Public transport'!$I$23:$I$49,MATCH($D105,'Public transport'!$D$23:$D$49,0),)","v":273878.08936080622},{"$f":"INDEX(Stadium!$G$23:$G$49,MATCH($D105,Stadium!$D$23:$D$49,0),)","v":0},{"$f":"INDEX(WRS!$K$23:$K$49,MATCH($D105,WRS!$D$23:$D$49,0),)","v":44240},759456.68405203451,null,136.67965149929645,0,84.818237646579817,0,{"$f":"IF('Comparison - Category'!C105=\"Residential\",Control!$B$103,IF('Comparison - Category'!C105=\"Rural\",Control!$B$104,N105/$F105*$H105))","v":14},{"$f":"IF('Comparison - Category'!C105=\"Residential\",SUM(Q105:T105,Control!$B$103),IF('Comparison - Category'!C105=\"Rural\",SUM(Q105:T105,Control!$B$104),O105/$F105*$H105))","v":235.49788914587629},null,3.3462980214229887E-2,0,2.0765863660312002E-2,0,{"$f":"IF(OR('Comparison - Category'!C105=\"Residential\",'Comparison - Category'!C105=\"Rural\"),U105,N105/$F105*100)","v":14},5.7583189636469329E-2]
[{"$f":"Control!A92","v":"South Wairarapa district"},{"$f":"Control!B92","v":"South Wairarapa district"},{"$f":"Control!C92","v":"Rural"},{"$f":"Control!D92","v":"South Wairarapa districtRural"},null,2982290600,3124,954638.47631241998,null,997963.31340883789,0,{"$f":"INDEX('Public transport'!$I$23:$I$49,MATCH($D106,'Public transport'!$D$23:$D$49,0),)","v":182530.7111206101},{"$f":"INDEX(Stadium!$G$23:$G$49,MATCH($D106,Stadium!$D$23:$D$49,0),)","v":0},{"$f":"INDEX(WRS!$K$23:$K$49,MATCH($D106,WRS!$D$23:$D$49,0),)","v":78036},1258530.024529448,null,319.4504844458508,0,58.428524686494917,0,{"$f":"IF('Comparison - Category'!C106=\"Residential\",Control!$B$103,IF('Comparison - Category'!C106=\"Rural\",Control!$B$104,N106/$F106*$H106))","v":28},{"$f":"IF('Comparison - Category'!C106=\"Residential\",SUM(Q106:T106,Control!$B$103),IF('Comparison - Category'!C106=\"Rural\",SUM(Q106:T106,Control!$B$104),O106/$F106*$H106))","v":405.87900913234574},null,3.3462980214229887E-2,0,6.1204870887032305E-3,0,{"$f":"IF(OR('Comparison - Category'!C106=\"Residential\",'Comparison - Category'!C106=\"Rural\"),U106,N106/$F106*100)","v":28},4.2200113715593242E-2]
[{"$f":"Control!A93","v":"Tararua district"},{"$f":"Control!B93","v":"Tararua district"},{"$f":"Control!C93","v":"Rural"},{"$f":"Control!D93","v":"Tararua districtRural"},null,10760500,10,1076050,null,2353.0246429774902,0,{"$f":"INDEX('Public transport'!$I$23:$I$49,MATCH($D107,'Public transport'!$D$23:$D$49,0),)","v":0},{"$f":"INDEX(Stadium!$G$23:$G$49,MATCH($D107,Stadium!$D$23:$D$49,0),)","v":0},{"$f":"INDEX(WRS!$K$23:$K$49,MATCH($D107,WRS!$D$23:$D$49,0),)","v":252},2605.0246429774902,null,235.30246429774903,0,0,0,{"$f":"IF('Comparison - Category'!C107=\"Residential\",Control!$B$103,IF('Comparison - Category'!C107=\"Rural\",Control!$B$104,N107/$F107*$H107))","v":28},{"$f":"IF('Comparison - Category'!C107=\"Residential\",SUM(Q107:T107,Control!$B$103),IF('Comparison - Category'!C107=\"Rural\",SUM(Q107:T107,Control!$B$104),O107/$F107*$H107))","v":263.302464297749},null,2.1867242627921474E-2,0,0,0,{"$f":"IF(OR('Comparison - Category'!C107=\"Residential\",'Comparison - Category'!C107=\"Rural\"),U107,N107/$F107*100)","v":28},2.4209141238580832E-2]
["Region wide",null,null,{"$f":"Control!D94","v":"Region wide"},null,{"$f":"SUM(F81:F107)","v":119678968561},{"$f":"SUM(G81:G107)","v":200807},595990.0230619451,null,{"$f":"SUM(J81:J107)","v":47283313.907157816},{"$f":"SUM(K81:K107)","v":6458971.0000000009},68109677.793629259,0,4907860.8208731934,126759823.52166028,null,235.46646236016582,32.165068946799671,339.17979848127436,0,{"$f":"N108/$F108*$H108","v":24.440685936611739},{"$f":"IF('Comparison - Category'!C108=\"Residential\",SUM(Q108:T108,Control!$B$103),IF('Comparison - Category'!C108=\"Rural\",SUM(Q108:T108,Control!$B$104),O108/$F108*$H108))","v":631.25201572485173},null,3.9508457062827754E-2,5.3969139922089848E-3,5.6910314830223456E-2,0,{"$f":"IF(OR(C108=\"Residential\",C108=\"Rural\"),U108,N108/$F108*100)","v":4.1008548785843452E-3},0.10591654076384457]
[]
["By category"]
["Region Wide",null,{"$f":"C81","v":"Regional CBD"},{"$f":"A111&C111","v":"Region WideRegional CBD"},null,{"$f":"SUMIF($C$81:$C$107,$C111,F$81:F$107)","v":7963363000},3381,{"$f":"F111/G111","v":2355327.7136941734},null,{"$f":"SUMIF($C$81:$C$107,$C111,J$81:J$107)","v":3530107.896588108},6536.8305739671296,25844164.269209553,0,893930.66496997047,30274739.661341596,null,{"$f":"J111/$F111*$H111","v":1044.1017144596594},1.9334015303067524,7643.9409255278188,0,264.3983037474033,{"$f":"IF('Comparison - Category'!C111=\"Residential\",SUM(Q111:T111,Control!$B$103),IF('Comparison - Category'!C111=\"Rural\",SUM(Q111:T111,Control!$B$104),O111/$F111*$H111))","v":8954.374345265187}]
["Region Wide",null,{"$f":"C82","v":"Business"},"Region WideBusiness",null,12175490600,8198,1485178.1654061966,null,4741366.4206264419,1008363.9498683781,5654319.5871651703,0,1200658.1559032232,12604708.113563212,null,578.35647970559182,123.00121369460577,689.71939340877907,0,146.45744765835852,{"$f":"IF('Comparison - Category'!C112=\"Residential\",SUM(Q112:T112,Control!$B$103),IF('Comparison - Category'!C112=\"Rural\",SUM(Q112:T112,Control!$B$104),O112/$F112*$H112))","v":1537.5345344673347}]
["Region Wide",null,{"$f":"C83","v":"Residential"},"Region WideResidential",null,87639471771,174391,502545.84107551421,null,34889055.539005801,5115291.0416212715,35773734.545294695,0,2434460,78212541.125921771,null,200.06224827546032,29.332310965710796,205.13521079238433,0,13.959780034520131,{"$f":"IF('Comparison - Category'!C113=\"Residential\",SUM(Q113:T113,Control!$B$103),IF('Comparison - Category'!C113=\"Rural\",SUM(Q113:T113,Control!$B$104),O113/$F113*$H113))","v":448.52977003355545}]
["Region Wide",null,{"$f":"C84","v":"Rural"},"Region WideRural",null,11900643190,14837,802092.2821325066,null,4122784.0509374556,328779.17793638405,837459.39195983822,0,378812,5667834.6208336782,null,277.87181040220094,22.159410793043342,56.44398409111264,0,25.531576464244793,{"$f":"IF('Comparison - Category'!C114=\"Residential\",SUM(Q114:T114,Control!$B$103),IF('Comparison - Category'!C114=\"Rural\",SUM(Q114:T114,Control!$B$104),O114/$F114*$H114))","v":384.47520528635687}]
["Region Wide",null,"Total","Region WideTotal",null,{"$f":"SUM(F111:F114)","v":119678968561},{"$f":"SUM(G111:G114)","v":200807},595990.0230619451,null,{"$f":"SUM(J111:J114)","v":47283313.907157809},{"$f":"SUM(K111:K114)","v":6458971.0000000009},68109677.793629244,0,4907860.8208731934,126759823.52166025,null,235.46646236016579,32.165068946799671,339.1797984812743,0,24.440685936611739,{"$f":"IF('Comparison - Category'!C115=\"Residential\",SUM(Q115:T115,Control!$B$103),IF('Comparison - Category'!C115=\"Rural\",SUM(Q115:T115,Control!$B$104),O115/$F115*$H115))","v":631.2520157248515}]
[]
[]
[null,null,null,null,null,null,null,null,null,{"$f":"IF(ABS(J78-SUM(J69:J77))>tolerance_dollar,1,0)","v":0},{"$f":"IF(ABS(K78-SUM(K69:K77))>tolerance_dollar,1,0)","v":0},0,0,{"$f":"IF(ABS(N78-SUM(N69:N77))>tolerance_dollar,1,0)","v":0},0]
[null,null,null,null,null,null,null,null,null,{"$f":"J108-SUM(J81:J107)","v":0},{"$f":"K108-SUM(K81:K107)","v":0},{"$f":"L108-SUM(L81:L107)","v":0},{"$f":"M108-SUM(M81:M107)","v":0},{"$f":"N108-SUM(N81:N107)","v":0},0]
[null,null,null,null,null,{"$f":"F108-F78","v":0},{"$f":"G108-G78","v":0},null,null,{"$f":"IF(ABS(J108-J78)>tolerance_dollar,1,0)","v":0},{"$f":"IF(ABS(K108-K78)>tolerance_dollar,1,0)","v":0},0,0,{"$f":"IF(ABS(N108-N78)>tolerance_dollar,1,0)","v":0},0,null,{"$f":"IF(ABS(Q108-Q78)>tolerance_dollar,1,0)","v":0},0,0,0,0,0]
[]
[]
["Delta"]
[null,null,null,null,null,null,null,null,null,"Rates",null,null,null,null,null,null,"Rates / average CV",null,null,null,null,null,null,"Cents/$ OR Regional Strategy Rate $/property"]
[{"$f":"Control!A$66","v":"TA full name"},{"$f":"Control!B$66","v":"Rating area"},{"$f":"Control!C$66","v":"Category group"},{"$f":"Control!D$66","v":"Concatenated  name"},null,"CV","CV Assessments","Average CV",null,"General rate","River management rate","Public transport rate","Stadium purposes rate","Wellington regional strategy rate","District-Wide rates",null,"General rate","River management rate","Public transport rate","Stadium purposes rate","Wellington regional strategy rate","District-Wide rates",null,"General rate","River management rate","Public transport rate","Stadium purposes rate","Wellington regional strategy rate","District-Wide rates"]
[]
["By TA"]
[{"$f":"Control!A42","v":"Wellington city"},null,{"$f":"Control!B42","v":"District wide"},{"$f":"Control!C42","v":"Wellington cityDistrict wide"},null,{"$f":"F69-F10","v":673712000},398,5277.9816734647611,null,{"$f":"J69-J10","v":1858563.9696066342},{"$f":"K69-K10","v":-576.42410394520266},{"$f":"L69-L10","v":2467474.4044294804},-580986.26189999992,51621.450115439948,3796097.1381476074,null,{"$f":"Q69-Q10","v":22.605922391030049},-1.0341200292740216E-2,29.322078874796432,-7.5481189266087219,0.51350579575502664,44.88304693468001]
[{"$f":"Control!A43","v":"Hutt city"},null,{"$f":"Control!B43","v":"District wide"},{"$f":"Control!C43","v":"Hutt cityDistrict wide"},null,231709000,238,2613.455457371776,null,879637.33401022106,{"$f":"K70-K11","v":670975.69702351931},179199.87898797169,-190923.43151999998,20839.139881324489,1559728.6183830351,null,21.276229321831323,16.507047966987528,2.7716282311200189,-4.8893295992214902,0.39666537810872171,36.062241298825938]
[{"$f":"Control!A44","v":"Upper Hutt city"},null,{"$f":"Control!B44","v":"District wide"},{"$f":"Control!C44","v":"Upper Hutt cityDistrict wide"},null,174129500,222,3977.1173483192106,null,346856.15478389943,{"$f":"K71-K12","v":-10983.433768245159},922.62904026452452,-51447.605009999999,7908.9338120590546,293256.6788579775,null,18.487336307368906,-1.1950742983783229,-3.6123374109292854,-3.1048645147857572,0.19716933798292757,10.77222942125843]
[{"$f":"Control!A45","v":"Porirua city"},null,{"$f":"Control!B45","v":"District wide"},{"$f":"Control!C45","v":"Porirua cityDistrict wide"},null,232533950,161,7774.2931887428276,null,451525.98198057897,{"$f":"K72-K13","v":5280.320124576494},20010.058254348114,-70226.958930000008,8006.0356384066399,414595.43706790917,null,22.609882739353765,0.26956643057474494,-1.7532121277894817,-3.7931813184617056,0.26361621723793149,17.59667194091503]
[{"$f":"Control!A46","v":"Kāpiti Coast district"},null,{"$f":"Control!B46","v":"District wide"},{"$f":"Control!C46","v":"Kāpiti Coast districtDistrict wide"},null,3795809150,252,147288.14460646693,null,575470.79365577828,{"$f":"K73-K14","v":-32850.794630537275},503590.45750235347,-47339.621339999991,-5889.7186510161846,992981.11653657816,null,21.245295562177375,-1.8700528559745777,18.875636881977385,-1.9118622567747665,-0.4354152371485327,35.903602094256826]
[{"$f":"Control!A47","v":"Masterton district"},null,{"$f":"Control!B47","v":"District wide"},{"$f":"Control!C47","v":"Masterton districtDistrict wide"},null,1122506100,46,89518.176103791862,null,293375.01737003494,{"$f":"K74-K15","v":0},130645.02689919295,-19561.826999999997,2325.2873307206028,406783.50459994841,null,23.262634134211311,0,10.49242132141066,-1.5909098080676642,0.11518309406812222,32.279328741622408]
[{"$f":"Control!A48","v":"Carterton district"},null,{"$f":"Control!B48","v":"District wide"},{"$f":"Control!C48","v":"Carterton districtDistrict wide"},null,496582000,101,96122.861866470717,null,133263.86090832565,{"$f":"K75-K16","v":465.31999999999971},50350.509493465652,-6846.6394500000006,-690.32815521970042,176542.72279657144,null,24.907842954104979,-1.0576076750161256E-2,9.8559576987862911,-1.5011268252576191,-0.57986813844308571,32.67222961244039]
[{"$f":"Control!A49","v":"South Wairarapa district"},null,{"$f":"Control!B49","v":"District wide"},{"$f":"Control!C49","v":"South Wairarapa districtDistrict wide"},null,895114100,59,129609.47092593147,null,262951.69253728376,{"$f":"K76-K17","v":0},101088.70189128455,-10759.004849999999,1722.8020779816434,355004.19165654993,null,37.827062839281695,0,14.642091476442808,-1.6306463852682629,7.3356532813505737E-2,50.911864463269751]
[{"$f":"Control!A50","v":"Tararua district"},null,{"$f":"Control!B50","v":"District wide"},{"$f":"Control!C50","v":"Tararua districtDistrict wide"},null,3954500,-2,508883.33333333337,null,-1.418238552323146,{"$f":"K77-K18","v":0},0,0,0,-1.418238552323146,null,39.098890836931247,0,0,0,4.2000000000000028,43.298890836931264]
["Region wide",null,null,{"$f":"Control!C51","v":"Region wide"},null,7626050300,1475,33847.876989061711,null,4801643.3866142035,{"$f":"K78-K19","v":632310.49171450268},3453281.6664983407,-978091.35,85843.602049696259,7994987.7968767732,null,22.346288376341789,2.9341350933875212,14.814437540076199,-4.9068456143519352,0.2498022911183071,35.437817686572089]
[]
["By TA & Category"]
[{"$f":"Control!A67","v":"Wellington city"},{"$f":"Control!B67","v":"Wellington city"},{"$f":"Control!C67","v":"Regional CBD"},{"$f":"Control!D67","v":"Wellington cityRegional CBD"},null,{"$f":"F81-F22","v":109171500},-20,45950.61872210633,null,{"$f":"J81-J22","v":287133.42186662508},{"$f":"K81-K22","v":-83.242962759156399},{"$f":"L81-L22","v":824998.1965376474},-135230.61302423512,28893.923651519231,1005711.6860687993,null,{"$f":"Q81-Q22","v":90.566144121087518},-1.3106419333437369E-2,287.526320214115,-39.762015002715415,10.050540936920726,348.36788385007458,null,{"$f":"X81-X22","v":3.0396304190968906E-3},-2.200835248960029E-6,5.992912798521377E-3,-1.7217636344139956E-3,2.1184651499609082E-4,7.5204252629513801E-3]
[{"$f":"Control!A68","v":"Wellington city"},{"$f":"Control!B68","v":"Wellington city"},{"$f":"Control!C68","v":"Business"},{"$f":"Control!D68","v":"Wellington cityBusiness"},null,76375000,-8,48656.737393594114,null,149962.99619751773,{"$f":"K82-K23","v":-21.373106542846017},268411.1713977172,-65767.159400764853,16665.526463920716,369251.16155184805,null,82.453566161091885,-4.142608365202749E-3,143.97836997601246,-34.487236182886662,9.705306443400616,201.6458637892531,null,3.0396304190968906E-3,-2.2008352489600425E-6,6.2770500974935646E-3,-1.7217636344139956E-3,2.1184651499609429E-4,7.804562561923592E-3]
[{"$f":"Control!A69","v":"Wellington city"},{"$f":"Control!B69","v":"Wellington city"},{"$f":"Control!C69","v":"Residential"},{"$f":"Control!D69","v":"Wellington cityResidential"},null,471009500,419,3367.1086728398222,null,1396269.3432212882,{"$f":"K83-K24","v":-473.15255698297915},1368286.3445970714,-377152.02455999999,5866,2392796.5107013769,null,18.243789910454097,-9.3647005979394793E-3,18.177235725502811,-5.3203180262099901,0,31.091342909148977,null,3.0396304190968906E-3,-2.2008352489600425E-6,3.0887397263469445E-3,-9.6541306786850935E-4,0,5.1453289071684838E-3]
[{"$f":"Control!A70","v":"Wellington city"},{"$f":"Control!B70","v":"Wellington city"},{"$f":"Control!C70","v":"Rural"},{"$f":"Control!D70","v":"Wellington cityRural"},null,17156000,7,15264.365154989064,null,25198.208321201382,{"$f":"K84-K25","v":1.344522339775267},5778.691897050041,-2836.4649149999996,196,28337.779825591133,null,29.496651311433652,-3.9276748739175416E-3,6.8615497602614681,-3.6646833527131779,0,32.689590044108058,null,3.0396304190968976E-3,-2.200835248960029E-6,7.387823993654178E-4,-4.9006843938353755E-4,0,3.2112401475392835E-3]
[{"$f":"Control!A71","v":"Hutt city"},{"$f":"Control!B71","v":"Hutt city"},{"$f":"Control!C71","v":"Business"},{"$f":"Control!D71","v":"Hutt cityBusiness"},null,-7826500,14,-12812.690985527821,null,139162.76652023592,{"$f":"K85-K26","v":110283.44533938169},88698.385983753484,-49784.849714999997,17843.139881324489,306202.88800969627,null,55.468069331768675,44.857589397296636,32.168044450620641,-21.122125462452271,6.6651648028856982,118.03674252012024,null,3.7428289173359053E-3,2.9465578241937816E-3,2.4547535910539112E-3,-1.3112124798780886E-3,4.8960046236803771E-4,8.322528315073574E-3]
[{"$f":"Control!A72","v":"Hutt city"},{"$f":"Control!B72","v":"Hutt city"},{"$f":"Control!C72","v":"Residential"},{"$f":"Control!D72","v":"Hutt cityResidential"},null,246026500,234,3726.5775810021441,null,731015.0515127331,{"$f":"K86-K27","v":552642.28555752151},91716.520645460114,-138888.97169999999,3276,1239760.8860157132,null,19.036907391006167,14.640739003645578,0.84981390615223518,-3.8364999640903816,0,30.690960336713601,null,3.7428289173358983E-3,2.9465578241937816E-3,-2.5350537026472969E-4,-8.1431507014966735E-4,0,5.5983920638279921E-3]
[{"$f":"Control!A73","v":"Hutt city"},{"$f":"Control!B73","v":"Hutt city"},{"$f":"Control!C73","v":"Rural"},{"$f":"Control!D73","v":"Hutt cityRural"},null,-6491000,-10,-0.80782312934752554,null,9459.5159772517218,{"$f":"K87-K28","v":8049.9661266158146},-1215.0276412427193,-2249.6101049999997,-280,13764.844357624796,null,24.292947016731574,19.124799858710901,-0.632304178282169,-4.5910410306122449,0,38.194401666548117,null,3.7428289173358914E-3,2.9465578241937816E-3,-9.7400906579902385E-5,-7.0733558829078102E-4,0,5.8846556157841207E-3]
[{"$f":"Control!A74","v":"Upper Hutt city"},{"$f":"Control!B74","v":"Upper Hutt city"},{"$f":"Control!C74","v":"Business"},{"$f":"Control!D74","v":"Upper Hutt cityBusiness"},null,4114000,-6,19331.936040483415,null,42690.129036217695,{"$f":"K88-K29","v":-3342.3574514805077},16605.645890216809,-7726.9216650000008,5444.9338120590983,53671.429622013122,null,64.232148029243604,-3.518355882623041,31.612443540562367,-10.702107569252078,8.8340857125045034,90.458213830435398,null,3.5153903018332877E-3,-3.1417239603852634E-4,1.1965791519212843E-3,-6.6010329777350637E-4,4.3183392108592407E-4,4.1695276810284482E-3]
[{"$f":"Control!A75","v":"Upper Hutt city"},{"$f":"Control!B75","v":"Upper Hutt city"},{"$f":"Control!C75","v":"Residential"},{"$f":"Control!D75","v":"Upper Hutt cityResidential"},null,115035500,219,1648.1838590464322,null,255467.70929200202,{"$f":"K89-K30","v":-9608.5501109912875},-20828.273914464749,-41764.500645,2632,185898.3846215466,null,15.160921927888722,-1.1654897687579364,-5.1933969081461839,-2.8597987294576828,0,5.9422365215269224,null,3.5153903018332877E-3,-3.1417239603852808E-4,-1.4962381694650015E-3,-6.9124174249606701E-4,0,9.9331351987651251E-4]
[{"$f":"Control!A76","v":"Upper Hutt city"},{"$f":"Control!B76","v":"Upper Hutt city"},{"$f":"Control!C76","v":"Rural"},{"$f":"Control!D76","v":"Upper Hutt cityRural"},null,54980000,9,39261.097443306586,null,48698.316455680004,{"$f":"K90-K31","v":1967.4737942265929},5145.2570645121596,-1956.1827000000001,-168,53686.864614418766,null,37.298867951130347,1.1794414955409849,3.3769800543540072,-1.5724941318327974,0,40.282795369192513,null,3.5153903018332947E-3,-3.1417239603852634E-4,-4.1406786225252519E-4,-2.4460467610950935E-4,0,2.2575858596593362E-3]
[{"$f":"Control!A77","v":"Porirua city"},{"$f":"Control!B77","v":"Porirua city"},{"$f":"Control!C77","v":"Business"},{"$f":"Control!D77","v":"Porirua cityBusiness"},null,5256000,1,4869.1331500667147,null,41745.812096980168,{"$f":"K91-K32","v":509.84091286522789},16534.330656373408,-12128.33274,5612.0356384066399,52273.686564625474,null,51.800126192476171,0.6348369381870671,19.65497969977514,-15.236598919597988,6.8871241360285609,63.740468046868727,null,3.6348855936813793E-3,4.5002770732439391E-5,1.2011025164450351E-3,-1.1078738585754875E-3,4.6745411151521456E-4,4.2405711337985819E-3]
[{"$f":"Control!A78","v":"Porirua city"},{"$f":"Control!B78","v":"Porirua city"},{"$f":"Control!C78","v":"Residential"},{"$f":"Control!D78","v":"Porirua cityResidential"},null,202268000,149,7507.6495586200035,null,378647.1010883078,{"$f":"K92-K33","v":4418.3613124266994},1995.1031454550102,-56729.298300000002,2086,330417.26724619046,null,20.531111545621513,0.24418498494545582,-2.5483968364491716,-3.316339196773062,0,14.910560497344761,null,3.6348855936813723E-3,4.5002770732439391E-5,-1.4717752575288678E-3,-6.7947017630708498E-4,0,1.4851893629972968E-3]
[{"$f":"Control!A79","v":"Porirua city"},{"$f":"Control!B79","v":"Porirua city"},{"$f":"Control!C79","v":"Rural"},{"$f":"Control!D79","v":"Porirua cityRural"},null,25009950,11,22810.811983969645,null,31133.06879529127,{"$f":"K93-K34","v":352.11789928456483},1480.6244525198999,-1369.32789,308,31904.483257095737,null,44.161215643234414,0.51634780061959074,-0.41500806776087984,-2.2374638725490197,0,42.025091503544104,null,3.6348855936813654E-3,4.5002770732439391E-5,-4.0703403501134508E-4,-2.2791486447181229E-4,0,2.9801720902296394E-3]
[{"$f":"Control!A80","v":"Kāpiti Coast district"},{"$f":"Control!B80","v":"Kāpiti Coast district"},{"$f":"Control!C80","v":"Business"},{"$f":"Control!D80","v":"Kāpiti Coast districtBusiness"},null,210542500,-55,195483.74705735687,null,-9271.0819325908087,{"$f":"K94-K35","v":-24432.192044776893},31443.989532192529,-5889.2255613069892,-9109.7186510161991,-17258.22865749849,null,7.905438325855755,-13.620322774900302,35.535906865860454,-4.2399032118840818,-2.8663522882045243,22.714766916727172,null,-6.2421326767723023E-3,-3.426373010154922E-3,-2.3968848103900833E-3,-4.642277365099664E-4,-2.1137233065868805E-3,-1.4643341540414176E-2]
[{"$f":"Control!A81","v":"Kāpiti Coast district"},{"$f":"Control!B81","v":"Kāpiti Coast district excl Ōtaki "},{"$f":"Control!C81","v":"Residential"},{"$f":"Control!D81","v":"Kāpiti Coast district excl Ōtaki Residential"},null,{"$f":"F95-F36","v":2961484150},367,157082.42233963404,null,{"$f":"J95-J36","v":530364.85896305693},19042.119792825193,451918.9996941234,-33696.041513533462,6384,974013.93693647254,null,{"$f":"Q95-Q36","v":26.299968375189735},4.6799433779014521E-3,22.566511412485198,-1.9235096194504775,0,46.947650111602286,null,{"$f":"X95-X36","v":-6.2421326767723023E-3},-3.4263730101549185E-3,-4.7853144199524918E-3,-4.642277365099664E-4,0,-1.5820421519705211E-2]
[{"$f":"Control!A82","v":"Kāpiti Coast district"},{"$f":"Control!B82","v":"Ōtaki rating area"},{"$f":"Control!C82","v":"Residential"},{"$f":"Control!D82","v":"Ōtaki rating areaResidential"},null,{"$f":"F96-F37","v":340359900},86,101209.70504197897,null,65311.947400886798,4580.4962358020566,22296.182285809191,-3548.5614601595444,560,89200.064462338458,null,{"$f":"Q96-Q37","v":18.042090123602009},0.60504366641025698,4.9131338655953272,-1.1577688287633097,0,22.402498826844266,null,{"$f":"X96-X37","v":-6.2421326767722954E-3},-3.4263730101549306E-3,-7.7708514319054303E-3,-4.6422773650996586E-4,0,-1.9582342563787117E-2]
[{"$f":"Control!A83","v":"Kāpiti Coast district"},{"$f":"Control!B83","v":"Kāpiti Coast district"},{"$f":"Control!C83","v":"Rural"},{"$f":"Control!D83","v":"Kāpiti Coast districtRural"},null,{"$f":"F97-F38","v":283422600},-146,140569.14908265497,null,-10934.930775574874,-32041.218614387559,-2068.7140097717347,-4205.792805,-3724,-52974.65620473423,null,{"$f":"Q97-Q38","v":9.0129897375276187},-7.967200522649847,1.9573842831451884,-1.5079931176048764,0,1.4951803804180486,null,{"$f":"X97-X38","v":-6.2421326767722954E-3},-3.426373010154922E-3,-1.2899907210238417E-3,-2.4990107179329371E-4,0,-1.2025800933068584E-2]
[{"$f":"Control!A84","v":"Masterton district"},{"$f":"Control!B84","v":"Masterton district"},{"$f":"Control!C84","v":"Business"},{"$f":"Control!D84","v":"Masterton districtBusiness"},null,{"$f":"F98-F39","v":52214500},4,89858.550116550061,null,10755.653741592221,0,20399.071232680377,-2325.988066294557,897.28733072058822,29726.02423869865,null,{"$f":"Q98-Q39","v":17.755227495772402},0,36.576317645585277,-4.2600514034698849,1.1511612040214629,51.222654941909298,null,{"$f":"X98-X39","v":-1.791116484245521E-3},0,3.4899173170449358E-3,-6.1025753900042059E-4,-9.3274080366781767E-4,1.5580249013118219E-4]
[{"$f":"Control!A85","v":"Masterton district"},{"$f":"Control!B85","v":"Masterton district"},{"$f":"Control!C85","v":"Residential"},{"$f":"Control!D85","v":"Masterton districtResidential"},null,{"$f":"F99-F40","v":629359300},70,77316.834252265893,null,{"$f":"J99-J40","v":176554.84202473646},{"$f":"K99-K40","v":0},{"$f":"L99-L40","v":75627.56199227582},-12051.954778705442,1008,241138.44923830673,null,{"$f":"Q99-Q40","v":21.524640154864215},0,9.3334950065601099,-1.5368470771111249,0,29.321288084313181,null,{"$f":"X99-X40","v":-1.7911164842455141E-3},0,4.6253075720070584E-4,-6.1025753900042059E-4,0,-3.2406875106922028E-3]
[{"$f":"Control!A86","v":"Masterton district"},{"$f":"Control!B86","v":"Masterton district"},{"$f":"Control!C86","v":"Rural"},{"$f":"Control!D86","v":"Masterton districtRural"},null,440932300,-28,118015.01551140146,null,106064.52160370629,{"$f":"K100-K41","v":0},34618.393674236751,-5183.8841549999997,420,135919.03112294315,null,28.886969239218701,0,9.0491739787331547,-1.3264800806038894,0,36.60966313734798,null,-1.7911164842455141E-3,0,7.7686261076072597E-4,-2.1891741966609027E-4,0,-1.8543306450473501E-3]
[{"$f":"Control!A87","v":"Carterton district"},{"$f":"Control!B87","v":"Carterton district"},{"$f":"Control!C87","v":"Business"},{"$f":"Control!D87","v":"Carterton districtBusiness"},null,3607000,2,12246.382770435652,null,-250.99007784717469,{"$f":"K101-K42","v":-134.79564160320263},2169.5583064092134,-506.46234923245612,-508.3281552197077,768.98208250667085,null,-2.3946980541093694,-0.63250796360271355,8.8987478922230849,-2.2509437743664718,-2.5831651900267758,1.0374329101177864,null,-1.5799871224000742E-3,-1.7909803375865227E-4,1.5699309142733937E-3,-5.4431686565439071E-4,-8.7811405252962924E-4,-1.6115851600693454E-3]
[{"$f":"Control!A88","v":"Carterton district"},{"$f":"Control!B88","v":"Carterton district"},{"$f":"Control!C88","v":"Residential"},{"$f":"Control!D88","v":"Carterton districtResidential"},null,236162000,93,88451.927713954472,null,70217.141907233221,{"$f":"K102-K43","v":996.65676356938093},30305.816513274331,-3308.0939157675439,1890,100101.52126830939,null,25.718775529582672,0.30750798506298871,10.811291972245883,-1.4389273230828812,0,35.398648163808673,null,-1.5799871224000672E-3,-1.7909803375865195E-4,-1.4687026189154143E-3,-5.4431686565439071E-4,0,-4.9792383927571571E-3]
[{"$f":"Control!A89","v":"Carterton district"},{"$f":"Control!B89","v":"Carterton district"},{"$f":"Control!C89","v":"Rural"},{"$f":"Control!D89","v":"Carterton districtRural"},null,256813000,6,123559.32041375514,null,63297.709078939632,{"$f":"K103-K44","v":-396.54112196618007},17875.1346737821,-3032.083185,-2072,75672.219445755589,null,30.224014902614613,-0.21687299198392207,8.6455352057547046,-1.4885042636229748,0,37.16417285276242,null,-1.5799871224000742E-3,-1.7909803375865227E-4,3.1134435849172401E-4,-2.0384380137553141E-4,0,-2.2756223024530606E-3]
[{"$f":"Control!A90","v":"South Wairarapa district"},{"$f":"Control!B90","v":"South Wairarapa district"},{"$f":"Control!C90","v":"Business"},{"$f":"Control!D90","v":"South Wairarapa districtBusiness"},null,16073798,-8,68935.384952766472,null,3450.6116301294242,{"$f":"K104-K45","v":0},4759.9508154399737,-1243.6926154320026,-13.197922018378449,6953.671908119024,null,16.887833540533791,0,19.396978814596736,-3.9861942802307779,1.4335715933515942,33.732189668251351,null,-1.0125838773248283E-3,0,4.928660709364388E-4,-6.5313197596540012E-4,-7.2222872798498837E-4,-1.8950785103387796E-3]
[{"$f":"Control!A91","v":"South Wairarapa district"},{"$f":"Control!B91","v":"South Wairarapa district"},{"$f":"Control!C91","v":"Residential"},{"$f":"Control!D91","v":"South Wairarapa districtResidential"},null,431077002,82,126337.48819046648,null,135261.40009958448,{"$f":"K105-K46","v":0},67183.220671062678,-5798.565104567997,1232,197878.05566607928,null,39.419659573130673,0,19.138266661596163,-1.8425691466692078,0,56.71535708805763,null,-1.0125838773248214E-3,0,-2.515590557196315E-3,-6.5313197596540023E-4,0,-5.6712453148106134E-3]
[{"$f":"Control!A92","v":"South Wairarapa district"},{"$f":"Control!B92","v":"South Wairarapa district"},{"$f":"Control!C92","v":"Rural"},{"$f":"Control!D92","v":"South Wairarapa districtRural"},null,447963300,-15,147270.74773644039,null,124239.68080756988,{"$f":"K106-K47","v":0},29145.530404781864,-3716.7471299999997,504,150172.46408235165,null,41.105905726109484,0,9.5641791255429496,-1.1840545173622172,0,49.486030334290263,null,-1.0125838773248214E-3,0,6.8183555697519556E-5,-1.466561611832852E-4,0,-1.5336834323558951E-3]
[{"$f":"Control!A93","v":"Tararua district"},{"$f":"Control!B93","v":"Tararua district"},{"$f":"Control!C93","v":"Rural"},{"$f":"Control!D93","v":"Tararua districtRural"},null,3954500,-2,508883.33333333337,null,-1.418238552323146,{"$f":"K107-K48","v":0},0,0,0,-1.418238552323146,null,39.098890836931247,0,0,0,0,39.098890836931218,null,-1.2726393597905936E-2,0,0,0,0,-1.4087110326652982E-2]
["Region wide",null,null,{"$f":"Control!D94","v":"Region wide"},null,7626050300,1475,33847.876989061711,null,4801643.3866142184,{"$f":"K108-K49","v":632310.68464536965},3453281.666498363,-978091.35,85843.602049697191,7994987.9898076355,null,22.346288376341874,2.9341360541651191,14.814437540076312,-4.9068456143519352,0.24980229111831065,35.437818647349673,null,1.5963070003073981E-3,1.9699559134873749E-4,-7.9134714392482819E-4,-8.7288342434935456E-4,-2.0248437724099642E-4,-7.3412353859048096E-5]
[]
["By category"]
["Region Wide",null,{"$f":"C140","v":"Regional CBD"},{"$f":"A170&C170","v":"Region WideRegional CBD"},null,{"$f":"F111-F52","v":109171500},-20,45950.61872210633,null,{"$f":"J111-J52","v":287133.42186662508},{"$f":"K111-K52","v":-83.242962759156399},824998.1965376474,-135230.61302423512,28893.923651519231,1005711.6860687993,null,{"$f":"Q111-Q52","v":90.566144121087518},-1.3106419333437369E-2,287.526320214115,-39.762015002715415,10.050540936920726,348.36788385007458]
["Region Wide",null,{"$f":"C141","v":"Business"},"Region WideBusiness",null,{"$f":"F112-F53","v":360356298},-56,53734.707446419634,null,{"$f":"J112-J53","v":378245.89721223619},{"$f":"K112-K53","v":82862.568007843453},449022.10381478351,-145372.63211303085,36831.678398177028,801589.61532000639,null,{"$f":"Q112-Q53","v":49.749680164253618},10.873592921582429,59.0800084620397,-17.612385766056562,5.4559359664459919,107.54683174826459]
["Region Wide",null,{"$f":"C142","v":"Residential"},"Region WideResidential",null,{"$f":"F113-F54","v":5632781852},1719,27618.29104424105,null,{"$f":"J113-J54","v":3739109.3955098204},{"$f":"K113-K54","v":571598.21699417196},2088501.4756300598,-672938.01197773393,24934,5751205.0761563182,null,{"$f":"Q113-Q54","v":19.662726966296248},3.0183004450293929,10.053014086116747,-3.8972040167353934,5.4272732154601044E-3,28.836837480707004]
["Region Wide",null,{"$f":"C143","v":"Rural"},"Region WideRural",null,{"$f":"F114-F55","v":1523740650},-168,110529.3004597309,null,{"$f":"J114-J55","v":397154.6720255129},{"$f":"K114-K55","v":-22066.85739388701},90759.890515868436,-24550.092884999998,-4816,436481.61226249393,null,{"$f":"Q114-Q55","v":29.579282650655273},-1.2225309150720207,6.680605121171304,-1.6361274831722756,-3.5101309830515959E-2,33.401229373582169]
["Region Wide",null,"Total","Region WideTotal",null,{"$f":"F115-F56","v":7626050300},1475,33847.876989061711,null,{"$f":"J115-J56","v":4801643.386614196},{"$f":"K115-K56","v":632310.68464536872},3453281.6664983481,-978091.35,85843.602049696259,7994987.9898076206,null,{"$f":"Q115-Q56","v":22.346288376341761},2.934136054165112,14.814437540076256,-4.9068456143519352,0.2498022911183071,35.437818647349559]
[]
[]
[null,null,null,null,null,null,null,null,null,{"$f":"IF(ABS(J137-SUM(J128:J136))>tolerance_dollar,1,0)","v":0},{"$f":"IF(ABS(K137-SUM(K128:K136))>tolerance_dollar,1,0)","v":0},0,0,0,0]
[null,null,null,null,null,null,null,null,null,{"$f":"IF(ABS(J167-SUM(J140:J166))>tolerance_dollar,1,0)","v":0},{"$f":"IF(ABS(K167-SUM(K140:K166))>tolerance_dollar,1,0)","v":0},0,0,0,0]
[null,null,null,null,null,{"$f":"F167-F137","v":0},{"$f":"G167-G137","v":0},null,null,{"$f":"IF(ABS(J167-J137)>tolerance_dollar,1,0)","v":0},{"$f":"IF(ABS(K167-K137)>tolerance_dollar,1,0)","v":0},0,0,0,0,null,{"$f":"IF(ABS(Q167-Q137)>tolerance_dollar,1,0)","v":0},0,0,0,0,0]

{"sheet":"Rates Check - ex-KCDC &  UHC","index":19,"n_rows":47,"n_cols":9,"rows_kept":47,"cut":false,"hidden":false,"merged":[[26,0,27,0],[7,3,7,5],[6,7,6,8],[6,3,6,5],[17,0,20,0],[13,0,16,0],[21,0,22,0]]}
["Wellington Regional Council"]
[{"$f":"B5&\" Check \"&year_current","v":"Wellington city Check 2018/19"}]
[{"$f":"check_total","v":0}]
["Printed: ",{"$f":"NOW()","v":"2018-11-12T16:52:19.590"}]
["TA to view","Wellington city"]
[]
[null,null,null,"Excluding GST",null,null,null,"Including GST"]
[]
["Total"]
["Rate","Categories",null,"Rateable Capital Value","Cents in Dollar","Rates Set",null,"Cents in Dollar","Rates Set"]
[null,null,null,"$","Cents / $","$",null,"Cents / $","$"]
["General rate ","District wide",null,{"$f":"INDEX(capital_values,MATCH($B$5&B12,capital_values_rows,0),MATCH(\"CV \"&year_current,capital_values_header,0))","v":51992837451},{"$f":"INDEX(Gen!$E$10:$E$19,MATCH(B5,Gen!$A$10:$A$19,0),)","v":4.4329360555183883E-2},{"$f":"+E12*D12/100","v":23048092.376524467},null,{"$f":"+E12*(1+GST)","v":5.097876463846146E-2},{"$f":"+F12*(1+GST)","v":26505306.233003136}]
["River management rate","District wide",null,{"$f":"INDEX(capital_values,MATCH($B$5&B13,capital_values_rows,0),MATCH(\"CV \"&year_current,capital_values_header,0))","v":51992837451},{"$f":"INDEX('River management'!$D$10:$D$19,MATCH(B5,'River management'!$A$10:$A$19,0),)","v":8.2086306676803879E-5},{"$f":"+E13*D13/100","v":42679},null,9.439925267832446E-5,49080.85]
["Public transport rate","Regional CBD",null,{"$f":"IFERROR(INDEX(capital_values,MATCH($B$5&B14,capital_values_rows,0),MATCH(\"CV \"&year_current,capital_values_header,0)),0)","v":7963363000},{"$f":"IFERROR(INDEX('Public transport'!$J$23:$J$50,MATCH($B$5&B14,'Public transport'!$D$23:$D$50,0),),0)","v":0.32453831715582415},25844164.269209553,null,0.37321906472919775,29720788.909590982]
[null,"Business",null,3896130400,{"$f":"IFERROR(INDEX('Public transport'!$J$23:$J$50,MATCH($B$5&B15,'Public transport'!$D$23:$D$50,0),),0)","v":3.7503386367268597E-2},1461180.8372846076,null,4.3128894322358884E-2,1680357.9628772985]
[null,"Residential",null,39537398501,{"$f":"IFERROR(INDEX('Public transport'!$J$23:$J$50,MATCH($B$5&B16,'Public transport'!$D$23:$D$50,0),),0)","v":3.431507599612197E-2},13567288.342507739,null,3.946233739554026E-2,15602381.593883898]
[null,"Rural",null,595945550,{"$f":"IFERROR(INDEX('Public transport'!$J$23:$J$50,MATCH($B$5&B17,'Public transport'!$D$23:$D$50,0),),0)","v":8.7590147603388378E-3},52198.958688082472,null,1.0072866974389662E-2,60028.802491294839]
["Stadium purposes rate","Regional CBD",null,7963363000,{"$f":"IFERROR(INDEX(Stadium!$H$23:$H$49,MATCH($B$5&B18,Stadium!$D$23:$D$49,0),),0)","v":0},0,null,0,0]
[null,"Business",null,3896130400,{"$f":"IFERROR(INDEX(Stadium!$H$23:$H$49,MATCH($B$5&B19,Stadium!$D$23:$D$49,0),),0)","v":0},0,null,0,0]
[null,"Residential",null,39537398501,{"$f":"IFERROR(INDEX(Stadium!$H$23:$H$49,MATCH($B$5&B20,Stadium!$D$23:$D$49,0),),0)","v":0},0,null,0,0]
[null,"Rural",null,595945550,{"$f":"IFERROR(INDEX(Stadium!$H$23:$H$49,MATCH($B$5&B21,Stadium!$D$23:$D$49,0),),0)","v":0},0,null,0,0]
["Wellington regional strategy rate","Regional CBD",null,7963363000,{"$f":"IFERROR(INDEX(WRS!$L$23:$L$49,MATCH($B$5&B22,WRS!$D$23:$D$49,0),),0)","v":1.1225542085297009E-2},893930.66496997047,null,1.290937339809156E-2,1028020.2647154659]
[null,"Business",null,3896130400,{"$f":"IFERROR(INDEX(WRS!$L$23:$L$49,MATCH($B$5&B23,WRS!$D$23:$D$49,0),),0)","v":1.1225542085297009E-2},437361.75775005075,null,1.290937339809156E-2,502966.02141255833]
[]
["Rate","Categories",null,"Number of assessments","Amount per rating unit","Rates Set",null,"Amount per rating unit","Rates Set"]
[null,null,null,"#","$","$",null,"$","$"]
[{"$f":"+A22","v":"Wellington regional strategy rate"},"Residential",null,{"$f":"IFERROR(INDEX(WRS!$G$23:$G$49,MATCH($B$5&B27,WRS!$D$23:$D$49,0),),0)","v":71308},{"$f":"INDEX(WRS_value,MATCH(B27,WRS_categories,0),)","v":14},{"$f":"D27*E27","v":998312},null,{"$f":"+E27*(1+GST)","v":16.099999999999998},{"$f":"+F27*(1+GST)","v":1148058.7999999998}]
[null,"Rural",null,{"$f":"IFERROR(INDEX(WRS!$G$23:$G$49,MATCH($B$5&B28,WRS!$D$23:$D$49,0),),0)","v":781},{"$f":"INDEX(WRS_value,MATCH(B28,WRS_categories,0),)","v":28},{"$f":"D28*E28","v":21868},null,{"$f":"+E28*(1+GST)","v":32.199999999999996},{"$f":"+F28*(1+GST)","v":25148.199999999997}]
[]
[]
["District-Wide Rates",null,null,null,null,{"$f":"SUM(F12:F29)","v":66367076.206934474},null,null,{"$f":"SUM(I12:I29)","v":76322137.63797462}]
[]
[]
["Rate","Categories",null,"No of Hectares","Cents Per","Rates",null,"Cents Per","Rates"]
[null,null,null,"#","$","$",null,"$","$"]
["Pest management rate",null,null,{"$f":"INDEX(Pest!$B$10:$B$18,MATCH(B5,Pest!$A$10:$A$18,0),)","v":34055},{"$f":"INDEX(Pest!$C$10:$C$18,MATCH(B5,Pest!$A$10:$A$18,0),)","v":0.86682366680113054},{"$f":"+D36*E36","v":29519.679972912501},null,{"$f":"+E36*(1+GST)","v":0.99684721682130006},{"$f":"+F36*(1+GST)","v":33947.631968849375}]
[]
[]
["Rate","Categories",null,"Rateable Capital Value or Land Value","Cents in Dollar","Rates Set",null,"Cents in Dollar","Rates Set"]
[null,null,null,"$","Cents / $","$",null,"Cents / $","$"]
["Greytown river management rate","Greytown Urban -CV",null,{"$f":"INDEX('Capital values'!$E$48:$F$49,MATCH(B41,'Capital values'!$A$48:$A$49,0),MATCH(\"CV \"&year_current,capital_values_header,0))","v":739130000},{"$f":"IF($B$5=\"South Wairarapa District\",INDEX('River management'!$D$29:$D$30,MATCH(A41,'River management'!$A$29:$A$30,0),),0)","v":0},{"$f":"+E41*D41/100","v":0},null,{"$f":"+E41*(1+GST)","v":0},{"$f":"+F41*(1+GST)","v":0}]
["Donalds Creek stopbank river management rate","Featherston Urban - LV",null,{"$f":"INDEX('Capital values'!$E$48:$F$49,MATCH(B42,'Capital values'!$A$48:$A$49,0),MATCH(\"CV \"&year_current,capital_values_header,0))","v":162213500},{"$f":"IF($B$5=\"South Wairarapa District\",INDEX('River management'!$D$29:$D$30,MATCH(A42,'River management'!$A$29:$A$30,0),),0)","v":0},0,null,{"$f":"+E42*(1+GST)","v":0},{"$f":"+F42*(1+GST)","v":0}]
[]
[]
["Total regional rates (excl special rates)",null,null,null,null,{"$f":"SUM(F31:F44)","v":66396595.886907384},null,null,{"$f":"SUM(I31:I44)","v":76356085.269943476}]
[]
["Check",null,null,null,null,{"$f":"INDEX('Comparison - TA'!$B$43:$L$43,,MATCH(B5,'Comparison - TA'!$B$29:$L$29,0))-F45","v":0}]

{"sheet":"Rates Check - UHC","index":20,"n_rows":58,"n_cols":9,"rows_kept":58,"cut":false,"hidden":false,"merged":[[26,0,27,0],[47,0,49,0],[50,0,52,0],[6,3,6,5],[6,7,6,8],[7,3,7,5],[13,0,16,0],[17,0,20,0],[21,0,22,0]]}
["Wellington Regional Council"]
[{"$f":"B5&\" Check \"&year_current","v":"Upper Hutt city Check 2018/19"}]
[{"$f":"check_total","v":0}]
["Printed: ",{"$f":"NOW()","v":"2018-11-12T16:52:19.590"}]
["TA to view","Upper Hutt city"]
[]
[null,null,null,"Excluding GST",null,null,null,"Including GST"]
[]
[]
["Rate","Categories",null,"Rateable Capital Value","Cents in Dollar","Rates Set",null,"Cents in Dollar","Rates Set"]
[null,null,null,"$","Cents / $","$",null,"Cents / $","$"]
["General rate ","District wide",null,{"$f":"'UHCC Adjustments'!$D$20","v":8098656260},{"$f":"Gen!E24","v":3.7522778909524594E-2},{"$f":"+E12*D12/100","v":3038840.8830821733},null,{"$f":"+E12*(1+GST)","v":4.3151195745953282E-2},3494667.0155444988]
["River management rate","District wide",null,{"$f":"'UHCC Adjustments'!$D$20","v":8098656260},{"$f":"'River management'!D24","v":8.1664192834855816E-3},{"$f":"+E13*D13/100","v":661370.22651985218},null,9.3913821760084181E-3,760575.76049782999]
["Public transport rate","Regional CBD",null,0,0,0,null,0,0]
[null,"Business",null,{"$f":"'UHCC Adjustments'!D16","v":1118351500},{"$f":"'Public transport'!J55","v":6.1941086618388853E-2},692719.07131305104,null,7.1232249611147172E-2,796626.9320100086]
[null,"Residential",null,{"$f":"'UHCC Adjustments'!D17","v":6130268420},{"$f":"'Public transport'!J57","v":6.0549972571654891E-2},3711875.846878822,null,6.9632468457403118E-2,4268657.2239106447]
[null,"Rural",null,{"$f":"'UHCC Adjustments'!D18","v":850036340},{"$f":"'Public transport'!J59","v":1.5366243043867274E-2},130618.64996559397,null,1.7671179500447363E-2,150211.44746043306]
["Stadium purposes rate","Regional CBD",null,0,0,0,null,0,0]
[null,"Business",null,{"$f":"'UHCC Adjustments'!D16","v":1118351500},{"$f":"Stadium!H55","v":0},0,null,0,0]
[null,"Residential",null,{"$f":"'UHCC Adjustments'!D17","v":6130268420},{"$f":"Stadium!H57","v":0},0,null,0,0]
[null,"Rural",null,{"$f":"'UHCC Adjustments'!D18","v":850036340},{"$f":"Stadium!H59","v":0},0,null,0,0]
["Wellington regional strategy rate","Regional CBD",null,0,{"$f":"IFERROR(INDEX(WRS!$L$23:$L$49,MATCH($B$5&B22,WRS!$D$23:$D$49,0),),0)","v":0},0,null,0,0]
[null,"Business",null,{"$f":"'UHCC Adjustments'!D16","v":1118351500},{"$f":"IFERROR(INDEX(WRS!$L$23:$L$49,MATCH($B$5&B23,WRS!$D$23:$D$49,0),),0)","v":9.4809885646007976E-3},106030.77782704149,null,1.0903136849290916E-2,121935.3945010977]
[]
["Rate","Categories",null,"Number of assessments","Amount per rating unit","Rates Set",null,"Amount per rating unit","Rates Set"]
[null,null,null,"#","$","$",null,"$","$"]
[{"$f":"+A22","v":"Wellington regional strategy rate"},"Residential",null,{"$f":"IFERROR(INDEX(WRS!$G$23:$G$49,MATCH($B$5&B27,WRS!$D$23:$D$49,0),),0)","v":14780},{"$f":"INDEX(WRS_value,MATCH(B27,WRS_categories,0),)","v":14},{"$f":"D27*E27","v":206920},null,{"$f":"+E27*(1+GST)","v":16.099999999999998},{"$f":"+F27*(1+GST)","v":237957.99999999997}]
[null,"Rural",null,{"$f":"IFERROR(INDEX(WRS!$G$23:$G$49,MATCH($B$5&B28,WRS!$D$23:$D$49,0),),0)","v":1172},{"$f":"INDEX(WRS_value,MATCH(B28,WRS_categories,0),)","v":28},{"$f":"D28*E28","v":32816},null,{"$f":"+E28*(1+GST)","v":32.199999999999996},{"$f":"+F28*(1+GST)","v":37738.399999999994}]
[]
[]
["District-Wide Rates",null,null,null,null,{"$f":"SUM(F12:F29)","v":8581191.455586534},null,null,{"$f":"SUM(I12:I29)","v":9868370.1739245132}]
[]
[]
["Rate","Categories",null,"No of Hectares","Cents Per","Rates",null,"Cents Per","Rates"]
[null,null,null,"#","$","$",null,"$","$"]
["Pest management rate",null,null,{"$f":"INDEX(Pest!$B$10:$B$18,MATCH(B5,Pest!$A$10:$A$18,0),)","v":54326.211900000002},{"$f":"INDEX(Pest!$C$10:$C$18,MATCH(B5,Pest!$A$10:$A$18,0),)","v":0.86682366680113054},{"$f":"+D36*E36","v":47091.246202573217},null,{"$f":"+E36*(1+GST)","v":0.99684721682130006},{"$f":"+F36*(1+GST)","v":54154.933132959195}]
[]
[]
["Total regional rates (excl special rates)",null,null,null,null,{"$f":"SUM(F31:F38)","v":8628282.7017891072},null,null,{"$f":"SUM(I31:I38)","v":9922525.1070574727}]
[]
[]
[]
["Trentham Military Camp"]
["Rate","Categories",null,"Rateable Capital Value","Cents in Dollar","Rates Set",null,"Cents in Dollar","Rates Set"]
[null,null,null,"$","Cents / $","$",null,"Cents / $","$"]
["General rate ","Trentham Military Camp",null,{"$f":"Gen!B23","v":87721000},{"$f":"IF(B5=\"Upper Hutt City\",Gen!E23,0)","v":2.9813114941177315E-2},{"$f":"+E46*D46/100","v":26152.36255755015},null,{"$f":"+E46*(1+GST)","v":3.4285082182353911E-2},30075.216941182669]
["River management rate","Trentham Military Camp",null,{"$f":"'River management'!B23","v":87721000},{"$f":"IF(B5=\"Upper Hutt City\",'River management'!D23,0)","v":6.4884958905482926E-3},5691.7734801478673,null,7.4617702741305355E-3,6545.5395021700469]
["Public transport rate","Business",null,{"$f":"'Public transport'!E54","v":56325000},{"$f":"IF(B5=\"Upper Hutt City\",'Public transport'!J54,0)","v":8.7633977779935146E-2},49359.837984548474,null,0.10077907444692541,56763.813682230742]
[null,"Residential",null,{"$f":"'Public transport'!E56","v":26720000},{"$f":"IF(B5=\"Upper Hutt City\",'Public transport'!J56,0)","v":4.4478829718661267E-2},11884.743300826291,null,5.1150654176460454E-2,13667.454795950232]
[null,"Rural",null,{"$f":"'Public transport'!E58","v":4676000},{"$f":"IF(B5=\"Upper Hutt City\",'Public transport'!J58,0)","v":1.8136056601330573E-2},848.0420066782176,null,2.0856465091530156E-2,975.24830767995013]
["Stadium purposes Rate","Business",null,{"$f":"Stadium!F54","v":56325000},{"$f":"IF(B5=\"Upper Hutt City\",Stadium!H54,0)","v":0},0,null,0,0]
[null,"Residential",null,{"$f":"Stadium!F56","v":26720000},{"$f":"IF(B5=\"Upper Hutt City\",Stadium!H56,0)","v":0},0,null,0,0]
[null,"Rural",null,{"$f":"Stadium!F58","v":4676000},{"$f":"IF(B5=\"Upper Hutt City\",Stadium!H58,0)","v":0},0,null,0,0]
["Wellington regional strategy rate","Business",null,{"$f":"'UHCC Adjustments'!D9","v":56325000},{"$f":"IF(B5=\"Upper Hutt City\",WRS!L30,0)","v":9.4809885646007976E-3},5340.1668090113999,null,1.0903136849290916E-2,6141.1918303631091]
[null,"No change for residential or rural as it is a fixed charge per property"]
["Trentham Military Camp",null,null,null,null,{"$f":"SUM(F46:F55)","v":99276.926138762399},null,null,{"$f":"SUM(I46:I55)","v":114168.46505957676}]
[]
["Check",null,null,null,null,{"$f":"ROUND(INDEX('Comparison - TA'!$B$43:$L$43,,MATCH(B5,'Comparison - TA'!$B$29:$L$29,0))-F39-F56,0)","v":0}]

{"sheet":"Rates Check - KCDC","index":21,"n_rows":43,"n_cols":9,"rows_kept":43,"cut":false,"hidden":false,"merged":[[23,0,24,0],[28,0,29,0],[6,3,6,5],[6,7,6,8],[7,3,7,5],[13,0,17,0],[18,0,22,0]]}
["Wellington Regional Council"]
[{"$f":"B5&\" Check \"&year_current","v":"Kāpiti Coast district Check 2018/19"}]
[{"$f":"check_total","v":0}]
["Printed: ",{"$f":"NOW()","v":"2018-11-12T16:52:19.590"}]
["TA to view","Kāpiti Coast district"]
[]
[null,null,null,"Excluding GST",null,null,null,"Including GST"]
[]
["Total"]
["Rate","Categories",null,"Rateable Capital Value","Cents in Dollar","Rates Set",null,"Cents in Dollar","Rates Set"]
[null,null,null,"$","Cents / $","$",null,"Cents / $","$"]
["General rate","District wide",null,{"$f":"INDEX(capital_values,MATCH($B$5&B12,capital_values_rows,0),MATCH(\"CV \"&year_current,capital_values_header,0))","v":14770315600},{"$f":"INDEX(Gen!$E$10:$E$19,MATCH(B5,Gen!$A$10:$A$19,0),)","v":3.3208045954726456E-2},{"$f":"+E12*D12/100","v":4904933.1921061305},null,{"$f":"+E12*(1+GST)","v":3.8189252847935423E-2},5640673.1709220493]
["River management rate","District wide",null,{"$f":"INDEX(capital_values,MATCH($B$5&B13,capital_values_rows,0),MATCH(\"CV \"&year_current,capital_values_header,0))","v":14770315600},{"$f":"INDEX('River management'!$D$10:$D$19,MATCH(B5,'River management'!$A$10:$A$19,0),)","v":9.0409374868063077E-3},{"$f":"+E13*D13/100","v":1335375},null,1.0397078109827254E-2,1535681.2499999998]
["Public transport rate","Regional CBD",null,{"$f":"IFERROR(INDEX(capital_values,MATCH($B$5&B14,capital_values_rows,0),MATCH(\"CV \"&year_current,capital_values_header,0)),0)","v":0},{"$f":"IFERROR(INDEX('Public transport'!$J$23:$J$52,MATCH($B$5&B14,'Public transport'!$D$23:$D$52,0),),0)","v":0},0,null,0,0]
[null,"Business",null,1479149500,{"$f":"IFERROR(INDEX('Public transport'!$J$23:$J$52,MATCH($B$5&B15,'Public transport'!$D$23:$D$52,0),),0)","v":2.9376984703201457E-2},434529.5223524808,null,3.378353240868167E-2,499708.95070535288]
[null,"Residential - excl-Otaki",null,{"$f":"IFERROR(INDEX(capital_values,MATCH(\"Kāpiti Coast district excl Ōtaki Residential\",capital_values_rows,0),MATCH(\"CV \"&year_current,capital_values_header,0)),0)","v":10219999500},{"$f":"IFERROR(INDEX('Public transport'!$J$23:$J$52,MATCH(\"Kāpiti Coast district excl Ōtaki Residential\",'Public transport'!$D$23:$D$52,0),),0)","v":2.6988555093639063E-2},2758230.1956271366,null,3.103683835768492E-2,3171964.7249712069]
[null,"Residential - Otaki",null,{"$f":"IFERROR(INDEX(capital_values,MATCH(\"Ōtaki rating areaResidential\",capital_values_rows,0),MATCH(\"CV \"&year_current,capital_values_header,0)),0)","v":1104760900},{"$f":"IFERROR(INDEX('Public transport'!$J$23:$J$52,MATCH(\"Ōtaki rating areaResidential\",'Public transport'!$D$23:$D$52,0),),0)","v":2.4003018081686076E-2},265175.95858639781,null,{"$f":"+E17*(1+GST)","v":2.7603470793938985E-2},{"$f":"+F17*(1+GST)","v":304952.35237435746}]
[null,"Rural",null,1966405700,{"$f":"IFERROR(INDEX('Public transport'!$J$23:$J$52,MATCH($B$5&B18,'Public transport'!$D$23:$D$52,0),),0)","v":6.9301501773774117E-3},136274.86810650953,null,{"$f":"+E18*(1+GST)","v":7.9696727039840227E-3},{"$f":"+F18*(1+GST)","v":156716.09832248595}]
["Stadium purposes rate","Regional CBD",null,0,{"$f":"IFERROR(INDEX(Stadium!$H$23:$H$49,MATCH($B$5&B19,Stadium!$D$23:$D$49,0),),0)","v":0},0,null,0,0]
[null,"Business",null,1479149500,{"$f":"IFERROR(INDEX(Stadium!$H$23:$H$49,MATCH($B$5&B20,Stadium!$D$23:$D$49,0),),0)","v":0},0,null,0,0]
[null,"Residential - excl-Otaki",null,{"$f":"IFERROR(INDEX(capital_values,MATCH(\"Kāpiti Coast district excl Ōtaki Residential\",capital_values_rows,0),MATCH(\"CV \"&year_current,capital_values_header,0)),0)","v":10219999500},{"$f":"IFERROR(INDEX(Stadium!$H$23:$H$49,MATCH(\"Kāpiti Coast district excl Ōtaki Residential\",Stadium!$D$23:$D$49,0),),0)","v":0},0,null,0,0]
[null,"Residential - Otaki",null,{"$f":"IFERROR(INDEX(capital_values,MATCH(\"Ōtaki rating areaResidential\",capital_values_rows,0),MATCH(\"CV \"&year_current,capital_values_header,0)),0)","v":1104760900},{"$f":"IFERROR(INDEX(Stadium!$H$23:$H$49,MATCH(\"Ōtaki rating areaResidential\",Stadium!$D$23:$D$49,0),),0)","v":0},{"$f":"+E22*D22/100","v":0},null,{"$f":"+E22*(1+GST)","v":0},{"$f":"+F22*(1+GST)","v":0}]
[null,"Rural",null,1966405700,{"$f":"IFERROR(INDEX(Stadium!$H$23:$H$49,MATCH($B$5&B23,Stadium!$D$23:$D$49,0),),0)","v":0},0,null,0,0]
["Wellington regional strategy rate","Regional CBD",null,0,{"$f":"IFERROR(INDEX(WRS!$L$23:$L$49,MATCH($B$5&B24,WRS!$D$23:$D$49,0),),0)","v":0},0,null,0,0]
[null,"Business",null,1479149500,{"$f":"IFERROR(INDEX(WRS!$L$23:$L$49,MATCH($B$5&B25,WRS!$D$23:$D$49,0),),0)","v":8.4092870451222008E-3},124385.9272814898,null,9.6706801018905299E-3,143043.81637371326]
[]
["Rate","Categories",null,"Number of assessments","Amount per rating unit","Rates Set",null,"Amount per rating unit","Rates Set"]
[null,null,null,"#","$","$",null,"$","$"]
[{"$f":"+A24","v":"Wellington regional strategy rate"},"Residential",null,{"$f":"SUMIFS(WRS!$G$23:$G$49,WRS!$A$23:$A$49,$B$5,WRS!$C$23:$C$49,$B29)","v":20824},{"$f":"F29/D29","v":14},{"$f":"SUMIFS(WRS!$K$23:$K$49,WRS!$A$23:$A$49,$B$5,WRS!$C$23:$C$49,$B29)","v":291536},null,{"$f":"+E29*(1+GST)","v":16.099999999999998},335266.39999999997]
[null,"Rural",null,{"$f":"SUMIFS(WRS!$G$23:$G$49,WRS!$A$23:$A$49,$B$5,WRS!$C$23:$C$49,$B30)","v":2486},{"$f":"F30/D30","v":28},{"$f":"SUMIFS(WRS!$K$23:$K$49,WRS!$A$23:$A$49,$B$5,WRS!$C$23:$C$49,$B30)","v":69608},null,32.199999999999996,80049.2]
[]
[]
["District-Wide Rates",null,null,null,null,{"$f":"SUM(F12:F31)","v":10320048.664060144},null,null,{"$f":"SUM(I12:I31)","v":11868055.963669168}]
[]
[]
["Rate","Categories",null,"No of Hectares","Cents Per","Rates",null,"Cents Per","Rates"]
[null,null,null,"#","$","$",null,"$","$"]
["Pest management rate",null,null,{"$f":"INDEX(Pest!$B$10:$B$18,MATCH(B5,Pest!$A$10:$A$18,0),)","v":29205.998500000002},{"$f":"INDEX(Pest!$C$10:$C$18,MATCH(B5,Pest!$A$10:$A$18,0),)","v":0.86682366680113054},{"$f":"+D38*E38","v":25316.450712358321},null,{"$f":"+E38*(1+GST)","v":0.99684721682130006},{"$f":"+F38*(1+GST)","v":29113.918319212065}]
[]
[]
["Total regional rates (excl special rates)",null,null,null,null,{"$f":"SUM(F33:F40)","v":10345365.114772502},null,null,{"$f":"SUM(I33:I40)","v":11897169.88198838}]
[]
["Check",null,null,null,null,{"$f":"INDEX('Comparison - TA'!$B$43:$L$43,,MATCH(B5,'Comparison - TA'!$B$29:$L$29,0))-F41","v":0}]

{"sheet":"Checks","index":22,"n_rows":46,"n_cols":4,"rows_kept":46,"cut":false,"hidden":false,"merged":[[2,0,2,1]]}
["Wellington Regional Council"]
["Value checks"]
[{"$f":"check_total","v":0}]
[]
["Tab/component","Check",null,"Check notes"]
[]
["OVERALL",{"$f":"SUM(B9:B47)","v":0},null,"checked ok"]
[]
[]
["Capital values tab"]
["Populated",{"$f":"SUM('Capital values'!J8:K140)","v":0}]
["TA total matches category"]
["Capital values",{"$f":"SUM('Capital values'!E51:F51)","v":0}]
["No. of Assessments (#)",{"$f":"SUM('Capital values'!E97:F97)","v":0}]
["Number of Assessments Contiguous for WRS",{"$f":"SUM('Capital values'!E143:F143)","v":0}]
[]
["Rate model checks"]
["General rate",{"$f":"SUM(Gen!B28:D29)","v":0}]
["River management rate",{"$f":"SUM('River management'!B34:C36)","v":0}]
["Stadium rate",{"$f":"SUM(Stadium!E63:G66)","v":0}]
["Wellington regional strategy rate",{"$f":"SUM(WRS!E52:K54)","v":0}]
["Public transport rate",{"$f":"SUM('Public transport'!E63:I66)","v":0}]
["Pest management rate",{"$f":"SUM(Pest!B21:D21)","v":0}]
["Water Levy",{"$f":"SUM('Water levy'!B21:C21)","v":0}]
["Class rates - schemes",{"$f":"SUM('Class Rates'!B141:H141)","v":0}]
[]
["Comparison - TA",{"$f":"SUM('Comparison - TA'!M7:M68)","v":0}]
[]
["Comparison - category"]
["Previous year",{"$f":"SUM('Comparison - Category'!F59:V61)","v":0}]
["Current year",{"$f":"SUM('Comparison - Category'!F118:V120)","v":0}]
["Delta",{"$f":"SUM('Comparison - Category'!F177:V179)","v":0}]
[]
["Rates check"]
["ex-KCDC & UHC",{"$f":"'Rates Check - ex-KCDC &  UHC'!F47","v":0}]
["UHC",{"$f":"'Rates Check - UHC'!F58","v":0}]
["KCDC",{"$f":"'Rates Check - KCDC'!F43","v":0}]
[]
["Rates"]
[1,{"$f":"SUM('1'!J19:K42)","v":0}]
[2,{"$f":"SUM('2'!J21:K40)","v":0}]
["3 - changes",{"$f":"SUM('3'!V14:Y39)","v":0}]
["3 - inputs",{"$f":"SUM('3'!V64:V124)","v":0}]
[4,{"$f":"SUM('4'!T16:U24)","v":0}]
[5,{"$f":"SUM('5'!P20:Q42)","v":0}]
["Impact for annual plan",{"$f":"Impact!L258+Impact!L262","v":0}]

{"sheet":">>Rates","index":23,"n_rows":0,"n_cols":0,"rows_kept":0,"cut":false,"hidden":false,"merged":[]}

{"sheet":"1","index":24,"n_rows":47,"n_cols":11,"rows_kept":47,"cut":false,"hidden":false,"merged":[[45,0,45,4],[46,0,46,4],[2,0,2,4],[3,0,3,4],[5,0,5,4],[7,0,7,4],[4,0,4,4],[9,0,9,4],[44,0,44,4]]}
["Summary of Rates and Water Levies"]
[]
["Rates for Greater Wellington are mostly allocated to ratepayers on the basis of their capital values. Within the region, different territorial authorities undertake general revaluations at different times. To equalise the values, each year Council gets Quotable Value or another registered valuer to estimate the projected valuations of all the rateable land in the districts within the region. This means that rates are assessed on a consistent valuation basis, regardless of the timing of individual territorial authority revaluations."]
["The summary information in this section should be read in conjunction with the Funding Impact Statement and the Revenue and Financing policy. \n"]
["All figures on this page exclude GST."]
[{"$f":"\"This table shows the rates and levies for GWRC in \"&year_current&\", with the changes from last year \"&year_previous&\". Rates comprise the general rate and various targeted rates. GWRC also charges a water supply levy directly to the four city councils in the region, and they set their own rates to cover the cost of this levy.\"","v":"This table shows the rates and levies for GWRC in 2018/19, with the changes from last year 2017/18. Rates comprise the general rate and various targeted rates. GWRC also charges a water supply levy directly to the four city councils in the region, and they set their own rates to cover the cost of this levy."}]
[]
[{"$f":"\"The total rate increase in regional rates for \"&year_current&\" is \"&ROUND(E34*100,1)&\"%. The water supply levy, which is charged to the four metropolitan city councils is proposed to increase by \"&ROUND(E36*100,1)&\"% compared to 2017/18. When the water supply levy is included, Greater Wellington Regional Council's overall increase is \"&ROUND(E38*100,1)&\"%\"","v":"The total rate increase in regional rates for 2018/19 is 6.7%. The water supply levy, which is charged to the four metropolitan city councils is proposed to increase by 7.1% compared to 2017/18. When the water supply levy is included, Greater Wellington Regional Council's overall increase is 6.8%"}]
[]
["Summary of rates and levies"]
[null,{"$f":"year_previous","v":"2017/18"},{"$f":"year_current","v":"2018/19"}]
[null,"Plan","Plan","Change","Change"]
[null,"$000s","$000s","$000s","%  ",null,"Row lookup","Column lookup"]
["General rates"]
[{"$f":"ESSbase!C38","v":"Catchment Management (excluding forests)"},{"$f":"ESSbase!F38/1000","v":21662.719477799379},{"$f":"ESSbase!G38/1000","v":22664.845332558594},{"$f":"C15-B15","v":1002.1258547592151},{"$f":"ROUND(D15/B15,4)","v":4.6300000000000001E-2}]
["Other",{"$f":"ESSbase!F43/1000-SUM(B15,B17:B18)","v":25441.153851229068},{"$f":"ESSbase!G43/1000-SUM(C15,C17:C18)","v":27399.393148735166},1958.2392975060975,{"$f":"ROUND(D16/B16,4)","v":7.6999999999999999E-2}]
[{"$f":"ESSbase!C39","v":"Strategy Group"},{"$f":"ESSbase!F39/1000","v":5273.3592280416124},{"$f":"ESSbase!G39/1000","v":6358.5680637109208},1085.2088356693084,{"$f":"ROUND(D17/B17,4)","v":0.20580000000000001}]
[{"$f":"ESSbase!C41","v":"Investment Management."},{"$f":"ESSbase!F41/1000","v":-9897.8937680854469},{"$f":"ESSbase!G41/1000","v":-9139.4926378468681},758.40113023857884,{"$f":"-ROUND(D18/B18,4)","v":7.6600000000000001E-2}]
["General rate",{"$f":"INDEX('Comparison - TA'!$B$7:$L$24,MATCH(G19,'Comparison - TA'!$A$7:$A$24,0),MATCH(H19,'Comparison - TA'!$B$6:$L$6,0))/1000","v":42481.670520543601},{"$f":"INDEX('Comparison - TA'!$B$30:$L$47,MATCH(G19,'Comparison - TA'!$A$30:$A$47,0),MATCH(H19,'Comparison - TA'!$B$29:$L$29,0))/1000","v":47283.313907157812},4801.6433866142106,{"$f":"ROUND(D19/B19,4)","v":0.113},null,"General rate","Region wide",null,{"$f":"INDEX(ess_base_estract,MATCH($A19,ESSbase!$B$8:$B$25,0),MATCH(B$11,ESSbase!$F$6:$G$6,0))/1000-B19","v":0},{"$f":"INDEX(ess_base_estract,MATCH($A19,ESSbase!$B$8:$B$25,0),MATCH(C$11,ESSbase!$F$6:$G$6,0))/1000-C19","v":0}]
[]
["Targeted rates"]
["Region wide targeted rates1"]
["River management rate",{"$f":"INDEX('Comparison - TA'!$B$7:$L$24,MATCH(G23,'Comparison - TA'!$A$7:$A$24,0),MATCH(H23,'Comparison - TA'!$B$6:$L$6,0))/1000","v":5826.6604174182212},{"$f":"INDEX('Comparison - TA'!$B$30:$L$47,MATCH(G23,'Comparison - TA'!$A$30:$A$47,0),MATCH(H23,'Comparison - TA'!$B$29:$L$29,0))/1000","v":6458.9708070691349},{"$f":"C23-B23","v":632.31038965091375},{"$f":"ROUND(D23/B23,4)","v":0.1085},null,"River management rate","Region wide",null,{"$f":"INDEX(ess_base_estract,MATCH($A23,ESSbase!$B$8:$B$25,0),MATCH(B$11,ESSbase!$F$6:$G$6,0))/1000-B23","v":0},{"$f":"INDEX(ess_base_estract,MATCH($A23,ESSbase!$B$8:$B$25,0),MATCH(C$11,ESSbase!$F$6:$G$6,0))/1000-C23","v":0}]
["Public transport rate",{"$f":"INDEX('Comparison - TA'!$B$7:$L$24,MATCH(G24,'Comparison - TA'!$A$7:$A$24,0),MATCH(H24,'Comparison - TA'!$B$6:$L$6,0))/1000","v":64656.396127130902},{"$f":"INDEX('Comparison - TA'!$B$30:$L$47,MATCH(G24,'Comparison - TA'!$A$30:$A$47,0),MATCH(H24,'Comparison - TA'!$B$29:$L$29,0))/1000","v":68109.677793629249},3453.2816664983475,{"$f":"ROUND(D24/B24,4)","v":5.3400000000000003E-2},null,"Public transport rate","Region wide",null,{"$f":"INDEX(ess_base_estract,MATCH($A24,ESSbase!$B$8:$B$25,0),MATCH(B$11,ESSbase!$F$6:$G$6,0))/1000-B24","v":0},{"$f":"INDEX(ess_base_estract,MATCH($A24,ESSbase!$B$8:$B$25,0),MATCH(C$11,ESSbase!$F$6:$G$6,0))/1000-C24","v":0}]
["Stadium purposes rate",{"$f":"INDEX('Comparison - TA'!$B$7:$L$24,MATCH(G25,'Comparison - TA'!$A$7:$A$24,0),MATCH(H25,'Comparison - TA'!$B$6:$L$6,0))/1000","v":978.09134999999992},{"$f":"INDEX('Comparison - TA'!$B$30:$L$47,MATCH(G25,'Comparison - TA'!$A$30:$A$47,0),MATCH(H25,'Comparison - TA'!$B$29:$L$29,0))/1000","v":0},-978.09134999999992,-1,null,"Stadium purposes rate","Region wide",null,{"$f":"INDEX(ess_base_estract,MATCH($A25,ESSbase!$B$8:$B$25,0),MATCH(B$11,ESSbase!$F$6:$G$6,0))/1000-B25","v":0},{"$f":"INDEX(ess_base_estract,MATCH($A25,ESSbase!$B$8:$B$25,0),MATCH(C$11,ESSbase!$F$6:$G$6,0))/1000-C25","v":0}]
["Wellington regional strategy rate",{"$f":"INDEX('Comparison - TA'!$B$7:$L$24,MATCH(G26,'Comparison - TA'!$A$7:$A$24,0),MATCH(H26,'Comparison - TA'!$B$6:$L$6,0))/1000","v":4822.0172188234974},{"$f":"INDEX('Comparison - TA'!$B$30:$L$47,MATCH(G26,'Comparison - TA'!$A$30:$A$47,0),MATCH(H26,'Comparison - TA'!$B$29:$L$29,0))/1000","v":4907.860820873193},85.843602049695619,1.78E-2,null,"Wellington regional strategy rate","Region wide",null,{"$f":"INDEX(ess_base_estract,MATCH($A26,ESSbase!$B$8:$B$25,0),MATCH(B$11,ESSbase!$F$6:$G$6,0))/1000-B26","v":0},{"$f":"INDEX(ess_base_estract,MATCH($A26,ESSbase!$B$8:$B$25,0),MATCH(C$11,ESSbase!$F$6:$G$6,0))/1000-C26","v":0}]
[]
["Specific area targeted rates:"]
["Pest management rate",{"$f":"INDEX('Comparison - TA'!$B$7:$L$24,MATCH(G29,'Comparison - TA'!$A$7:$A$24,0),MATCH(H29,'Comparison - TA'!$B$6:$L$6,0))/1000","v":472},{"$f":"INDEX('Comparison - TA'!$B$30:$L$47,MATCH(G29,'Comparison - TA'!$A$30:$A$47,0),MATCH(H29,'Comparison - TA'!$B$29:$L$29,0))/1000","v":532},{"$f":"C29-B29","v":60},{"$f":"ROUND(D29/B29,4)","v":0.12709999999999999},null,"Pest management rate","Region wide",null,{"$f":"INDEX(ess_base_estract,MATCH($A29,ESSbase!$B$8:$B$25,0),MATCH(B$11,ESSbase!$F$6:$G$6,0))/1000-B29","v":0},{"$f":"INDEX(ess_base_estract,MATCH($A29,ESSbase!$B$8:$B$25,0),MATCH(C$11,ESSbase!$F$6:$G$6,0))/1000-C29","v":0}]
["South Wairarapa district – river rates",{"$f":"INDEX('Comparison - TA'!$B$7:$L$24,MATCH(G30,'Comparison - TA'!$A$7:$A$24,0),MATCH(H30,'Comparison - TA'!$B$6:$L$6,0))/1000","v":93.297359999999998},{"$f":"INDEX('Comparison - TA'!$B$30:$L$47,MATCH(G30,'Comparison - TA'!$A$30:$A$47,0),MATCH(H30,'Comparison - TA'!$B$29:$L$29,0))/1000","v":95.164000000000001},{"$f":"C30-B30","v":1.8666400000000039},{"$f":"ROUND(D30/B30,4)","v":0.02},null,"River management rate - Non district wide","Region wide",null,{"$f":"INDEX(ess_base_estract,MATCH($G30,ESSbase!$B$8:$B$25,0),MATCH(B$11,ESSbase!$F$6:$G$6,0))/1000-B30","v":0},{"$f":"INDEX(ess_base_estract,MATCH($G30,ESSbase!$B$8:$B$25,0),MATCH(C$11,ESSbase!$F$6:$G$6,0))/1000-C30","v":0}]
["Wairarapa scheme and stopbank rates",{"$f":"INDEX('Comparison - TA'!$B$7:$L$24,MATCH(G31,'Comparison - TA'!$A$7:$A$24,0),MATCH(H31,'Comparison - TA'!$B$6:$L$6,0))/1000","v":1451.756116},{"$f":"INDEX('Comparison - TA'!$B$30:$L$47,MATCH(G31,'Comparison - TA'!$A$30:$A$47,0),MATCH(H31,'Comparison - TA'!$B$29:$L$29,0))/1000","v":1487.3630000000001},35.606884000000036,2.4500000000000001E-2,null,"Special Rates","Region wide",null,{"$f":"INDEX(ess_base_estract,MATCH($G31,ESSbase!$B$8:$B$25,0),MATCH(B$11,ESSbase!$F$6:$G$6,0))/1000-B31","v":0},{"$f":"INDEX(ess_base_estract,MATCH($G31,ESSbase!$B$8:$B$25,0),MATCH(C$11,ESSbase!$F$6:$G$6,0))/1000-C31","v":0}]
["Total targeted rates 2",{"$f":"SUM(B23:B31)","v":78300.218589372627},{"$f":"SUM(C23:C31)","v":81591.036421571582},{"$f":"SUM(D23:D31)","v":3290.8178321989571},{"$f":"ROUND(D32/B32,4)","v":4.2000000000000003E-2}]
[]
["Total regional rates",{"$f":"INDEX('Comparison - TA'!$B$7:$L$24,MATCH(G34,'Comparison - TA'!$A$7:$A$24,0),MATCH(H34,'Comparison - TA'!$B$6:$L$6,0))/1000","v":120781.88910991621},{"$f":"INDEX('Comparison - TA'!$B$30:$L$47,MATCH(G34,'Comparison - TA'!$A$30:$A$47,0),MATCH(H34,'Comparison - TA'!$B$29:$L$29,0))/1000","v":128874.35032872939},{"$f":"C34-B34","v":8092.4612188131723},{"$f":"ROUND(D34/B34,6)","v":6.7001000000000005E-2},null,"Total Regnl Rates","Region wide",null,{"$f":"INDEX(ess_base_estract,MATCH($G34,ESSbase!$B$8:$B$25,0),MATCH(B$11,ESSbase!$F$6:$G$6,0))/1000-B34","v":0},{"$f":"INDEX(ess_base_estract,MATCH($G34,ESSbase!$B$8:$B$25,0),MATCH(C$11,ESSbase!$F$6:$G$6,0))/1000-C34","v":0}]
[]
["Water supply levy",{"$f":"INDEX('Comparison - TA'!$B$7:$L$24,MATCH(G36,'Comparison - TA'!$A$7:$A$24,0),MATCH(H36,'Comparison - TA'!$B$6:$L$6,0))/1000","v":30862.765437637678},{"$f":"INDEX('Comparison - TA'!$B$30:$L$47,MATCH(G36,'Comparison - TA'!$A$30:$A$47,0),MATCH(H36,'Comparison - TA'!$B$29:$L$29,0))/1000","v":33068.898040148415},{"$f":"C36-B36","v":2206.1326025107373},{"$f":"ROUND(D36/B36,6)","v":7.1482000000000004E-2},null,"Bulk Water Levies","Region wide",null,{"$f":"INDEX(ess_base_estract,MATCH($G36,ESSbase!$B$8:$B$25,0),MATCH(B$11,ESSbase!$F$6:$G$6,0))/1000-B36","v":0},{"$f":"INDEX(ess_base_estract,MATCH($G36,ESSbase!$B$8:$B$25,0),MATCH(C$11,ESSbase!$F$6:$G$6,0))/1000-C36","v":0}]
[]
["Total regional rates and levies",{"$f":"INDEX('Comparison - TA'!$B$7:$L$24,MATCH(G38,'Comparison - TA'!$A$7:$A$24,0),MATCH(H38,'Comparison - TA'!$B$6:$L$6,0))/1000","v":151644.65454755389},{"$f":"INDEX('Comparison - TA'!$B$30:$L$47,MATCH(G38,'Comparison - TA'!$A$30:$A$47,0),MATCH(H38,'Comparison - TA'!$B$29:$L$29,0))/1000","v":161943.2483688778},{"$f":"C38-B38","v":10298.593821323913},{"$f":"ROUND(D38/B38,6)","v":6.7913000000000001E-2},null,"Total Regnl Rates & levies","Region wide",null,{"$f":"INDEX(ess_base_estract,MATCH($G38,ESSbase!$B$8:$B$25,0),MATCH(B$11,ESSbase!$F$6:$G$6,0))/1000-B38","v":0},{"$f":"INDEX(ess_base_estract,MATCH($G38,ESSbase!$B$8:$B$25,0),MATCH(C$11,ESSbase!$F$6:$G$6,0))/1000-C38","v":0}]
[]
["Warm Greater Wellington rates 3",{"$f":"INDEX('Comparison - TA'!$B$7:$L$24,MATCH(G40,'Comparison - TA'!$A$7:$A$24,0),MATCH(H40,'Comparison - TA'!$B$6:$L$6,0))/1000","v":3181.7669999999998},{"$f":"INDEX('Comparison - TA'!$B$30:$L$47,MATCH(G40,'Comparison - TA'!$A$30:$A$47,0),MATCH(H40,'Comparison - TA'!$B$29:$L$29,0))/1000","v":3237.058},null,null,null,"Warm Greater Wellington rate","Region wide",null,{"$f":"INDEX(ess_base_estract,MATCH($G40,ESSbase!$B$8:$B$25,0),MATCH(B$11,ESSbase!$F$6:$G$6,0))/1000-B40","v":0},{"$f":"INDEX(ess_base_estract,MATCH($G40,ESSbase!$B$8:$B$25,0),MATCH(C$11,ESSbase!$F$6:$G$6,0))/1000-C40","v":0}]
[]
["Total rates and levies",{"$f":"INDEX('Comparison - TA'!$B$7:$L$24,MATCH(G42,'Comparison - TA'!$A$7:$A$24,0),MATCH(H42,'Comparison - TA'!$B$6:$L$6,0))/1000","v":154826.42154755391},{"$f":"INDEX('Comparison - TA'!$B$30:$L$47,MATCH(G42,'Comparison - TA'!$A$30:$A$47,0),MATCH(H42,'Comparison - TA'!$B$29:$L$29,0))/1000","v":165180.30636887779},null,null,null,"Total Rates & Levies","Region wide",null,{"$f":"INDEX(ess_base_estract,MATCH($G42,ESSbase!$B$8:$B$25,0),MATCH(B$11,ESSbase!$F$6:$G$6,0))/1000-B42","v":0},{"$f":"INDEX(ess_base_estract,MATCH($G42,ESSbase!$B$8:$B$25,0),MATCH(C$11,ESSbase!$F$6:$G$6,0))/1000-C42","v":0}]
[]
[]
["1  Region-wide rates are charged to all ratepayers in the region. They exclude targeted rates for pest management, Wairarapa river and drainage schemes, and \"Warm Greater Wellington\", because those rates only apply to highly specific ratepayers in those work programmes."]
["2 This total excludes \"Warm Greater Wellington\" targeted rates because they only apply to ratepayers who participate in the scheme."]
["3   The Warm Greater Wellington scheme assists regional ratepayers to insulate thier homes. Only ratepayers who participate in the scheme are charged this rate. "]

{"sheet":"2","index":25,"n_rows":45,"n_cols":11,"rows_kept":45,"cut":false,"hidden":false,"merged":[[42,0,42,4],[43,0,43,4],[44,0,44,4],[2,0,4,4],[7,0,7,4]]}
["Impact on each City and District"]
[]
["Rates increases vary among cities and districts  because of differing equalised capital values. Targeted  rates are applied according to the Revenue and Financing policy. The next page shows the different rates paid in each city and district. "]
[]
[]
["All figures on this page exclude GST."]
[]
["Impact on each city and district"]
[null,{"$f":"year_previous","v":"2017/18"},{"$f":"year_current","v":"2018/19"}]
[null,"Plan","Plan","Change","Change",null,"Row lookup","Column lookup"]
["Region-wide rates1","$000s","$000s","$000s","%  "]
["Wellington city",{"$f":"INDEX('Comparison - TA'!$B$7:$L$24,MATCH(G12,'Comparison - TA'!$A$7:$A$24,0),MATCH(H12,'Comparison - TA'!$B$6:$L$6,0))/1000","v":62570.978382812369},{"$f":"INDEX('Comparison - TA'!$B$30:$L$47,MATCH(G12,'Comparison - TA'!$A$30:$A$47,0),MATCH($H12,'Comparison - TA'!$B$29:$L$29,0))/1000","v":66367.076206934464},{"$f":"C12-B12","v":3796.0978241220946},{"$f":"ROUND(+D12/B12,4)","v":6.0699999999999997E-2},null,"District-wide rates","Wellington city"]
["Hutt city",{"$f":"INDEX('Comparison - TA'!$B$7:$L$24,MATCH(G13,'Comparison - TA'!$A$7:$A$24,0),MATCH(H13,'Comparison - TA'!$B$6:$L$6,0))/1000","v":23454.231569882813},{"$f":"INDEX('Comparison - TA'!$B$30:$L$47,MATCH(G13,'Comparison - TA'!$A$30:$A$47,0),MATCH($H13,'Comparison - TA'!$B$29:$L$29,0))/1000","v":25013.959922775946},{"$f":"C13-B13","v":1559.728352893133},{"$f":"ROUND(+D13/B13,4)","v":6.6500000000000004E-2},null,"District-wide rates","Hutt city"]
["Upper Hutt city",{"$f":"INDEX('Comparison - TA'!$B$7:$L$24,MATCH(G14,'Comparison - TA'!$A$7:$A$24,0),MATCH(H14,'Comparison - TA'!$B$6:$L$6,0))/1000","v":8387.2106640848742},{"$f":"INDEX('Comparison - TA'!$B$30:$L$47,MATCH(G14,'Comparison - TA'!$A$30:$A$47,0),MATCH($H14,'Comparison - TA'!$B$29:$L$29,0))/1000","v":8680.4683817252971},293.25771764042292,{"$f":"ROUND(+D14/B14,4)","v":3.5000000000000003E-2},null,"District-wide rates","Upper Hutt city"]
["Porirua city",{"$f":"INDEX('Comparison - TA'!$B$7:$L$24,MATCH(G15,'Comparison - TA'!$A$7:$A$24,0),MATCH(H15,'Comparison - TA'!$B$6:$L$6,0))/1000","v":9886.8880246029694},{"$f":"INDEX('Comparison - TA'!$B$30:$L$47,MATCH(G15,'Comparison - TA'!$A$30:$A$47,0),MATCH($H15,'Comparison - TA'!$B$29:$L$29,0))/1000","v":10301.484100480186},414.59607587721621,4.19E-2,null,"District-wide rates","Porirua city"]
["Kāpiti Coast district",{"$f":"INDEX('Comparison - TA'!$B$7:$L$24,MATCH(G16,'Comparison - TA'!$A$7:$A$24,0),MATCH(H16,'Comparison - TA'!$B$6:$L$6,0))/1000","v":9327.0681315477359},{"$f":"INDEX('Comparison - TA'!$B$30:$L$47,MATCH(G16,'Comparison - TA'!$A$30:$A$47,0),MATCH($H16,'Comparison - TA'!$B$29:$L$29,0))/1000","v":10320.048664060143},992.98053251240708,0.1065,null,"District-wide rates","Kāpiti Coast district"]
["Masterton district",{"$f":"INDEX('Comparison - TA'!$B$7:$L$24,MATCH(G17,'Comparison - TA'!$A$7:$A$24,0),MATCH(H17,'Comparison - TA'!$B$6:$L$6,0))/1000","v":2243.2260841790844},{"$f":"INDEX('Comparison - TA'!$B$30:$L$47,MATCH(G17,'Comparison - TA'!$A$30:$A$47,0),MATCH($H17,'Comparison - TA'!$B$29:$L$29,0))/1000","v":2650.0094157804619},406.78333160137754,0.18129999999999999,null,"District-wide rates","Masterton district"]
["Carterton district",{"$f":"INDEX('Comparison - TA'!$B$7:$L$24,MATCH(G18,'Comparison - TA'!$A$7:$A$24,0),MATCH(H18,'Comparison - TA'!$B$6:$L$6,0))/1000","v":1093.9527462341168},{"$f":"INDEX('Comparison - TA'!$B$30:$L$47,MATCH(G18,'Comparison - TA'!$A$30:$A$47,0),MATCH($H18,'Comparison - TA'!$B$29:$L$29,0))/1000","v":1270.4957884810365},176.54304224691964,0.16139999999999999,null,"District-wide rates","Carterton district"]
["South Wairarapa district",{"$f":"INDEX('Comparison - TA'!$B$7:$L$24,MATCH(G19,'Comparison - TA'!$A$7:$A$24,0),MATCH(H19,'Comparison - TA'!$B$6:$L$6,0))/1000","v":1798.6728202725044},{"$f":"INDEX('Comparison - TA'!$B$30:$L$47,MATCH(G19,'Comparison - TA'!$A$30:$A$47,0),MATCH($H19,'Comparison - TA'!$B$29:$L$29,0))/1000","v":2153.6760167797484},355.00319650724396,{"$f":"ROUND(+D19/B19,4)","v":0.19739999999999999},null,"District-wide rates","South Wairarapa district"]
["Tararua district",{"$f":"INDEX('Comparison - TA'!$B$7:$L$24,MATCH(G20,'Comparison - TA'!$A$7:$A$24,0),MATCH(H20,'Comparison - TA'!$B$6:$L$6,0))/1000","v":2.6064428815298135},{"$f":"INDEX('Comparison - TA'!$B$30:$L$47,MATCH(G20,'Comparison - TA'!$A$30:$A$47,0),MATCH($H20,'Comparison - TA'!$B$29:$L$29,0))/1000","v":2.6050246429774901},-1.4182385523233698E-3,-5.0000000000000001E-4,null,"District-wide rates","Tararua district"]
["Total region-wide rates",{"$f":"INDEX('Comparison - TA'!$B$7:$L$24,MATCH(G21,'Comparison - TA'!$A$7:$A$24,0),MATCH(H21,'Comparison - TA'!$B$6:$L$6,0))/1000","v":118764.83563391621},{"$f":"INDEX('Comparison - TA'!$B$30:$L$47,MATCH(G21,'Comparison - TA'!$A$30:$A$47,0),MATCH($H21,'Comparison - TA'!$B$29:$L$29,0))/1000","v":126759.82332872938},{"$f":"C21-B21","v":7994.9876948131714},{"$f":"ROUND(+D21/B21,6)","v":6.7318000000000003E-2},null,"District-wide rates","Region wide",null,{"$f":"INDEX(ess_base_estract,MATCH($G21,ESSbase!$B$8:$B$25,0),MATCH(B$9,ESSbase!$F$6:$G$6,0))/1000-B21","v":0},{"$f":"INDEX(ess_base_estract,MATCH($G21,ESSbase!$B$8:$B$25,0),MATCH(C$9,ESSbase!$F$6:$G$6,0))/1000-C21","v":0}]
[]
["Specific area targeted rates"]
["Pest management rate",{"$f":"INDEX('Comparison - TA'!$B$7:$L$24,MATCH(G24,'Comparison - TA'!$A$7:$A$24,0),MATCH(H24,'Comparison - TA'!$B$6:$L$6,0))/1000","v":472},{"$f":"INDEX('Comparison - TA'!$B$30:$L$47,MATCH(G24,'Comparison - TA'!$A$30:$A$47,0),MATCH($H24,'Comparison - TA'!$B$29:$L$29,0))/1000","v":532},{"$f":"ROUND(C24-B24,0)","v":60},{"$f":"ROUND(+D24/B24,6)","v":0.12711900000000001},null,"Pest management rate","Region wide",null,{"$f":"INDEX(ess_base_estract,MATCH($G24,ESSbase!$B$8:$B$25,0),MATCH(B$9,ESSbase!$F$6:$G$6,0))/1000-B24","v":0},{"$f":"INDEX(ess_base_estract,MATCH($G24,ESSbase!$B$8:$B$25,0),MATCH(C$9,ESSbase!$F$6:$G$6,0))/1000-C24","v":0}]
["South Wairarapa district – river rates ",{"$f":"INDEX('Comparison - TA'!$B$7:$L$24,MATCH(G25,'Comparison - TA'!$A$7:$A$24,0),MATCH(H25,'Comparison - TA'!$B$6:$L$6,0))/1000","v":93.297359999999998},{"$f":"INDEX('Comparison - TA'!$B$30:$L$47,MATCH(G25,'Comparison - TA'!$A$30:$A$47,0),MATCH($H25,'Comparison - TA'!$B$29:$L$29,0))/1000","v":95.164000000000001},2,{"$f":"ROUND(+D25/B25,6)","v":2.1437000000000001E-2},null,"River management rate - Non district wide","Region wide",null,{"$f":"INDEX(ess_base_estract,MATCH($G25,ESSbase!$B$8:$B$25,0),MATCH(B$9,ESSbase!$F$6:$G$6,0))/1000-B25","v":0},{"$f":"INDEX(ess_base_estract,MATCH($G25,ESSbase!$B$8:$B$25,0),MATCH(C$9,ESSbase!$F$6:$G$6,0))/1000-C25","v":0}]
["Wairarapa scheme and stopbank rates",{"$f":"INDEX('Comparison - TA'!$B$7:$L$24,MATCH(G26,'Comparison - TA'!$A$7:$A$24,0),MATCH(H26,'Comparison - TA'!$B$6:$L$6,0))/1000","v":1451.756116},{"$f":"INDEX('Comparison - TA'!$B$30:$L$47,MATCH(G26,'Comparison - TA'!$A$30:$A$47,0),MATCH($H26,'Comparison - TA'!$B$29:$L$29,0))/1000","v":1487.3630000000001},36,{"$f":"ROUND(+D26/B26,6)","v":2.4798000000000001E-2},null,"Special Rates","Region wide",null,{"$f":"INDEX(ess_base_estract,MATCH($G26,ESSbase!$B$8:$B$25,0),MATCH(B$9,ESSbase!$F$6:$G$6,0))/1000-B26","v":0},{"$f":"INDEX(ess_base_estract,MATCH($G26,ESSbase!$B$8:$B$25,0),MATCH(C$9,ESSbase!$F$6:$G$6,0))/1000-C26","v":0}]
["Total regional rates",{"$f":"INDEX('Comparison - TA'!$B$7:$L$24,MATCH(G27,'Comparison - TA'!$A$7:$A$24,0),MATCH(H27,'Comparison - TA'!$B$6:$L$6,0))/1000","v":120781.88910991621},{"$f":"INDEX('Comparison - TA'!$B$30:$L$47,MATCH(G27,'Comparison - TA'!$A$30:$A$47,0),MATCH($H27,'Comparison - TA'!$B$29:$L$29,0))/1000","v":128874.35032872939},8092,{"$f":"ROUND(+D27/B27,6)","v":6.6997000000000001E-2},null,"Total Regnl Rates","Region wide",null,{"$f":"INDEX(ess_base_estract,MATCH($G27,ESSbase!$B$8:$B$25,0),MATCH(B$9,ESSbase!$F$6:$G$6,0))/1000-B27","v":0},{"$f":"INDEX(ess_base_estract,MATCH($G27,ESSbase!$B$8:$B$25,0),MATCH(C$9,ESSbase!$F$6:$G$6,0))/1000-C27","v":0}]
[]
["Water supply levy"]
["Wellington City Council",{"$f":"INDEX('Comparison - TA'!$B$7:$L$24,MATCH(G30,'Comparison - TA'!$A$7:$A$24,0),MATCH(H30,'Comparison - TA'!$B$6:$L$6,0))/1000","v":16514.665785679925},{"$f":"INDEX('Comparison - TA'!$B$30:$L$47,MATCH(G30,'Comparison - TA'!$A$30:$A$47,0),MATCH($H30,'Comparison - TA'!$B$29:$L$29,0))/1000","v":17696.562021485111},{"$f":"ROUND(C30-B30,0)","v":1182},{"$f":"ROUND(+D30/B30,6)","v":7.1572999999999998E-2},null,"Bulk Water Levies","Wellington city"]
["Hutt City Council",{"$f":"INDEX('Comparison - TA'!$B$7:$L$24,MATCH(G31,'Comparison - TA'!$A$7:$A$24,0),MATCH(H31,'Comparison - TA'!$B$6:$L$6,0))/1000","v":7660.1383816216721},{"$f":"INDEX('Comparison - TA'!$B$30:$L$47,MATCH(G31,'Comparison - TA'!$A$30:$A$47,0),MATCH($H31,'Comparison - TA'!$B$29:$L$29,0))/1000","v":8206.3400099631854},546,{"$f":"ROUND(+D31/B31,6)","v":7.1277999999999994E-2},null,"Bulk Water Levies","Hutt city"]
["Upper Hutt City Council",{"$f":"INDEX('Comparison - TA'!$B$7:$L$24,MATCH(G32,'Comparison - TA'!$A$7:$A$24,0),MATCH(H32,'Comparison - TA'!$B$6:$L$6,0))/1000","v":3095.5353733950592},{"$f":"INDEX('Comparison - TA'!$B$30:$L$47,MATCH(G32,'Comparison - TA'!$A$30:$A$47,0),MATCH($H32,'Comparison - TA'!$B$29:$L$29,0))/1000","v":3317.5670040278046},222,{"$f":"ROUND(+D32/B32,6)","v":7.1716000000000002E-2},null,"Bulk Water Levies","Upper Hutt city"]
["Porirua City Council",{"$f":"INDEX('Comparison - TA'!$B$7:$L$24,MATCH(G33,'Comparison - TA'!$A$7:$A$24,0),MATCH(H33,'Comparison - TA'!$B$6:$L$6,0))/1000","v":3592.4258969410262},{"$f":"INDEX('Comparison - TA'!$B$30:$L$47,MATCH(G33,'Comparison - TA'!$A$30:$A$47,0),MATCH($H33,'Comparison - TA'!$B$29:$L$29,0))/1000","v":3848.4290046723154},256,{"$f":"ROUND(+D33/B33,6)","v":7.1261000000000005E-2},null,"Bulk Water Levies","Porirua city"]
["Water supply levy",{"$f":"INDEX('Comparison - TA'!$B$7:$L$24,MATCH(G34,'Comparison - TA'!$A$7:$A$24,0),MATCH(H34,'Comparison - TA'!$B$6:$L$6,0))/1000","v":30862.765437637678},{"$f":"INDEX('Comparison - TA'!$B$30:$L$47,MATCH(G34,'Comparison - TA'!$A$30:$A$47,0),MATCH($H34,'Comparison - TA'!$B$29:$L$29,0))/1000","v":33068.898040148415},2206,{"$f":"ROUND(+D34/B34,6)","v":7.1478E-2},null,"Bulk Water Levies","Region wide",null,{"$f":"INDEX(ess_base_estract,MATCH($G34,ESSbase!$B$8:$B$25,0),MATCH(B$9,ESSbase!$F$6:$G$6,0))/1000-B34","v":0},{"$f":"INDEX(ess_base_estract,MATCH($G34,ESSbase!$B$8:$B$25,0),MATCH(C$9,ESSbase!$F$6:$G$6,0))/1000-C34","v":0}]
[]
["Total regional rates and levies 2",{"$f":"INDEX('Comparison - TA'!$B$7:$L$24,MATCH(G36,'Comparison - TA'!$A$7:$A$24,0),MATCH(H36,'Comparison - TA'!$B$6:$L$6,0))/1000","v":151644.65454755389},{"$f":"INDEX('Comparison - TA'!$B$30:$L$47,MATCH(G36,'Comparison - TA'!$A$30:$A$47,0),MATCH($H36,'Comparison - TA'!$B$29:$L$29,0))/1000","v":161943.2483688778},{"$f":"ROUND(C36-B36,0)","v":10299},{"$f":"ROUND(+D36/B36,6)","v":6.7915000000000003E-2},null,"Total Regnl Rates & levies","Region wide",null,{"$f":"INDEX(ess_base_estract,MATCH($G36,ESSbase!$B$8:$B$25,0),MATCH(B$9,ESSbase!$F$6:$G$6,0))/1000-B36","v":0},{"$f":"INDEX(ess_base_estract,MATCH($G36,ESSbase!$B$8:$B$25,0),MATCH(C$9,ESSbase!$F$6:$G$6,0))/1000-C36","v":0}]
[]
["Warm Wellington rate 3",{"$f":"INDEX('Comparison - TA'!$B$7:$L$24,MATCH(G38,'Comparison - TA'!$A$7:$A$24,0),MATCH(H38,'Comparison - TA'!$B$6:$L$6,0))/1000","v":3181.7669999999998},{"$f":"INDEX('Comparison - TA'!$B$30:$L$47,MATCH(G38,'Comparison - TA'!$A$30:$A$47,0),MATCH($H38,'Comparison - TA'!$B$29:$L$29,0))/1000","v":3237.058},null,null,null,"Warm Greater Wellington rate","Region wide",null,{"$f":"INDEX(ess_base_estract,MATCH($G38,ESSbase!$B$8:$B$25,0),MATCH(B$9,ESSbase!$F$6:$G$6,0))/1000-B38","v":0},{"$f":"INDEX(ess_base_estract,MATCH($G38,ESSbase!$B$8:$B$25,0),MATCH(C$9,ESSbase!$F$6:$G$6,0))/1000-C38","v":0}]
[]
["Total rates and levies",{"$f":"INDEX('Comparison - TA'!$B$7:$L$24,MATCH(G40,'Comparison - TA'!$A$7:$A$24,0),MATCH(H40,'Comparison - TA'!$B$6:$L$6,0))/1000","v":154826.42154755391},{"$f":"INDEX('Comparison - TA'!$B$30:$L$47,MATCH(G40,'Comparison - TA'!$A$30:$A$47,0),MATCH($H40,'Comparison - TA'!$B$29:$L$29,0))/1000","v":165180.30636887779},null,null,null,"Total Rates & Levies","Region wide",null,{"$f":"INDEX(ess_base_estract,MATCH($G40,ESSbase!$B$8:$B$25,0),MATCH(B$9,ESSbase!$F$6:$G$6,0))/1000-B40","v":0},{"$f":"INDEX(ess_base_estract,MATCH($G40,ESSbase!$B$8:$B$25,0),MATCH(C$9,ESSbase!$F$6:$G$6,0))/1000-C40","v":0}]
[]
[]
["1  Region-wide rates are charged to all ratepayers in the region. They exclude targeted rates for pest management, Wairarapa river and drainage schemes, and \"Warm Greater Wellington\", because those rates only apply to highly specific ratepayers in those work programmes."]
["2 This total excludes \"Warm Greater Wellington\" targeted rates because they only apply to ratepayers who participate in the scheme."]
["3   The Warm Greater Wellington scheme assists regional ratepayers to insulate thier homes. Only ratepayers who participate in the scheme are charged this rate. "]

{"sheet":"3","index":26,"n_rows":163,"n_cols":25,"rows_kept":163,"cut":false,"hidden":false,"merged":[[8,12,9,13],[8,14,9,15],[8,2,9,3],[8,4,9,5],[8,10,9,11],[8,8,9,9],[8,6,9,7],[44,0,45,19],[46,0,46,19],[27,0,28,15],[25,0,25,3],[53,0,54,15],[51,0,52,15],[58,0,59,15],[48,0,49,19],[132,8,132,9],[132,6,132,7],[132,4,132,5]]}
["PAGE NOT USED"]
[]
["RATES AND LEVIES - REGION-WIDE CHANGES BY CITY AND RATE TYPE"]
["WHAT IS THE IMPACT ON YOUR CITY OR DISTRICT?"]
[]
[]
[{"$f":"\"Changes in Region-wide rates due to equalised capital value (ECV) movements and apportionment from \"&year_previous&\" to \"&year_current","v":"Changes in Region-wide rates due to equalised capital value (ECV) movements and apportionment from 2017/18 to 2018/19"}]
[]
[null,null,"ECV movements1",null,"General rate",null,"River management rate",null,"Public transport rate",null,"Stadium purposes rate",null,"Wellington regional strategy rate",null,"Total Region-wide rates2"]
[]
[null,null,null,null,null,null,null,null,null,null,null,null,null,null,"District-Wide Rates","Region-wide rates"]
[null,null,"Change","Contribution to region-wide change","Change","Contribution to region-wide change","Change","Contribution to region-wide change","Change","Contribution to region-wide change","Change","Contribution to region-wide change","Change","Contribution to region-wide change","Change","Change"]
[null,null,"$000s","%  ","$000s","%  ","$000s","%  ","$000s","%  ","$000s","%  ","$000s","%  ","$000s","%  ",null,null,null,null,null,"Check $","Check $","Check %","Check %"]
["Wellington city",null,{"$f":"INDEX($I$90:$I$99,MATCH(A14,$A$90:$A$99,0),)/1000","v":-1114.0933700102867},{"$f":"C14*1000/INDEX($I$64:$I$73,MATCH($A14,$A$64:$A$73,0))","v":-1.7805273092906502E-2},{"$f":"INDEX($D$103:$I$112,MATCH($A14,$A$103:$A$112,0),MATCH(E$9,$D$102:$I$102,0))/1000","v":2340.5449235456176},{"$f":"E14*1000/INDEX($I$64:$I$73,MATCH($A14,$A$64:$A$73,0))","v":3.7406237817895739E-2},{"$f":"INDEX($D$103:$I$112,MATCH($A14,$A$103:$A$112,0),MATCH(G$9,$D$102:$I$102,0))/1000","v":-0.57642410394520271},{"$f":"G14*1000/INDEX($I$64:$I$73,MATCH($A14,$A$64:$A$73,0))","v":-9.2123235487735606E-6},{"$f":"INDEX($D$103:$I$112,MATCH($A14,$A$103:$A$112,0),MATCH(I$9,$D$102:$I$102,0))/1000","v":3099.5868205007837},{"$f":"I14*1000/INDEX($I$64:$I$73,MATCH($A14,$A$64:$A$73,0))","v":4.9537131536543169E-2},{"$f":"INDEX($D$103:$I$112,MATCH($A14,$A$103:$A$112,0),MATCH(K$9,$D$102:$I$102,0))/1000","v":-580.98626189999993},{"$f":"K14*1000/INDEX($I$64:$I$73,MATCH($A14,$A$64:$A$73,0))","v":-9.285235272749973E-3},{"$f":"INDEX($D$103:$I$112,MATCH($A14,$A$103:$A$112,0),MATCH(M$9,$D$102:$I$102,0))/1000","v":51.621450115439949},{"$f":"M14*1000/INDEX($I$64:$I$73,MATCH($A14,$A$64:$A$73,0))","v":8.2500627101727729E-4},{"$f":"INDEX('Comparison - TA'!$B$59:$K$59,MATCH('3'!A14,'Comparison - TA'!$B$52:$K$52,0))/1000","v":3796.0978241220937},{"$f":"O14*1000/INDEX($I$64:$I$73,MATCH($A14,$A$64:$A$73,0),)","v":6.0668665899392224E-2},null,null,null,null,null,{"$f":"IF(ABS((C14+E14+G14+I14+K14+M14-O14)*1000)>tolerance_dollar,1,0)","v":0},{"$f":"ROUND(INDEX('2'!$D$12:$D$21,MATCH(A14,'2'!$H$12:$H$21,0),)-O14,3)","v":0},{"$f":"ROUND(D14+F14+H14+J14+L14+N14-P14,2)","v":0},{"$f":"ROUND(INDEX('2'!$E$12:$E$21,MATCH(A14,'2'!$H$12:$H$21,0),)-P14,2)","v":0}]
["Hutt city",null,234.28019000390171,9.9888240617811985E-3,{"$f":"INDEX($D$103:$I$112,MATCH($A15,$A$103:$A$112,0),MATCH(E$9,$D$102:$I$102,0))/1000","v":818.40482965756576},3.4893696537574473E-2,670.97569702351927,2.8607874132197522E-2,6.1521933367252348,2.6230633001274046E-4,-190.92343151999998,-8.1402553356860839E-3,20.839139881324488,{"$f":"M15*1000/INDEX($I$64:$I$73,MATCH($A15,$A$64:$A$73,0))","v":8.8850236065598012E-4},{"$f":"INDEX('Comparison - TA'!$B$59:$K$59,MATCH('3'!A15,'Comparison - TA'!$B$52:$K$52,0))/1000","v":1559.7283528931328},6.6500936767047228E-2,null,null,null,null,null,0,{"$f":"ROUND(INDEX('2'!$D$12:$D$21,MATCH(A15,'2'!$H$12:$H$21,0),)-O15,3)","v":0},{"$f":"ROUND(D15+F15+H15+J15+L15+N15-P15,2)","v":0},{"$f":"ROUND(INDEX('2'!$E$12:$E$21,MATCH(A15,'2'!$H$12:$H$21,0),)-P15,2)","v":0}]
["Upper Hutt city",null,106.72745277828071,1.2725021921384675E-2,311.25154588023338,3.7110252716504873E-2,-10.983433768245158,-1.3095453122389023E-3,-70.200214834350163,-8.3699109216893806E-3,-51.447605009999997,-6.1340534652787786E-3,7.9089338120590549,9.4297534058371789E-4,{"$f":"INDEX('Comparison - TA'!$B$59:$K$59,MATCH('3'!A16,'Comparison - TA'!$B$52:$K$52,0))/1000","v":293.2577176404223},3.4964864132398958E-2,null,null,null,null,null,0,{"$f":"ROUND(INDEX('2'!$D$12:$D$21,MATCH(A16,'2'!$H$12:$H$21,0),)-O16,3)","v":0},0,{"$f":"ROUND(INDEX('2'!$E$12:$E$21,MATCH(A16,'2'!$H$12:$H$21,0),)-P16,2)","v":0}]
["Porirua city",null,210.61060541247764,2.1302010428404003E-2,387.8499933024375,3.9228720632581517E-2,5.2803201245764937,5.3407298335592763E-4,-126.92455847998802,-1.2837664385732282E-2,-70.226958930000009,-7.1030393201335466E-3,8.0060356384066402,8.0976290023716162E-4,{"$f":"INDEX('Comparison - TA'!$B$59:$K$59,MATCH('3'!A17,'Comparison - TA'!$B$52:$K$52,0))/1000","v":414.5960758772157},4.1933927850475616E-2,null,null,null,null,null,0,{"$f":"ROUND(INDEX('2'!$D$12:$D$21,MATCH(A17,'2'!$H$12:$H$21,0),)-O17,3)","v":0},0,{"$f":"ROUND(INDEX('2'!$E$12:$E$21,MATCH(A17,'2'!$H$12:$H$21,0),)-P17,2)","v":0}]
["Kāpiti Coast district",null,205.20898475553793,2.2001447261955669E-2,498.09833697158939,5.3403530577393506E-2,-32.850794630537273,-3.5220924972564939E-3,375.75392943100445,4.0286395216551321E-2,-47.339621339999994,-5.0755096496078404E-3,-5.8897186510161843,-6.3146520822398959E-4,{"$f":"INDEX('Comparison - TA'!$B$59:$K$59,MATCH('3'!A18,'Comparison - TA'!$B$52:$K$52,0))/1000","v":992.98053251240776},0.1064622430847576,null,null,null,null,null,0,{"$f":"ROUND(INDEX('2'!$D$12:$D$21,MATCH(A18,'2'!$H$12:$H$21,0),)-O18,3)","v":0},0,{"$f":"ROUND(INDEX('2'!$E$12:$E$21,MATCH(A18,'2'!$H$12:$H$21,0),)-P18,2)","v":0}]
["Masterton district",null,120.04666468842962,5.3515191711232604E-2,199.92530479335971,8.912401724539086E-2,0,0,104.04807478743855,4.638323508517362E-2,-19.561826999999997,-8.7203998948574227E-3,2.3252873307206028,1.0365818793065314E-3,{"$f":"INDEX('Comparison - TA'!$B$59:$K$59,MATCH('3'!A19,'Comparison - TA'!$B$52:$K$52,0))/1000","v":406.7833316013776},0.18133854890580547,null,null,null,null,null,0,{"$f":"ROUND(INDEX('2'!$D$12:$D$21,MATCH(A19,'2'!$H$12:$H$21,0),)-O19,3)","v":0},0,{"$f":"ROUND(INDEX('2'!$E$12:$E$21,MATCH(A19,'2'!$H$12:$H$21,0),)-P19,2)","v":0}]
["Carterton district",null,62.166897338590587,5.6827755493965341E-2,92.150669096682108,8.4236400982180382E-2,0.46531999999999973,4.2535645686852034E-4,29.296803966518606,2.6780677238824841E-2,-6.8466394500000005,-6.2586226637759753E-3,-0.69032815521970037,-6.3104001156372798E-4,{"$f":"INDEX('Comparison - TA'!$B$59:$K$59,MATCH('3'!A20,'Comparison - TA'!$B$52:$K$52,0))/1000","v":176.54304224691958},0.16138081951117353,null,null,null,null,null,0,{"$f":"ROUND(INDEX('2'!$D$12:$D$21,MATCH(A20,'2'!$H$12:$H$21,0),)-O20,3)","v":0},0,{"$f":"ROUND(INDEX('2'!$E$12:$E$21,MATCH(A20,'2'!$H$12:$H$21,0),)-P20,2)","v":0}]
["South Wairarapa district",null,175.29294406167696,9.7456879911748465E-2,153.17883257664948,8.5162190476941318E-2,0,0,35.568617790241845,1.9774934645348994E-2,-10.75900485,-5.9816386178524099E-3,1.7228020779816433,9.5781901618636946E-4,{"$f":"INDEX('Comparison - TA'!$B$59:$K$59,MATCH('3'!A21,'Comparison - TA'!$B$52:$K$52,0))/1000","v":355.0031965072439},0.19736963216340384,null,null,null,null,null,0,{"$f":"ROUND(INDEX('2'!$D$12:$D$21,MATCH(A21,'2'!$H$12:$H$21,0),)-O21,3)","v":0},0,{"$f":"ROUND(INDEX('2'!$E$12:$E$21,MATCH(A21,'2'!$H$12:$H$21,0),)-P21,2)","v":0}]
["Tararua district",null,-0.24036902862760962,-9.2221099618545466E-2,0.23895079007528647,9.1676971618513972E-2,0,0,0,0,0,0,0,0,{"$f":"INDEX('Comparison - TA'!$B$59:$K$59,MATCH('3'!A22,'Comparison - TA'!$B$52:$K$52,0))/1000","v":-1.418238552323146E-3},-5.441280000314957E-4,null,null,null,null,null,0,{"$f":"ROUND(INDEX('2'!$D$12:$D$21,MATCH(A22,'2'!$H$12:$H$21,0),)-O22,3)","v":0},0,{"$f":"ROUND(INDEX('2'!$E$12:$E$21,MATCH(A22,'2'!$H$12:$H$21,0),)-P22,2)","v":0}]
["Region wide",2,{"$f":"SUM(C14:C22)","v":-1.912575653406634E-11},-1.6103888367644671E-16,4801.6433866142106,4.0429840744623552E-2,{"$f":"INDEX($D$103:$I$112,MATCH(\"Region wide\",$A$103:$A$112,0),MATCH(G$9,$D$102:$I$102,0))/1000","v":632.31068464536804},5.3240564163100513E-3,{"$f":"INDEX($D$103:$I$112,MATCH(\"Region wide\",$A$103:$A$112,0),MATCH(I$9,$D$102:$I$102,0))/1000","v":3453.2816664983739},2.9076634098248774E-2,-978.09134999999992,-8.2355298655524736E-3,85.843602049696486,7.2280319056791274E-4,{"$f":"INDEX($D$103:$I$112,MATCH(\"Region wide\",$A$103:$A$112,0),MATCH(O$11,$D$102:$I$102,0))/1000","v":7994.9879898076497},6.7317804584197824E-2,null,null,null,null,null,0,{"$f":"ROUND(INDEX('2'!$D$12:$D$21,MATCH(A23,'2'!$H$12:$H$21,0),)-O23,3)","v":0},0,{"$f":"ROUND(INDEX('2'!$E$12:$E$21,MATCH(A23,'2'!$H$12:$H$21,0),)-P23,2)","v":0}]
[null,null,null,null,null,null,null,null,null,null,null,null,null,null,null,null,null,null,null,null,null,"Doesn't incl area specifc rates"]
[]
["WATER SUPPLY LEVY"]
[]
[{"$f":"\"This table shows that the proposed water supply levy will increase by \"&ROUND(P39*100,1)&\"% from the \"&year_previous&\" level. The amounts charged to each of the four cities are based on the water consumption budgets and will be based on actual usage when the annual plan is finalised.\"","v":"This table shows that the proposed water supply levy will increase by 7.1% from the 2017/18 level. The amounts charged to each of the four cities are based on the water consumption budgets and will be based on actual usage when the annual plan is finalised."}]
[]
[]
[]
[null,null,null,null,null,null,null,null,null,null,null,null,{"$f":"year_previous","v":"2017/18"},{"$f":"year_current","v":"2018/19"}]
[null,null,null,null,null,null,null,null,null,null,null,null,"Budget","Plan","Change","Change"]
[null,null,null,null,null,null,null,null,null,null,null,null,"$000s","$000s","$000s","%  "]
["Wellington city",null,null,null,null,null,null,null,null,null,null,null,{"$f":"INDEX('Comparison - TA'!$B$21:$K$21,,MATCH(A35,'Comparison - TA'!$B$6:$K$6,0))/1000","v":16514.665785679925},{"$f":"INDEX('Water levy'!$C$10:$C$19,MATCH(A35,'Water levy'!$A$10:$A$19,0),)/1000","v":17696.562021485111},{"$f":"+N35-M35","v":1181.8962358051867},{"$f":"ROUND((N35-M35)/M35,6)","v":7.1566000000000005E-2}]
["Hutt city",null,null,null,null,null,null,null,null,null,null,null,{"$f":"INDEX('Comparison - TA'!$B$21:$K$21,,MATCH(A36,'Comparison - TA'!$B$6:$K$6,0))/1000","v":7660.1383816216721},{"$f":"INDEX('Water levy'!$C$10:$C$19,MATCH(A36,'Water levy'!$A$10:$A$19,0),)/1000","v":8206.3400099631854},{"$f":"+N36-M36","v":546.20162834151324},{"$f":"ROUND((N36-M36)/M36,6)","v":7.1304000000000006E-2}]
["Upper Hutt city",null,null,null,null,null,null,null,null,null,null,null,{"$f":"INDEX('Comparison - TA'!$B$21:$K$21,,MATCH(A37,'Comparison - TA'!$B$6:$K$6,0))/1000","v":3095.5353733950592},{"$f":"INDEX('Water levy'!$C$10:$C$19,MATCH(A37,'Water levy'!$A$10:$A$19,0),)/1000","v":3317.5670040278046},{"$f":"+N37-M37","v":222.03163063274542},{"$f":"ROUND((N37-M37)/M37,6)","v":7.1725999999999998E-2}]
["Porirua city",null,null,null,null,null,null,null,null,null,null,null,{"$f":"INDEX('Comparison - TA'!$B$21:$K$21,,MATCH(A38,'Comparison - TA'!$B$6:$K$6,0))/1000","v":3592.4258969410262},{"$f":"INDEX('Water levy'!$C$10:$C$19,MATCH(A38,'Water levy'!$A$10:$A$19,0),)/1000","v":3848.4290046723154},{"$f":"+N38-M38","v":256.00310773128922},{"$f":"ROUND((N38-M38)/M38,6)","v":7.1262000000000006E-2}]
["Bulk Water Levies",null,null,null,null,null,null,null,null,null,null,null,{"$f":"INDEX(ESSbase!$F$8:$F$25,MATCH(A39,ESSbase!$B$8:$B$25,0),)/1000","v":30862.765437637678},{"$f":"INDEX(ESSbase!$G$8:$G$25,MATCH(A39,ESSbase!$B$8:$B$25,0),)/1000","v":33068.898040148415},{"$f":"+N39-M39","v":2206.1326025107373},{"$f":"ROUND((N39-M39)/M39,6)","v":7.1482000000000004E-2},null,null,null,null,null,{"$f":"M39-SUM(M35:M38)","v":0},{"$f":"N39-SUM(N35:N38)","v":0}]
[]
[]
[]
["Notes:"]
[]
["1 Rates for Greater Wellington are mostly allocated to ratepayers on the basis of their capital values. The territorial local authorities undertake valuations in different years. To ensure properties are valued on the same basis in each territorial area,  Greater Wellington undertakes an equalised capital value (ECV) calculation. The movements in ECV reflect the extent to which capital values in each area have moved relative to each other."]
[]
[{"$f":"\"The ECV change by city amount shows how much the general rate changes as a direct consequence of the relative changes in capital values between the cities and districts from \"&year_previous&\" to \"&year_current","v":"The ECV change by city amount shows how much the general rate changes as a direct consequence of the relative changes in capital values between the cities and districts from 2017/18 to 2018/19"}]
[]
["2  Region-wide rates are rates that are charged to all ratepayers in  the region. It excludes  South Wairarapa Region river rates, Wairarapa river and drainage schemes and any \"Warm Greater Wellington\" targeted rates as they impact only certain ratepayers that are covered by these programmes"]
[]
[]
["This information should be read in conjunction with the Funding Impact Statement and the Revenue and Financing Policy contained within the 2015/25 long term plan available at www.gw.govt.nz"]
[]
[{"$f":"+'1'!$A$43","v":0}]
[]
[]
[]
[]
["Movement workings"]
[]
[]
["Last years rate"]
[null,null,null,"General Rate","River management rate","Public transport rate","Stadium purposes rate","Wellington regional strategy rate","District-Wide Rates",null,null,null,null,null,null,null,null,null,null,null,null,"Checks"]
["Wellington city",null,null,{"$f":"INDEX('Comparison - Category'!$J$10:$O$19,MATCH($A64,'Comparison - Category'!$A$10:$A$19,0),MATCH(D$63,'Comparison - Category'!$J$7:$O$7,0))","v":21189528.406917833},{"$f":"INDEX('Comparison - Category'!$J$10:$O$19,MATCH($A64,'Comparison - Category'!$A$10:$A$19,0),MATCH(E$63,'Comparison - Category'!$J$7:$O$7,0))","v":43255.424103945203},{"$f":"INDEX('Comparison - Category'!$J$10:$O$19,MATCH($A64,'Comparison - Category'!$A$10:$A$19,0),MATCH(F$63,'Comparison - Category'!$J$7:$O$7,0))","v":38457358.003260493},{"$f":"INDEX('Comparison - Category'!$J$10:$O$19,MATCH($A64,'Comparison - Category'!$A$10:$A$19,0),MATCH(G$63,'Comparison - Category'!$J$7:$O$7,0))","v":580986.26189999992},{"$f":"INDEX('Comparison - Category'!$J$10:$O$19,MATCH($A64,'Comparison - Category'!$A$10:$A$19,0),MATCH(H$63,'Comparison - Category'!$J$7:$O$7,0))","v":2299850.9726045812},{"$f":"INDEX('Comparison - Category'!$J$10:$O$19,MATCH($A64,'Comparison - Category'!$A$10:$A$19,0),MATCH(I$63,'Comparison - Category'!$J$7:$O$7,0))","v":62570979.068786852},null,null,null,null,null,null,null,null,null,null,null,null,{"$f":"I64-SUM(D64:H64)","v":0}]
["Hutt city",null,null,{"$f":"INDEX('Comparison - Category'!$J$10:$O$19,MATCH($A65,'Comparison - Category'!$A$10:$A$19,0),MATCH(D$63,'Comparison - Category'!$J$7:$O$7,0))","v":7179456.0529976618},{"$f":"INDEX('Comparison - Category'!$J$10:$O$19,MATCH($A65,'Comparison - Category'!$A$10:$A$19,0),MATCH(E$63,'Comparison - Category'!$J$7:$O$7,0))","v":3685586.3029764807},{"$f":"INDEX('Comparison - Category'!$J$10:$O$19,MATCH($A65,'Comparison - Category'!$A$10:$A$19,0),MATCH(F$63,'Comparison - Category'!$J$7:$O$7,0))","v":11536013.198820936},{"$f":"INDEX('Comparison - Category'!$J$10:$O$19,MATCH($A65,'Comparison - Category'!$A$10:$A$19,0),MATCH(G$63,'Comparison - Category'!$J$7:$O$7,0))","v":190923.43151999998},{"$f":"INDEX('Comparison - Category'!$J$10:$O$19,MATCH($A65,'Comparison - Category'!$A$10:$A$19,0),MATCH(H$63,'Comparison - Category'!$J$7:$O$7,0))","v":862252.31807783083},{"$f":"INDEX('Comparison - Category'!$J$10:$O$19,MATCH($A65,'Comparison - Category'!$A$10:$A$19,0),MATCH(I$63,'Comparison - Category'!$J$7:$O$7,0))","v":23454231.304392911},null,null,null,null,null,null,null,null,null,null,null,null,0]
["Upper Hutt city",null,null,{"$f":"INDEX('Comparison - Category'!$J$10:$O$19,MATCH($A66,'Comparison - Category'!$A$10:$A$19,0),MATCH(D$63,'Comparison - Category'!$J$7:$O$7,0))","v":2718137.0908558238},{"$f":"INDEX('Comparison - Category'!$J$10:$O$19,MATCH($A66,'Comparison - Category'!$A$10:$A$19,0),MATCH(E$63,'Comparison - Category'!$J$7:$O$7,0))","v":678045.43376824516},{"$f":"INDEX('Comparison - Category'!$J$10:$O$19,MATCH($A66,'Comparison - Category'!$A$10:$A$19,0),MATCH(F$63,'Comparison - Category'!$J$7:$O$7,0))","v":4596383.5624092557},{"$f":"INDEX('Comparison - Category'!$J$10:$O$19,MATCH($A66,'Comparison - Category'!$A$10:$A$19,0),MATCH(G$63,'Comparison - Category'!$J$7:$O$7,0))","v":51447.605009999999},{"$f":"INDEX('Comparison - Category'!$J$10:$O$19,MATCH($A66,'Comparison - Category'!$A$10:$A$19,0),MATCH(H$63,'Comparison - Category'!$J$7:$O$7,0))","v":343198.01082399383},{"$f":"INDEX('Comparison - Category'!$J$10:$O$19,MATCH($A66,'Comparison - Category'!$A$10:$A$19,0),MATCH(I$63,'Comparison - Category'!$J$7:$O$7,0))","v":8387211.7028673189},null,null,null,null,null,null,null,null,null,null,null,null,0]
["Porirua city",null,null,{"$f":"INDEX('Comparison - Category'!$J$10:$O$19,MATCH($A67,'Comparison - Category'!$A$10:$A$19,0),MATCH(D$63,'Comparison - Category'!$J$7:$O$7,0))","v":3367756.6064207805},{"$f":"INDEX('Comparison - Category'!$J$10:$O$19,MATCH($A67,'Comparison - Category'!$A$10:$A$19,0),MATCH(E$63,'Comparison - Category'!$J$7:$O$7,0))","v":28307.679875423506},{"$f":"INDEX('Comparison - Category'!$J$10:$O$19,MATCH($A67,'Comparison - Category'!$A$10:$A$19,0),MATCH(F$63,'Comparison - Category'!$J$7:$O$7,0))","v":6066071.2474005194},{"$f":"INDEX('Comparison - Category'!$J$10:$O$19,MATCH($A67,'Comparison - Category'!$A$10:$A$19,0),MATCH(G$63,'Comparison - Category'!$J$7:$O$7,0))","v":70226.958930000008},{"$f":"INDEX('Comparison - Category'!$J$10:$O$19,MATCH($A67,'Comparison - Category'!$A$10:$A$19,0),MATCH(H$63,'Comparison - Category'!$J$7:$O$7,0))","v":354526.17078555212},{"$f":"INDEX('Comparison - Category'!$J$10:$O$19,MATCH($A67,'Comparison - Category'!$A$10:$A$19,0),MATCH(I$63,'Comparison - Category'!$J$7:$O$7,0))","v":9886888.6634122767},null,null,null,null,null,null,null,null,null,null,null,null,0]
["Kāpiti Coast district",null,null,{"$f":"INDEX('Comparison - Category'!$J$10:$O$19,MATCH($A68,'Comparison - Category'!$A$10:$A$19,0),MATCH(D$63,'Comparison - Category'!$J$7:$O$7,0))","v":4329462.3984503523},{"$f":"INDEX('Comparison - Category'!$J$10:$O$19,MATCH($A68,'Comparison - Category'!$A$10:$A$19,0),MATCH(E$63,'Comparison - Category'!$J$7:$O$7,0))","v":1368225.7946305373},{"$f":"INDEX('Comparison - Category'!$J$10:$O$19,MATCH($A68,'Comparison - Category'!$A$10:$A$19,0),MATCH(F$63,'Comparison - Category'!$J$7:$O$7,0))","v":3090620.0871701711},{"$f":"INDEX('Comparison - Category'!$J$10:$O$19,MATCH($A68,'Comparison - Category'!$A$10:$A$19,0),MATCH(G$63,'Comparison - Category'!$J$7:$O$7,0))","v":47339.621339999991},{"$f":"INDEX('Comparison - Category'!$J$10:$O$19,MATCH($A68,'Comparison - Category'!$A$10:$A$19,0),MATCH(H$63,'Comparison - Category'!$J$7:$O$7,0))","v":491419.64593250601},{"$f":"INDEX('Comparison - Category'!$J$10:$O$19,MATCH($A68,'Comparison - Category'!$A$10:$A$19,0),MATCH(I$63,'Comparison - Category'!$J$7:$O$7,0))","v":9327067.5475235656},null,null,null,null,null,null,null,null,null,null,null,null,0]
["Masterton district",null,null,{"$f":"INDEX('Comparison - Category'!$J$10:$O$19,MATCH($A69,'Comparison - Category'!$A$10:$A$19,0),MATCH(D$63,'Comparison - Category'!$J$7:$O$7,0))","v":1675353.2248983532},{"$f":"INDEX('Comparison - Category'!$J$10:$O$19,MATCH($A69,'Comparison - Category'!$A$10:$A$19,0),MATCH(E$63,'Comparison - Category'!$J$7:$O$7,0))","v":0},{"$f":"INDEX('Comparison - Category'!$J$10:$O$19,MATCH($A69,'Comparison - Category'!$A$10:$A$19,0),MATCH(F$63,'Comparison - Category'!$J$7:$O$7,0))","v":306748.56603071187},{"$f":"INDEX('Comparison - Category'!$J$10:$O$19,MATCH($A69,'Comparison - Category'!$A$10:$A$19,0),MATCH(G$63,'Comparison - Category'!$J$7:$O$7,0))","v":19561.826999999997},{"$f":"INDEX('Comparison - Category'!$J$10:$O$19,MATCH($A69,'Comparison - Category'!$A$10:$A$19,0),MATCH(H$63,'Comparison - Category'!$J$7:$O$7,0))","v":241562.29325144846},{"$f":"INDEX('Comparison - Category'!$J$10:$O$19,MATCH($A69,'Comparison - Category'!$A$10:$A$19,0),MATCH(I$63,'Comparison - Category'!$J$7:$O$7,0))","v":2243225.9111805134},null,null,null,null,null,null,null,null,null,null,null,null,0]
["Carterton district",null,null,{"$f":"INDEX('Comparison - Category'!$J$10:$O$19,MATCH($A70,'Comparison - Category'!$A$10:$A$19,0),MATCH(D$63,'Comparison - Category'!$J$7:$O$7,0))","v":774173.16904683737},{"$f":"INDEX('Comparison - Category'!$J$10:$O$19,MATCH($A70,'Comparison - Category'!$A$10:$A$19,0),MATCH(E$63,'Comparison - Category'!$J$7:$O$7,0))","v":23239.68},{"$f":"INDEX('Comparison - Category'!$J$10:$O$19,MATCH($A70,'Comparison - Category'!$A$10:$A$19,0),MATCH(F$63,'Comparison - Category'!$J$7:$O$7,0))","v":198788.91360953596},{"$f":"INDEX('Comparison - Category'!$J$10:$O$19,MATCH($A70,'Comparison - Category'!$A$10:$A$19,0),MATCH(G$63,'Comparison - Category'!$J$7:$O$7,0))","v":6846.6394500000006},{"$f":"INDEX('Comparison - Category'!$J$10:$O$19,MATCH($A70,'Comparison - Category'!$A$10:$A$19,0),MATCH(H$63,'Comparison - Category'!$J$7:$O$7,0))","v":90904.663578091597},{"$f":"INDEX('Comparison - Category'!$J$10:$O$19,MATCH($A70,'Comparison - Category'!$A$10:$A$19,0),MATCH(I$63,'Comparison - Category'!$J$7:$O$7,0))","v":1093953.065684465},null,null,null,null,null,null,null,null,null,null,null,null,0]
["South Wairarapa district",null,null,{"$f":"INDEX('Comparison - Category'!$J$10:$O$19,MATCH($A71,'Comparison - Category'!$A$10:$A$19,0),MATCH(D$63,'Comparison - Category'!$J$7:$O$7,0))","v":1245449.1280744334},{"$f":"INDEX('Comparison - Category'!$J$10:$O$19,MATCH($A71,'Comparison - Category'!$A$10:$A$19,0),MATCH(E$63,'Comparison - Category'!$J$7:$O$7,0))","v":0},{"$f":"INDEX('Comparison - Category'!$J$10:$O$19,MATCH($A71,'Comparison - Category'!$A$10:$A$19,0),MATCH(F$63,'Comparison - Category'!$J$7:$O$7,0))","v":404412.54842927179},{"$f":"INDEX('Comparison - Category'!$J$10:$O$19,MATCH($A71,'Comparison - Category'!$A$10:$A$19,0),MATCH(G$63,'Comparison - Category'!$J$7:$O$7,0))","v":10759.004849999999},{"$f":"INDEX('Comparison - Category'!$J$10:$O$19,MATCH($A71,'Comparison - Category'!$A$10:$A$19,0),MATCH(H$63,'Comparison - Category'!$J$7:$O$7,0))","v":138051.14376949321},{"$f":"INDEX('Comparison - Category'!$J$10:$O$19,MATCH($A71,'Comparison - Category'!$A$10:$A$19,0),MATCH(I$63,'Comparison - Category'!$J$7:$O$7,0))","v":1798671.8251231983},null,null,null,null,null,null,null,null,null,null,null,null,0]
["Tararua district",null,null,{"$f":"INDEX('Comparison - Category'!$J$10:$O$19,MATCH($A72,'Comparison - Category'!$A$10:$A$19,0),MATCH(D$63,'Comparison - Category'!$J$7:$O$7,0))","v":2354.4428815298133},{"$f":"INDEX('Comparison - Category'!$J$10:$O$19,MATCH($A72,'Comparison - Category'!$A$10:$A$19,0),MATCH(E$63,'Comparison - Category'!$J$7:$O$7,0))","v":0},{"$f":"INDEX('Comparison - Category'!$J$10:$O$19,MATCH($A72,'Comparison - Category'!$A$10:$A$19,0),MATCH(F$63,'Comparison - Category'!$J$7:$O$7,0))","v":0},{"$f":"INDEX('Comparison - Category'!$J$10:$O$19,MATCH($A72,'Comparison - Category'!$A$10:$A$19,0),MATCH(G$63,'Comparison - Category'!$J$7:$O$7,0))","v":0},{"$f":"INDEX('Comparison - Category'!$J$10:$O$19,MATCH($A72,'Comparison - Category'!$A$10:$A$19,0),MATCH(H$63,'Comparison - Category'!$J$7:$O$7,0))","v":252},{"$f":"INDEX('Comparison - Category'!$J$10:$O$19,MATCH($A72,'Comparison - Category'!$A$10:$A$19,0),MATCH(I$63,'Comparison - Category'!$J$7:$O$7,0))","v":2606.4428815298133},null,null,null,null,null,null,null,null,null,null,null,null,0]
["Region wide",null,null,{"$f":"SUM(D64:D72)","v":42481670.520543598},5826660.3153546304,64656396.127130888,978091.35,4822017.2188234963,118764835.53185263]
[]
["Last years rate, this years ECV"]
[null,null,{"$f":"\"ECV \"&year_current","v":"ECV 2018/19"},"General Rate","River management rate","Public transport rate","Stadium purposes rate","Wellington regional strategy rate","District-Wide Rates",null,null,null,null,null,null,null,null,null,null,null,null,"Checks"]
["Wellington city",null,{"$f":"INDEX('Capital values'!$G$8:$H$17,MATCH($A77,'Capital values'!$A$8:$A$17,0),MATCH(C$76,'Capital values'!$G$6:$H$6,0))","v":68975077410},{"$f":"D$73*$C77/$C$86","v":20707547.452978849},{"$f":"E64","v":43255.424103945203},{"$f":"SUMIF($A$136:$A$162,A77,$M$136:$M$162)","v":37825245.58718919},{"$f":"G64","v":580986.26189999992},{"$f":"H64","v":2299850.9726045812},{"$f":"SUM(D77:H77)","v":61456885.698776565}]
["Hutt city",null,{"$f":"INDEX('Capital values'!$G$8:$H$17,MATCH($A78,'Capital values'!$A$8:$A$17,0),MATCH(C$76,'Capital values'!$G$6:$H$6,0))","v":24118117072},{"$f":"D$73*$C78/$C$86","v":7240688.557350317},3685586.3029764807,11709060.884472182,190923.43151999998,862252.31807783083,23688511.494396813]
["Upper Hutt city",null,{"$f":"INDEX('Capital values'!$G$8:$H$17,MATCH($A79,'Capital values'!$A$8:$A$17,0),MATCH(C$76,'Capital values'!$G$6:$H$6,0))","v":9172479133},2753741.6997594899,678045.43376824516,4667506.4062838703,51447.605009999999,343198.01082399383,8493939.1556455996]
["Porirua city",null,{"$f":"INDEX('Capital values'!$G$8:$H$17,MATCH($A80,'Capital values'!$A$8:$A$17,0),MATCH(C$76,'Capital values'!$G$6:$H$6,0))","v":11429809803},3431432.595098922,28307.679875423506,6213005.8641348556,70226.958930000008,354526.17078555212,10097499.268824754]
["Kāpiti Coast district",null,{"$f":"INDEX('Capital values'!$G$8:$H$17,MATCH($A81,'Capital values'!$A$8:$A$17,0),MATCH(C$76,'Capital values'!$G$6:$H$6,0))","v":14678791680},4406834.8551345412,1368225.7946305373,3218456.6152415201,47339.621339999991,491419.64593250601,9532276.532279104]
["Masterton district",null,{"$f":"INDEX('Capital values'!$G$8:$H$17,MATCH($A82,'Capital values'!$A$8:$A$17,0),MATCH(C$76,'Capital values'!$G$6:$H$6,0))","v":5891731979},1768802.9374750284,0,333345.51814246626,19561.826999999997,241562.29325144846,2363272.5758689432]
["Carterton district",null,{"$f":"INDEX('Capital values'!$G$8:$H$17,MATCH($A83,'Capital values'!$A$8:$A$17,0),MATCH(C$76,'Capital values'!$G$6:$H$6,0))","v":2715649450},815286.36085848091,23239.68,219842.619136483,6846.6394500000006,90904.663578091597,1156119.9630230556]
["South Wairarapa district",null,{"$f":"INDEX('Capital values'!$G$8:$H$17,MATCH($A84,'Capital values'!$A$8:$A$17,0),MATCH(C$76,'Capital values'!$G$6:$H$6,0))","v":4514129051},1355221.9880350677,0,469932.6325303145,10759.004849999999,138051.14376949321,1973964.7691848753]
["Tararua district",null,{"$f":"INDEX('Capital values'!$G$8:$H$17,MATCH($A85,'Capital values'!$A$8:$A$17,0),MATCH(C$76,'Capital values'!$G$6:$H$6,0))","v":7041800},2114.0738529022037,0,0,0,252,2366.0738529022037]
["Region wide",null,{"$f":"INDEX('Capital values'!$G$8:$H$17,MATCH($A86,'Capital values'!$A$8:$A$17,0),MATCH(C$76,'Capital values'!$G$6:$H$6,0))","v":141502827378},{"$f":"SUM(D77:D85)","v":42481670.52054359},{"$f":"SUM(E77:E85)","v":5826660.3153546304},{"$f":"SUM(F77:F85)","v":64656396.127130888},{"$f":"SUM(G77:G85)","v":978091.35},{"$f":"SUM(H77:H85)","v":4822017.2188234963},{"$f":"SUM(I77:I85)","v":118764835.5318526},null,null,null,null,null,null,null,null,null,null,null,null,{"$f":"I86-I73","v":0}]
[]
["ECV movements"]
[null,null,null,"General Rate","River management rate","Public transport rate","Stadium purposes rate","Wellington regional strategy rate","District-Wide Rates"]
["Wellington city",null,null,{"$f":"D77-D64","v":-481980.95393898338},{"$f":"E77-E64","v":0},{"$f":"F77-F64","v":-632112.41607130319},{"$f":"G77-G64","v":0},{"$f":"H77-H64","v":0},{"$f":"SUM(D90:H90)","v":-1114093.3700102866}]
["Hutt city",null,null,{"$f":"D78-D65","v":61232.504352655262},{"$f":"E78-E65","v":0},{"$f":"F78-F65","v":173047.68565124646},0,{"$f":"H78-H65","v":0},234280.19000390172]
["Upper Hutt city",null,null,{"$f":"D79-D66","v":35604.608903666027},{"$f":"E79-E66","v":0},{"$f":"F79-F66","v":71122.843874614686},0,{"$f":"H79-H66","v":0},106727.45277828071]
["Porirua city",null,null,{"$f":"D80-D67","v":63675.988678141497},{"$f":"E80-E67","v":0},{"$f":"F80-F67","v":146934.61673433613},0,{"$f":"H80-H67","v":0},210610.60541247763]
["Kāpiti Coast district",null,null,{"$f":"D81-D68","v":77372.456684188917},{"$f":"E81-E68","v":0},{"$f":"F81-F68","v":127836.52807134902},0,{"$f":"H81-H68","v":0},205208.98475553794]
["Masterton district",null,null,{"$f":"D82-D69","v":93449.712576675229},{"$f":"E82-E69","v":0},{"$f":"F82-F69","v":26596.952111754392},0,{"$f":"H82-H69","v":0},120046.66468842962]
["Carterton district",null,null,{"$f":"D83-D70","v":41113.191811643541},{"$f":"E83-E70","v":0},{"$f":"F83-F70","v":21053.705526947044},0,{"$f":"H83-H70","v":0},62166.897338590585]
["South Wairarapa district",null,null,{"$f":"D84-D71","v":109772.85996063426},{"$f":"E84-E71","v":0},{"$f":"F84-F71","v":65520.08410104271},0,{"$f":"H84-H71","v":0},175292.94406167697]
["Tararua district",null,null,{"$f":"D85-D72","v":-240.36902862760962},{"$f":"E85-E72","v":0},{"$f":"F85-F72","v":0},0,{"$f":"H85-H72","v":0},-240.36902862760962]
["Region wide",null,null,{"$f":"SUM(D90:D98)","v":-6.2564140534959733E-9},{"$f":"SUM(E90:E98)","v":0},{"$f":"SUM(F90:F98)","v":-1.2747477740049362E-8},{"$f":"SUM(G90:G98)","v":0},{"$f":"SUM(H90:H98)","v":0},{"$f":"SUM(I90:I98)","v":-1.9003891793545336E-8}]
[]
["Rate movements"]
[null,null,null,"General Rate","River management rate","Public transport rate","Stadium purposes rate","Wellington regional strategy rate","District-Wide Rates"]
["Wellington city",null,null,{"$f":"D116-D90-D64","v":2340544.9235456176},{"$f":"E116-E90-E64","v":-576.42410394520266},{"$f":"F116-F90-F64","v":3099586.8205007836},{"$f":"G116-G90-G64","v":-580986.26189999992},{"$f":"H116-H90-H64","v":51621.450115439948},{"$f":"SUM(D103:H103)","v":4910190.5081578959}]
["Hutt city",null,null,{"$f":"D117-D91-D65","v":818404.8296575658},{"$f":"E117-E91-E65","v":670975.69702351931},6152.193336725235,-190923.43151999998,20839.139881324489,1325448.4283791347]
["Upper Hutt city",null,null,{"$f":"D118-D92-D66","v":311251.5458802334},-10983.433768245159,-70200.214834350161,-51447.605009999999,7908.9338120590546,186529.22607969714]
["Porirua city",null,null,{"$f":"D119-D93-D67","v":387849.99330243748},5280.320124576494,-126924.55847998802,-70226.958930000008,8006.0356384066399,203984.83165543259]
["Kāpiti Coast district",null,null,{"$f":"D120-D94-D68","v":498098.33697158936},-32850.794630537275,375753.92943100445,-47339.621339999991,-5889.7186510161846,787772.13178104046]
["Masterton district",null,null,{"$f":"D121-D95-D69","v":199925.30479335971},0,104048.07478743856,-19561.826999999997,2325.2873307206028,286736.83991151885]
["Carterton district",null,null,{"$f":"D122-D96-D70","v":92150.669096682104},465.31999999999971,29296.803966518608,-6846.6394500000006,-690.32815521970042,114375.82545798102]
["South Wairarapa district",null,null,{"$f":"D123-D97-D71","v":153178.8325766495},0,35568.617790241842,-10759.004849999999,1722.8020779816434,179711.24759487298]
["Tararua district",null,null,{"$f":"D124-D98-D72","v":238.95079007528648},0,0,0,0,238.95079007528648]
["Region wide",null,null,{"$f":"SUM(D103:D111)","v":4801643.3866142109},{"$f":"SUM(E103:E111)","v":632310.68464536802},{"$f":"SUM(F103:F111)","v":3453281.6664983737},{"$f":"SUM(G103:G111)","v":-978091.35},{"$f":"SUM(H103:H111)","v":85843.602049696492},{"$f":"SUM(I103:I111)","v":7994987.9898076495}]
[]
["This years rate"]
[null,null,null,"General Rate","River management rate","Public transport rate","Stadium purposes rate","Wellington regional strategy rate","District-Wide Rates",null,null,null,null,null,null,null,null,null,null,null,null,"Checks"]
["Wellington city",null,null,{"$f":"INDEX('Comparison - Category'!$J$69:$O$78,MATCH($A116,'Comparison - Category'!$A$69:$A$78,0),MATCH(D$63,'Comparison - Category'!$J$7:$O$7,0))","v":23048092.376524467},{"$f":"INDEX('Comparison - Category'!$J$69:$O$78,MATCH($A116,'Comparison - Category'!$A$69:$A$78,0),MATCH(E$63,'Comparison - Category'!$J$7:$O$7,0))","v":42679},{"$f":"INDEX('Comparison - Category'!$J$69:$O$78,MATCH($A116,'Comparison - Category'!$A$69:$A$78,0),MATCH(F$63,'Comparison - Category'!$J$7:$O$7,0))","v":40924832.407689974},{"$f":"INDEX('Comparison - Category'!$J$69:$O$78,MATCH($A116,'Comparison - Category'!$A$69:$A$78,0),MATCH(G$63,'Comparison - Category'!$J$7:$O$7,0))","v":0},{"$f":"INDEX('Comparison - Category'!$J$69:$O$78,MATCH($A116,'Comparison - Category'!$A$69:$A$78,0),MATCH(H$63,'Comparison - Category'!$J$7:$O$7,0))","v":2351472.4227200211},{"$f":"INDEX('Comparison - Category'!$J$69:$O$78,MATCH($A116,'Comparison - Category'!$A$69:$A$78,0),MATCH(I$63,'Comparison - Category'!$J$7:$O$7,0))","v":66367076.20693446},null,null,null,null,null,null,null,null,null,null,null,null,{"$f":"I116-SUM(D116:H116)","v":0}]
["Hutt city",null,null,{"$f":"INDEX('Comparison - Category'!$J$69:$O$78,MATCH($A117,'Comparison - Category'!$A$69:$A$78,0),MATCH(D$63,'Comparison - Category'!$J$7:$O$7,0))","v":8059093.3870078828},{"$f":"INDEX('Comparison - Category'!$J$69:$O$78,MATCH($A117,'Comparison - Category'!$A$69:$A$78,0),MATCH(E$63,'Comparison - Category'!$J$7:$O$7,0))","v":4356562},{"$f":"INDEX('Comparison - Category'!$J$69:$O$78,MATCH($A117,'Comparison - Category'!$A$69:$A$78,0),MATCH(F$63,'Comparison - Category'!$J$7:$O$7,0))","v":11715213.077808907},{"$f":"INDEX('Comparison - Category'!$J$69:$O$78,MATCH($A117,'Comparison - Category'!$A$69:$A$78,0),MATCH(G$63,'Comparison - Category'!$J$7:$O$7,0))","v":0},{"$f":"INDEX('Comparison - Category'!$J$69:$O$78,MATCH($A117,'Comparison - Category'!$A$69:$A$78,0),MATCH(H$63,'Comparison - Category'!$J$7:$O$7,0))","v":883091.45795915532},{"$f":"INDEX('Comparison - Category'!$J$69:$O$78,MATCH($A117,'Comparison - Category'!$A$69:$A$78,0),MATCH(I$63,'Comparison - Category'!$J$7:$O$7,0))","v":25013959.922775947},null,null,null,null,null,null,null,null,null,null,null,null,0]
["Upper Hutt city",null,null,{"$f":"INDEX('Comparison - Category'!$J$69:$O$78,MATCH($A118,'Comparison - Category'!$A$69:$A$78,0),MATCH(D$63,'Comparison - Category'!$J$7:$O$7,0))","v":3064993.2456397233},{"$f":"INDEX('Comparison - Category'!$J$69:$O$78,MATCH($A118,'Comparison - Category'!$A$69:$A$78,0),MATCH(E$63,'Comparison - Category'!$J$7:$O$7,0))","v":667062},{"$f":"INDEX('Comparison - Category'!$J$69:$O$78,MATCH($A118,'Comparison - Category'!$A$69:$A$78,0),MATCH(F$63,'Comparison - Category'!$J$7:$O$7,0))","v":4597306.1914495202},{"$f":"INDEX('Comparison - Category'!$J$69:$O$78,MATCH($A118,'Comparison - Category'!$A$69:$A$78,0),MATCH(G$63,'Comparison - Category'!$J$7:$O$7,0))","v":0},{"$f":"INDEX('Comparison - Category'!$J$69:$O$78,MATCH($A118,'Comparison - Category'!$A$69:$A$78,0),MATCH(H$63,'Comparison - Category'!$J$7:$O$7,0))","v":351106.94463605288},{"$f":"INDEX('Comparison - Category'!$J$69:$O$78,MATCH($A118,'Comparison - Category'!$A$69:$A$78,0),MATCH(I$63,'Comparison - Category'!$J$7:$O$7,0))","v":8680468.3817252964},null,null,null,null,null,null,null,null,null,null,null,null,0]
["Porirua city",null,null,{"$f":"INDEX('Comparison - Category'!$J$69:$O$78,MATCH($A119,'Comparison - Category'!$A$69:$A$78,0),MATCH(D$63,'Comparison - Category'!$J$7:$O$7,0))","v":3819282.5884013595},{"$f":"INDEX('Comparison - Category'!$J$69:$O$78,MATCH($A119,'Comparison - Category'!$A$69:$A$78,0),MATCH(E$63,'Comparison - Category'!$J$7:$O$7,0))","v":33588},{"$f":"INDEX('Comparison - Category'!$J$69:$O$78,MATCH($A119,'Comparison - Category'!$A$69:$A$78,0),MATCH(F$63,'Comparison - Category'!$J$7:$O$7,0))","v":6086081.3056548676},{"$f":"INDEX('Comparison - Category'!$J$69:$O$78,MATCH($A119,'Comparison - Category'!$A$69:$A$78,0),MATCH(G$63,'Comparison - Category'!$J$7:$O$7,0))","v":0},{"$f":"INDEX('Comparison - Category'!$J$69:$O$78,MATCH($A119,'Comparison - Category'!$A$69:$A$78,0),MATCH(H$63,'Comparison - Category'!$J$7:$O$7,0))","v":362532.20642395876},{"$f":"INDEX('Comparison - Category'!$J$69:$O$78,MATCH($A119,'Comparison - Category'!$A$69:$A$78,0),MATCH(I$63,'Comparison - Category'!$J$7:$O$7,0))","v":10301484.100480186},null,null,null,null,null,null,null,null,null,null,null,null,0]
["Kāpiti Coast district",null,null,{"$f":"INDEX('Comparison - Category'!$J$69:$O$78,MATCH($A120,'Comparison - Category'!$A$69:$A$78,0),MATCH(D$63,'Comparison - Category'!$J$7:$O$7,0))","v":4904933.1921061305},{"$f":"INDEX('Comparison - Category'!$J$69:$O$78,MATCH($A120,'Comparison - Category'!$A$69:$A$78,0),MATCH(E$63,'Comparison - Category'!$J$7:$O$7,0))","v":1335375},{"$f":"INDEX('Comparison - Category'!$J$69:$O$78,MATCH($A120,'Comparison - Category'!$A$69:$A$78,0),MATCH(F$63,'Comparison - Category'!$J$7:$O$7,0))","v":3594210.5446725246},{"$f":"INDEX('Comparison - Category'!$J$69:$O$78,MATCH($A120,'Comparison - Category'!$A$69:$A$78,0),MATCH(G$63,'Comparison - Category'!$J$7:$O$7,0))","v":0},{"$f":"INDEX('Comparison - Category'!$J$69:$O$78,MATCH($A120,'Comparison - Category'!$A$69:$A$78,0),MATCH(H$63,'Comparison - Category'!$J$7:$O$7,0))","v":485529.92728148983},{"$f":"INDEX('Comparison - Category'!$J$69:$O$78,MATCH($A120,'Comparison - Category'!$A$69:$A$78,0),MATCH(I$63,'Comparison - Category'!$J$7:$O$7,0))","v":10320048.664060144},null,null,null,null,null,null,null,null,null,null,null,null,0]
["Masterton district",null,null,{"$f":"INDEX('Comparison - Category'!$J$69:$O$78,MATCH($A121,'Comparison - Category'!$A$69:$A$78,0),MATCH(D$63,'Comparison - Category'!$J$7:$O$7,0))","v":1968728.2422683882},{"$f":"INDEX('Comparison - Category'!$J$69:$O$78,MATCH($A121,'Comparison - Category'!$A$69:$A$78,0),MATCH(E$63,'Comparison - Category'!$J$7:$O$7,0))","v":0},{"$f":"INDEX('Comparison - Category'!$J$69:$O$78,MATCH($A121,'Comparison - Category'!$A$69:$A$78,0),MATCH(F$63,'Comparison - Category'!$J$7:$O$7,0))","v":437393.59292990481},{"$f":"INDEX('Comparison - Category'!$J$69:$O$78,MATCH($A121,'Comparison - Category'!$A$69:$A$78,0),MATCH(G$63,'Comparison - Category'!$J$7:$O$7,0))","v":0},{"$f":"INDEX('Comparison - Category'!$J$69:$O$78,MATCH($A121,'Comparison - Category'!$A$69:$A$78,0),MATCH(H$63,'Comparison - Category'!$J$7:$O$7,0))","v":243887.58058216906},{"$f":"INDEX('Comparison - Category'!$J$69:$O$78,MATCH($A121,'Comparison - Category'!$A$69:$A$78,0),MATCH(I$63,'Comparison - Category'!$J$7:$O$7,0))","v":2650009.4157804619},null,null,null,null,null,null,null,null,null,null,null,null,0]
["Carterton district",null,null,{"$f":"INDEX('Comparison - Category'!$J$69:$O$78,MATCH($A122,'Comparison - Category'!$A$69:$A$78,0),MATCH(D$63,'Comparison - Category'!$J$7:$O$7,0))","v":907437.02995516302},{"$f":"INDEX('Comparison - Category'!$J$69:$O$78,MATCH($A122,'Comparison - Category'!$A$69:$A$78,0),MATCH(E$63,'Comparison - Category'!$J$7:$O$7,0))","v":23705},{"$f":"INDEX('Comparison - Category'!$J$69:$O$78,MATCH($A122,'Comparison - Category'!$A$69:$A$78,0),MATCH(F$63,'Comparison - Category'!$J$7:$O$7,0))","v":249139.42310300161},{"$f":"INDEX('Comparison - Category'!$J$69:$O$78,MATCH($A122,'Comparison - Category'!$A$69:$A$78,0),MATCH(G$63,'Comparison - Category'!$J$7:$O$7,0))","v":0},{"$f":"INDEX('Comparison - Category'!$J$69:$O$78,MATCH($A122,'Comparison - Category'!$A$69:$A$78,0),MATCH(H$63,'Comparison - Category'!$J$7:$O$7,0))","v":90214.335422871896},{"$f":"INDEX('Comparison - Category'!$J$69:$O$78,MATCH($A122,'Comparison - Category'!$A$69:$A$78,0),MATCH(I$63,'Comparison - Category'!$J$7:$O$7,0))","v":1270495.7884810364},null,null,null,null,null,null,null,null,null,null,null,null,0]
["South Wairarapa district",null,null,{"$f":"INDEX('Comparison - Category'!$J$69:$O$78,MATCH($A123,'Comparison - Category'!$A$69:$A$78,0),MATCH(D$63,'Comparison - Category'!$J$7:$O$7,0))","v":1508400.8206117172},{"$f":"INDEX('Comparison - Category'!$J$69:$O$78,MATCH($A123,'Comparison - Category'!$A$69:$A$78,0),MATCH(E$63,'Comparison - Category'!$J$7:$O$7,0))","v":0},{"$f":"INDEX('Comparison - Category'!$J$69:$O$78,MATCH($A123,'Comparison - Category'!$A$69:$A$78,0),MATCH(F$63,'Comparison - Category'!$J$7:$O$7,0))","v":505501.25032055634},{"$f":"INDEX('Comparison - Category'!$J$69:$O$78,MATCH($A123,'Comparison - Category'!$A$69:$A$78,0),MATCH(G$63,'Comparison - Category'!$J$7:$O$7,0))","v":0},{"$f":"INDEX('Comparison - Category'!$J$69:$O$78,MATCH($A123,'Comparison - Category'!$A$69:$A$78,0),MATCH(H$63,'Comparison - Category'!$J$7:$O$7,0))","v":139773.94584747485},{"$f":"INDEX('Comparison - Category'!$J$69:$O$78,MATCH($A123,'Comparison - Category'!$A$69:$A$78,0),MATCH(I$63,'Comparison - Category'!$J$7:$O$7,0))","v":2153676.0167797483},null,null,null,null,null,null,null,null,null,null,null,null,0]
["Tararua district",null,null,{"$f":"INDEX('Comparison - Category'!$J$69:$O$78,MATCH($A124,'Comparison - Category'!$A$69:$A$78,0),MATCH(D$63,'Comparison - Category'!$J$7:$O$7,0))","v":2353.0246429774902},{"$f":"INDEX('Comparison - Category'!$J$69:$O$78,MATCH($A124,'Comparison - Category'!$A$69:$A$78,0),MATCH(E$63,'Comparison - Category'!$J$7:$O$7,0))","v":0},{"$f":"INDEX('Comparison - Category'!$J$69:$O$78,MATCH($A124,'Comparison - Category'!$A$69:$A$78,0),MATCH(F$63,'Comparison - Category'!$J$7:$O$7,0))","v":0},{"$f":"INDEX('Comparison - Category'!$J$69:$O$78,MATCH($A124,'Comparison - Category'!$A$69:$A$78,0),MATCH(G$63,'Comparison - Category'!$J$7:$O$7,0))","v":0},{"$f":"INDEX('Comparison - Category'!$J$69:$O$78,MATCH($A124,'Comparison - Category'!$A$69:$A$78,0),MATCH(H$63,'Comparison - Category'!$J$7:$O$7,0))","v":252},{"$f":"INDEX('Comparison - Category'!$J$69:$O$78,MATCH($A124,'Comparison - Category'!$A$69:$A$78,0),MATCH(I$63,'Comparison - Category'!$J$7:$O$7,0))","v":2605.0246429774902},null,null,null,null,null,null,null,null,null,null,null,null,0]
["Region wide",null,null,{"$f":"SUM(D116:D124)","v":47283313.907157809},{"$f":"SUM(E116:E124)","v":6458971},{"$f":"SUM(F116:F124)","v":68109677.793629259},{"$f":"SUM(G116:G124)","v":0},{"$f":"SUM(H116:H124)","v":4907860.8208731934},{"$f":"SUM(I116:I124)","v":126759823.52166025}]
[]
[]
[]
[]
[]
[]
[]
[null,null,null,null,"Differential",null,"ECV $000",null,"Rate",null,null,"Last years rate & differential, this years ECV",null,null,null,"Last years rate, this years differential and ECV"]
["PT",null,null,null,{"$f":"year_previous","v":"2017/18"},{"$f":"year_current","v":"2018/19"},{"$f":"year_previous","v":"2017/18"},{"$f":"year_current","v":"2018/19"},{"$f":"year_previous","v":"2017/18"},{"$f":"year_current","v":"2018/19"},null,"ECV multiplied","Proxy rate","ECV movement",null,"ECV multiplied","Proxy rate","Differenital impact",null,"Rate change impact"]
["By TA & Category"]
[{"$f":"Control!A67","v":"Wellington city"},{"$f":"Control!B67","v":"Wellington city"},{"$f":"Control!C67","v":"Regional CBD"},{"$f":"Control!D67","v":"Wellington cityRegional CBD"},{"$f":"IF(VALUE(LEFT(year_current,4))>2023,Control!N67,INDEX(Control!$H67:$M67,,MATCH(year_current,Control!$H$66:$M$66,0)-1))","v":6.7432051306625684},{"$f":"INDEX('Public transport'!$G$23:$G$49,MATCH(D136,'Public transport'!$D$23:$D$49,0),)","v":6.7860042755521404},{"$f":"INDEX('Capital values'!$G$19:$G$45,MATCH($D136,'Capital values'!$D$19:$D$45,0),)/1000","v":9699270.1905155852},{"$f":"INDEX('Capital values'!$H$19:$H$45,MATCH($D136,'Capital values'!$D$19:$D$45,0),)/1000","v":10564408.605061915},{"$f":"INDEX('Comparison - Category'!$L$22:$L$49,MATCH(D136,'Comparison - Category'!$D$22:$D$49,0),)","v":25019166.072671905},{"$f":"INDEX('Comparison - Category'!$L$81:$L$108,MATCH(D136,'Comparison - Category'!$D$81:$D$108,0),)","v":25844164.269209553},null,{"$f":"E136*H136","v":71237974.308069289},{"$f":"$I$163*L136/$L$163","v":24617077.472743507},{"$f":"M136-I136","v":-402088.59992839769},null,{"$f":"F136*H136","v":71690121.962629974},{"$f":"$I$163*P136/$P$163","v":24533819.226508711},{"$f":"Q136-M136","v":-83258.246234796941},null,{"$f":"J136-Q136","v":1310345.042700842}]
[{"$f":"Control!A68","v":"Wellington city"},{"$f":"Control!B68","v":"Wellington city"},{"$f":"Control!C68","v":"Business"},{"$f":"Control!D68","v":"Wellington cityBusiness"},{"$f":"IF(VALUE(LEFT(year_current,4))>2023,Control!N68,INDEX(Control!$H68:$M68,,MATCH(year_current,Control!$H$66:$M$66,0)-1))","v":0.66102222184300141},{"$f":"INDEX('Public transport'!$G$23:$G$49,MATCH(D137,'Public transport'!$D$23:$D$49,0),)","v":0.78418518486916788},{"$f":"INDEX('Capital values'!$G$19:$G$45,MATCH($D137,'Capital values'!$D$19:$D$45,0),)/1000","v":4717078.7325825868},{"$f":"INDEX('Capital values'!$H$19:$H$45,MATCH($D137,'Capital values'!$D$19:$D$45,0),)/1000","v":5168709.9438017989},{"$f":"INDEX('Comparison - Category'!$L$22:$L$49,MATCH(D137,'Comparison - Category'!$D$22:$D$49,0),)","v":1192769.6658868904},{"$f":"INDEX('Comparison - Category'!$L$81:$L$108,MATCH(D137,'Comparison - Category'!$D$81:$D$108,0),)","v":1461180.8372846076},null,3416632.1311138798,1180655.3833742025,{"$f":"M137-I137","v":-12114.282512687845},null,{"$f":"F137*H137","v":4053225.7628153199},1387096.3729281249,{"$f":"Q137-M137","v":206440.98955392232},null,{"$f":"J137-Q137","v":74084.464356482727}]
[{"$f":"Control!A69","v":"Wellington city"},{"$f":"Control!B69","v":"Wellington city"},{"$f":"Control!C69","v":"Residential"},{"$f":"Control!D69","v":"Wellington cityResidential"},{"$f":"IF(VALUE(LEFT(year_current,4))>2023,Control!N69,INDEX(Control!$H69:$M69,,MATCH(year_current,Control!$H$66:$M$66,0)-1))","v":0.6610222218430013},{"$f":"INDEX('Public transport'!$G$23:$G$49,MATCH(D138,'Public transport'!$D$23:$D$49,0),)","v":0.71751851820250112},{"$f":"INDEX('Capital values'!$G$19:$G$45,MATCH($D138,'Capital values'!$D$19:$D$45,0),)/1000","v":48243725.95046673},{"$f":"INDEX('Capital values'!$H$19:$H$45,MATCH($D138,'Capital values'!$D$19:$D$45,0),)/1000","v":52451361.685474649},{"$f":"INDEX('Comparison - Category'!$L$22:$L$49,MATCH(D138,'Comparison - Category'!$D$22:$D$49,0),)","v":12199001.997910665},{"$f":"INDEX('Comparison - Category'!$L$81:$L$108,MATCH(D138,'Comparison - Category'!$D$81:$D$108,0),)","v":13567288.342507737},null,34671515.640023321,11981129.375140209,-217872.6227704566,null,37634823.314265214,12879402.720155532,898273.34501532279,null,687885.62235220522]
[{"$f":"Control!A70","v":"Wellington city"},{"$f":"Control!B70","v":"Wellington city"},{"$f":"Control!C70","v":"Rural"},{"$f":"Control!D70","v":"Wellington cityRural"},{"$f":"IF(VALUE(LEFT(year_current,4))>2023,Control!N70,INDEX(Control!$H70:$M70,,MATCH(year_current,Control!$H$66:$M$66,0)-1))","v":0.16977822083083538},{"$f":"INDEX('Public transport'!$G$23:$G$49,MATCH(D139,'Public transport'!$D$23:$D$49,0),)","v":0.18314851735902948},{"$f":"INDEX('Capital values'!$G$19:$G$45,MATCH($D139,'Capital values'!$D$19:$D$45,0),)/1000","v":714756.7294350958},{"$f":"INDEX('Capital values'!$H$19:$H$45,MATCH($D139,'Capital values'!$D$19:$D$45,0),)/1000","v":790597.17566163384},{"$f":"INDEX('Comparison - Category'!$L$22:$L$49,MATCH(D139,'Comparison - Category'!$D$22:$D$49,0),)","v":46420.266791032431},{"$f":"INDEX('Comparison - Category'!$L$81:$L$108,MATCH(D139,'Comparison - Category'!$D$81:$D$108,0),)","v":52198.958688082472},null,134226.18187771563,46383.355931276194,-36.910859756237187,null,144796.70055066442,49552.378746917027,3169.0228156408339,null,2646.5799411654443]
[{"$f":"Control!A71","v":"Hutt city"},{"$f":"Control!B71","v":"Hutt city"},{"$f":"Control!C71","v":"Business"},{"$f":"Control!D71","v":"Hutt cityBusiness"},{"$f":"IF(VALUE(LEFT(year_current,4))>2023,Control!N71,INDEX(Control!$H71:$M71,,MATCH(year_current,Control!$H$66:$M$66,0)-1))","v":1.4203332341454968},{"$f":"INDEX('Public transport'!$G$23:$G$49,MATCH(D140,'Public transport'!$D$23:$D$49,0),)","v":1.4169443617879141},{"$f":"INDEX('Capital values'!$G$19:$G$45,MATCH($D140,'Capital values'!$D$19:$D$45,0),)/1000","v":3850999.6974912379},{"$f":"INDEX('Capital values'!$H$19:$H$45,MATCH($D140,'Capital values'!$D$19:$D$45,0),)/1000","v":4269787.4940657895},{"$f":"INDEX('Comparison - Category'!$L$22:$L$49,MATCH(D140,'Comparison - Category'!$D$22:$D$49,0),)","v":2092334.5898406077},{"$f":"INDEX('Comparison - Category'!$L$81:$L$108,MATCH(D140,'Comparison - Category'!$D$81:$D$108,0),)","v":2181032.9758243612},null,6064521.0805604588,2095662.9764573821,3328.386616774369,null,6050051.3157490669,2070450.7291682609,-25212.247289121151,null,110582.24665610027]
[{"$f":"Control!A72","v":"Hutt city"},{"$f":"Control!B72","v":"Hutt city"},{"$f":"Control!C72","v":"Residential"},{"$f":"Control!D72","v":"Hutt cityResidential"},{"$f":"IF(VALUE(LEFT(year_current,4))>2023,Control!N72,INDEX(Control!$H72:$M72,,MATCH(year_current,Control!$H$66:$M$66,0)-1))","v":1.4203332341454968},{"$f":"INDEX('Public transport'!$G$23:$G$49,MATCH(D141,'Public transport'!$D$23:$D$49,0),)","v":1.3502776951212474},{"$f":"INDEX('Capital values'!$G$19:$G$45,MATCH($D141,'Capital values'!$D$19:$D$45,0),)/1000","v":17299145.382635817},{"$f":"INDEX('Capital values'!$H$19:$H$45,MATCH($D141,'Capital values'!$D$19:$D$45,0),)/1000","v":19497250.753135219},{"$f":"INDEX('Comparison - Category'!$L$22:$L$49,MATCH(D141,'Comparison - Category'!$D$22:$D$49,0),)","v":9399014.0488326307},{"$f":"INDEX('Comparison - Category'!$L$81:$L$108,MATCH(D141,'Comparison - Category'!$D$81:$D$108,0),)","v":9490730.5694780909},null,27692593.21914627,9569484.8052364737,170470.75640384294,null,26326702.808144428,9009533.6685536839,-559951.13668278977,null,481196.90092440695]
[{"$f":"Control!A73","v":"Hutt city"},{"$f":"Control!B73","v":"Hutt city"},{"$f":"Control!C73","v":"Rural"},{"$f":"Control!D73","v":"Hutt cityRural"},{"$f":"IF(VALUE(LEFT(year_current,4))>2023,Control!N73,INDEX(Control!$H73:$M73,,MATCH(year_current,Control!$H$66:$M$66,0)-1))","v":0.36196331536479831},{"$f":"INDEX('Public transport'!$G$23:$G$49,MATCH(D142,'Public transport'!$D$23:$D$49,0),)","v":0.34330276280399857},{"$f":"INDEX('Capital values'!$G$19:$G$45,MATCH($D142,'Capital values'!$D$19:$D$45,0),)/1000","v":322575.29487294576},{"$f":"INDEX('Capital values'!$H$19:$H$45,MATCH($D142,'Capital values'!$D$19:$D$45,0),)/1000","v":351078.8247989894},{"$f":"INDEX('Comparison - Category'!$L$22:$L$49,MATCH(D142,'Comparison - Category'!$D$22:$D$49,0),)","v":44664.560147696888},{"$f":"INDEX('Comparison - Category'!$L$81:$L$108,MATCH(D142,'Comparison - Category'!$D$81:$D$108,0),)","v":43449.532506454168},null,127077.65537861937,43913.102778327127,-751.45736936976027,null,120526.33051547404,41246.564016761833,-2666.5387615652944,null,2202.9684896923354]
[{"$f":"Control!A74","v":"Upper Hutt city"},{"$f":"Control!B74","v":"Upper Hutt city"},{"$f":"Control!C74","v":"Business"},{"$f":"Control!D74","v":"Upper Hutt cityBusiness"},{"$f":"IF(VALUE(LEFT(year_current,4))>2023,Control!N74,INDEX(Control!$H74:$M74,,MATCH(year_current,Control!$H$66:$M$66,0)-1))","v":1.5967866383588816},{"$f":"INDEX('Public transport'!$G$23:$G$49,MATCH(D143,'Public transport'!$D$23:$D$49,0),)","v":1.5639888652990679},{"$f":"INDEX('Capital values'!$G$19:$G$45,MATCH($D143,'Capital values'!$D$19:$D$45,0),)/1000","v":1187700.995936275},{"$f":"INDEX('Capital values'!$H$19:$H$45,MATCH($D143,'Capital values'!$D$19:$D$45,0),)/1000","v":1316173.8510296158},{"$f":"INDEX('Comparison - Category'!$L$22:$L$49,MATCH(D143,'Comparison - Category'!$D$22:$D$49,0),)","v":725473.26340738265},{"$f":"INDEX('Comparison - Category'!$L$81:$L$108,MATCH(D143,'Comparison - Category'!$D$81:$D$108,0),)","v":742078.90929759946},null,2101648.8190814438,726248.21666170692,774.95325432426762,null,2058481.2478081132,704454.19023289997,-21794.026428806945,null,37624.719064699486]
[{"$f":"Control!A75","v":"Upper Hutt city"},{"$f":"Control!B75","v":"Upper Hutt city"},{"$f":"Control!C75","v":"Residential"},{"$f":"Control!D75","v":"Upper Hutt cityResidential"},{"$f":"IF(VALUE(LEFT(year_current,4))>2023,Control!N75,INDEX(Control!$H75:$M75,,MATCH(year_current,Control!$H$66:$M$66,0)-1))","v":1.5967866383588838},{"$f":"INDEX('Public transport'!$G$23:$G$49,MATCH(D144,'Public transport'!$D$23:$D$49,0),)","v":1.4973221986324032},{"$f":"INDEX('Capital values'!$G$19:$G$45,MATCH($D144,'Capital values'!$D$19:$D$45,0),)/1000","v":6130414.6514894199},{"$f":"INDEX('Capital values'!$H$19:$H$45,MATCH($D144,'Capital values'!$D$19:$D$45,0),)/1000","v":6898637.3350417325},{"$f":"INDEX('Comparison - Category'!$L$22:$L$49,MATCH(D144,'Comparison - Category'!$D$22:$D$49,0),)","v":3744588.864094113},{"$f":"INDEX('Comparison - Category'!$L$81:$L$108,MATCH(D144,'Comparison - Category'!$D$81:$D$108,0),)","v":3723760.5901796483},null,11015651.919478377,3806581.5226845741,61992.658590461127,null,10329482.822072269,3534959.3126951247,-271622.20998944947,null,188801.2774845236]
[{"$f":"Control!A76","v":"Upper Hutt city"},{"$f":"Control!B76","v":"Upper Hutt city"},{"$f":"Control!C76","v":"Rural"},{"$f":"Control!D76","v":"Upper Hutt cityRural"},{"$f":"IF(VALUE(LEFT(year_current,4))>2023,Control!N76,INDEX(Control!$H76:$M76,,MATCH(year_current,Control!$H$66:$M$66,0)-1))","v":0.40696070495298714},{"$f":"INDEX('Public transport'!$G$23:$G$49,MATCH(D145,'Public transport'!$D$23:$D$49,0),)","v":0.38080058746082263},{"$f":"INDEX('Capital values'!$G$19:$G$45,MATCH($D145,'Capital values'!$D$19:$D$45,0),)/1000","v":811441.41957430518},{"$f":"INDEX('Capital values'!$H$19:$H$45,MATCH($D145,'Capital values'!$D$19:$D$45,0),)/1000","v":957667.94692865165},{"$f":"INDEX('Comparison - Category'!$L$22:$L$49,MATCH(D145,'Comparison - Category'!$D$22:$D$49,0),)","v":126321.43490776002},{"$f":"INDEX('Comparison - Category'!$L$81:$L$108,MATCH(D145,'Comparison - Category'!$D$81:$D$108,0),)","v":131466.69197227218},null,389733.22279296396,134676.66693758944,8355.2320298294217,null,364680.51678283047,124801.09712804727,-9875.5698095421685,null,6665.5948442249064]
[{"$f":"Control!A77","v":"Porirua city"},{"$f":"Control!B77","v":"Porirua city"},{"$f":"Control!C77","v":"Business"},{"$f":"Control!D77","v":"Porirua cityBusiness"},{"$f":"IF(VALUE(LEFT(year_current,4))>2023,Control!N77,INDEX(Control!$H77:$M77,,MATCH(year_current,Control!$H$66:$M$66,0)-1))","v":1.6478083166527571},{"$f":"INDEX('Public transport'!$G$23:$G$49,MATCH(D146,'Public transport'!$D$23:$D$49,0),)","v":1.6065069305439641},{"$f":"INDEX('Capital values'!$G$19:$G$45,MATCH($D146,'Capital values'!$D$19:$D$45,0),)/1000","v":1097778.1155520245},{"$f":"INDEX('Capital values'!$H$19:$H$45,MATCH($D146,'Capital values'!$D$19:$D$45,0),)/1000","v":1223370.752990762},{"$f":"INDEX('Comparison - Category'!$L$22:$L$49,MATCH(D146,'Comparison - Category'!$D$22:$D$49,0),)","v":691972.22117957263},{"$f":"INDEX('Comparison - Category'!$L$81:$L$108,MATCH(D146,'Comparison - Category'!$D$81:$D$108,0),)","v":708506.55183594604},null,2015880.5011279234,696610.01669495751,4637.7955153848743,null,1965353.5933044471,672584.01093856571,-24026.005756391794,null,35922.540897380328]
[{"$f":"Control!A78","v":"Porirua city"},{"$f":"Control!B78","v":"Porirua city"},{"$f":"Control!C78","v":"Residential"},{"$f":"Control!D78","v":"Porirua cityResidential"},{"$f":"IF(VALUE(LEFT(year_current,4))>2023,Control!N78,INDEX(Control!$H78:$M78,,MATCH(year_current,Control!$H$66:$M$66,0)-1))","v":1.6478083166527566},{"$f":"INDEX('Public transport'!$G$23:$G$49,MATCH(D147,'Public transport'!$D$23:$D$49,0),)","v":1.5398402638772972},{"$f":"INDEX('Capital values'!$G$19:$G$45,MATCH($D147,'Capital values'!$D$19:$D$45,0),)/1000","v":8372223.1021721782},{"$f":"INDEX('Capital values'!$H$19:$H$45,MATCH($D147,'Capital values'!$D$19:$D$45,0),)/1000","v":9510430.8867820296},{"$f":"INDEX('Comparison - Category'!$L$22:$L$49,MATCH(D147,'Comparison - Category'!$D$22:$D$49,0),)","v":5277337.6824949672},{"$f":"INDEX('Comparison - Category'!$L$81:$L$108,MATCH(D147,'Comparison - Category'!$D$81:$D$108,0),)","v":5279332.7856404223},null,15671367.11019068,5415415.89303263,138078.21053766273,null,14644544.406289238,5011661.2342459885,-403754.65878664143,null,267671.55139443371]
[{"$f":"Control!A79","v":"Porirua city"},{"$f":"Control!B79","v":"Porirua city"},{"$f":"Control!C79","v":"Rural"},{"$f":"Control!D79","v":"Porirua cityRural"},{"$f":"IF(VALUE(LEFT(year_current,4))>2023,Control!N79,INDEX(Control!$H79:$M79,,MATCH(year_current,Control!$H$66:$M$66,0)-1))","v":0.41985169040555043},{"$f":"INDEX('Public transport'!$G$23:$G$49,MATCH(D148,'Public transport'!$D$23:$D$49,0),)","v":0.39154307533795868},{"$f":"INDEX('Capital values'!$G$19:$G$45,MATCH($D148,'Capital values'!$D$19:$D$45,0),)/1000","v":602474.38027579733},{"$f":"INDEX('Capital values'!$H$19:$H$45,MATCH($D148,'Capital values'!$D$19:$D$45,0),)/1000","v":696008.16322720749},{"$f":"INDEX('Comparison - Category'!$L$22:$L$49,MATCH(D148,'Comparison - Category'!$D$22:$D$49,0),)","v":96761.343725979576},{"$f":"INDEX('Comparison - Category'!$L$81:$L$108,MATCH(D148,'Comparison - Category'!$D$81:$D$108,0),)","v":98241.968178499475},null,292220.2038670053,100979.95440726809,4218.6106812885118,null,272517.17669030477,93260.92585703278,-7719.0285502353072,null,4981.0423214666953]
[{"$f":"Control!A80","v":"Kāpiti Coast district"},{"$f":"Control!B80","v":"Kāpiti Coast district"},{"$f":"Control!C80","v":"Business"},{"$f":"Control!D80","v":"Kāpiti Coast districtBusiness"},{"$f":"IF(VALUE(LEFT(year_current,4))>2023,Control!N80,INDEX(Control!$H80:$M80,,MATCH(year_current,Control!$H$66:$M$66,0)-1))","v":0.70397657056626128},{"$f":"INDEX('Public transport'!$G$23:$G$49,MATCH(D149,'Public transport'!$D$23:$D$49,0),)","v":0.81998047547188435},{"$f":"INDEX('Capital values'!$G$19:$G$45,MATCH($D149,'Capital values'!$D$19:$D$45,0),)/1000","v":1496826.9870055292},{"$f":"INDEX('Capital values'!$H$19:$H$45,MATCH($D149,'Capital values'!$D$19:$D$45,0),)/1000","v":1469983.9842336313},{"$f":"INDEX('Comparison - Category'!$L$22:$L$49,MATCH(D149,'Comparison - Category'!$D$22:$D$49,0),)","v":403085.53282028827},{"$f":"INDEX('Comparison - Category'!$L$81:$L$108,MATCH(D149,'Comparison - Category'!$D$81:$D$108,0),)","v":434529.5223524808},null,1034834.2840081209,357598.54190566734,-45486.990914620925,null,1205358.166327948,412498.10359230469,54899.561686637346,null,22031.418760176108]
[{"$f":"Control!A81","v":"Kāpiti Coast district"},{"$f":"Control!B81","v":"Kāpiti Coast district excl Ōtaki "},{"$f":"Control!C81","v":"Residential"},{"$f":"Control!D81","v":"Kāpiti Coast district excl Ōtaki Residential"},{"$f":"IF(VALUE(LEFT(year_current,4))>2023,Control!N81,INDEX(Control!$H81:$M81,,MATCH(year_current,Control!$H$66:$M$66,0)-1))","v":0.70397657056626128},{"$f":"INDEX('Public transport'!$G$23:$G$49,MATCH(D150,'Public transport'!$D$23:$D$49,0),)","v":0.7533138088052177},{"$f":"INDEX('Capital values'!$G$19:$G$45,MATCH($D150,'Capital values'!$D$19:$D$45,0),)/1000","v":8564308.4591791499},{"$f":"INDEX('Capital values'!$H$19:$H$45,MATCH($D150,'Capital values'!$D$19:$D$45,0),)/1000","v":10156671.508779688},{"$f":"INDEX('Comparison - Category'!$L$22:$L$49,MATCH(D150,'Comparison - Category'!$D$22:$D$49,0),)","v":2306311.1959330132},{"$f":"INDEX('Comparison - Category'!$L$81:$L$108,MATCH(D150,'Comparison - Category'!$D$81:$D$108,0),)","v":2758230.1956271366},null,7150058.7771187797,2470782.6487293206,164471.45279630739,null,7651160.8990622638,2618383.024489406,147600.37576008542,null,139847.17113773059]
[{"$f":"Control!A82","v":"Kāpiti Coast district"},{"$f":"Control!B82","v":"Ōtaki rating area"},{"$f":"Control!C82","v":"Residential"},{"$f":"Control!D82","v":"Ōtaki rating areaResidential"},{"$f":"IF(VALUE(LEFT(year_current,4))>2023,Control!N82,INDEX(Control!$H82:$M82,,MATCH(year_current,Control!$H$66:$M$66,0)-1))","v":0.70397657056626128},{"$f":"INDEX('Public transport'!$G$23:$G$49,MATCH(D151,'Public transport'!$D$23:$D$49,0),)","v":0.66998047547188444},{"$f":"INDEX('Capital values'!$G$19:$G$45,MATCH($D151,'Capital values'!$D$19:$D$45,0),)/1000","v":901915.28636844468},{"$f":"INDEX('Capital values'!$H$19:$H$45,MATCH($D151,'Capital values'!$D$19:$D$45,0),)/1000","v":1097915.274559828},{"$f":"INDEX('Comparison - Category'!$L$22:$L$49,MATCH(D151,'Comparison - Category'!$D$22:$D$49,0),)","v":242879.77630058862},{"$f":"INDEX('Comparison - Category'!$L$81:$L$108,MATCH(D151,'Comparison - Category'!$D$81:$D$108,0),)","v":265175.95858639781},null,{"$f":"E151*H151","v":772906.62975694286},267086.51626789098,{"$f":"M151-I151","v":24206.739967302361},null,{"$f":"F151*H151","v":735581.79767743812},251731.06637949045,{"$f":"Q151-M151","v":-15355.44988840053},null,{"$f":"J151-Q151","v":13444.89220690736}]
[{"$f":"Control!A83","v":"Kāpiti Coast district"},{"$f":"Control!B83","v":"Kāpiti Coast district"},{"$f":"Control!C83","v":"Rural"},{"$f":"Control!D83","v":"Kāpiti Coast districtRural"},{"$f":"IF(VALUE(LEFT(year_current,4))>2023,Control!N83,INDEX(Control!$H83:$M83,,MATCH(year_current,Control!$H$66:$M$66,0)-1))","v":0.18212407515403917},{"$f":"INDEX('Public transport'!$G$23:$G$49,MATCH(D152,'Public transport'!$D$23:$D$49,0),)","v":0.19343672929503264},{"$f":"INDEX('Capital values'!$G$19:$G$45,MATCH($D152,'Capital values'!$D$19:$D$45,0),)/1000","v":1985748.5594468778},{"$f":"INDEX('Capital values'!$H$19:$H$45,MATCH($D152,'Capital values'!$D$19:$D$45,0),)/1000","v":1954220.9124268526},{"$f":"INDEX('Comparison - Category'!$L$22:$L$49,MATCH(D152,'Comparison - Category'!$D$22:$D$49,0),)","v":138343.58211628126},{"$f":"INDEX('Comparison - Category'!$L$81:$L$108,MATCH(D152,'Comparison - Category'!$D$81:$D$108,0),)","v":136274.86810650953},null,355910.6763224231,122988.90833864146,-15354.673777639808,null,378018.1016198048,129365.49019016432,6376.5818515228602,null,6909.3779163452127]
[{"$f":"Control!A84","v":"Masterton district"},{"$f":"Control!B84","v":"Masterton district"},{"$f":"Control!C84","v":"Business"},{"$f":"Control!D84","v":"Masterton districtBusiness"},{"$f":"IF(VALUE(LEFT(year_current,4))>2023,Control!N84,INDEX(Control!$H84:$M84,,MATCH(year_current,Control!$H$66:$M$66,0)-1))","v":0.24898742270676497},{"$f":"INDEX('Public transport'!$G$23:$G$49,MATCH(D153,'Public transport'!$D$23:$D$49,0),)","v":0.37415618558897079},{"$f":"INDEX('Capital values'!$G$19:$G$45,MATCH($D153,'Capital values'!$D$19:$D$45,0),)/1000","v":404283.09412757982},{"$f":"INDEX('Capital values'!$H$19:$H$45,MATCH($D153,'Capital values'!$D$19:$D$45,0),)/1000","v":436714.76993490307},{"$f":"INDEX('Comparison - Category'!$L$22:$L$49,MATCH(D153,'Comparison - Category'!$D$22:$D$49,0),)","v":38506.176018556216},{"$f":"INDEX('Comparison - Category'!$L$81:$L$108,MATCH(D153,'Comparison - Category'!$D$81:$D$108,0),)","v":58905.247251236593},null,108736.48502406932,37575.10656290692,-931.06945564929629,null,163399.53250920828,55918.646565654199,18343.540002747279,null,2986.6006855823944]
[{"$f":"Control!A85","v":"Masterton district"},{"$f":"Control!B85","v":"Masterton district"},{"$f":"Control!C85","v":"Residential"},{"$f":"Control!D85","v":"Masterton districtResidential"},{"$f":"IF(VALUE(LEFT(year_current,4))>2023,Control!N85,INDEX(Control!$H85:$M85,,MATCH(year_current,Control!$H$66:$M$66,0)-1))","v":0.24898742270676497},{"$f":"INDEX('Public transport'!$G$23:$G$49,MATCH(D154,'Public transport'!$D$23:$D$49,0),)","v":0.29082285225563748},{"$f":"INDEX('Capital values'!$G$19:$G$45,MATCH($D154,'Capital values'!$D$19:$D$45,0),)/1000","v":2094766.3656687392},{"$f":"INDEX('Capital values'!$H$19:$H$45,MATCH($D154,'Capital values'!$D$19:$D$45,0),)/1000","v":2624397.3530479106},{"$f":"INDEX('Comparison - Category'!$L$22:$L$49,MATCH(D154,'Comparison - Category'!$D$22:$D$49,0),)","v":199517.22831313196},{"$f":"INDEX('Comparison - Category'!$L$81:$L$108,MATCH(D154,'Comparison - Category'!$D$81:$D$108,0),)","v":275144.79030540778},null,653441.93309385516,225804.15638080033,26286.92806766837,null,763234.72366553859,261194.4606199094,35390.304239109071,null,13950.329685498378]
[{"$f":"Control!A86","v":"Masterton district"},{"$f":"Control!B86","v":"Masterton district"},{"$f":"Control!C86","v":"Rural"},{"$f":"Control!D86","v":"Masterton districtRural"},{"$f":"IF(VALUE(LEFT(year_current,4))>2023,Control!N86,INDEX(Control!$H86:$M86,,MATCH(year_current,Control!$H$66:$M$66,0)-1))","v":7.1528999445780297E-2},{"$f":"INDEX('Public transport'!$G$23:$G$49,MATCH(D155,'Public transport'!$D$23:$D$49,0),)","v":0.10127416620481691},{"$f":"INDEX('Capital values'!$G$19:$G$45,MATCH($D155,'Capital values'!$D$19:$D$45,0),)/1000","v":2511691.0562036815},{"$f":"INDEX('Capital values'!$H$19:$H$45,MATCH($D155,'Capital values'!$D$19:$D$45,0),)/1000","v":2830619.8560171863},{"$f":"INDEX('Comparison - Category'!$L$22:$L$49,MATCH(D155,'Comparison - Category'!$D$22:$D$49,0),)","v":68725.161699023694},{"$f":"INDEX('Comparison - Category'!$L$81:$L$108,MATCH(D155,'Comparison - Category'!$D$81:$D$108,0),)","v":103343.55537326045},null,202471.40611226801,69966.255198759041,1241.093499735347,null,286668.66576093942,98103.853517636337,28137.598318877295,null,5239.7018556241092]
[{"$f":"Control!A87","v":"Carterton district"},{"$f":"Control!B87","v":"Carterton district"},{"$f":"Control!C87","v":"Business"},{"$f":"Control!D87","v":"Carterton districtBusiness"},{"$f":"IF(VALUE(LEFT(year_current,4))>2023,Control!N87,INDEX(Control!$H87:$M87,,MATCH(year_current,Control!$H$66:$M$66,0)-1))","v":0.4467021244082775},{"$f":"INDEX('Public transport'!$G$23:$G$49,MATCH(D156,'Public transport'!$D$23:$D$49,0),)","v":0.5389184370068979},{"$f":"INDEX('Capital values'!$G$19:$G$45,MATCH($D156,'Capital values'!$D$19:$D$45,0),)/1000","v":98453.654542029501},{"$f":"INDEX('Capital values'!$H$19:$H$45,MATCH($D156,'Capital values'!$D$19:$D$45,0),)/1000","v":97761.867838242251},{"$f":"INDEX('Comparison - Category'!$L$22:$L$49,MATCH(D156,'Comparison - Category'!$D$22:$D$49,0),)","v":16823.535173389577},{"$f":"INDEX('Comparison - Category'!$L$81:$L$108,MATCH(D156,'Comparison - Category'!$D$81:$D$108,0),)","v":18993.09347979879},null,43670.434049464071,15090.806114376292,-1732.7290590132852,null,52685.673014260436,18030.109897603459,2939.3037832271675,null,962.98358219533111]
[{"$f":"Control!A88","v":"Carterton district"},{"$f":"Control!B88","v":"Carterton district"},{"$f":"Control!C88","v":"Residential"},{"$f":"Control!D88","v":"Carterton districtResidential"},{"$f":"IF(VALUE(LEFT(year_current,4))>2023,Control!N88,INDEX(Control!$H88:$M88,,MATCH(year_current,Control!$H$66:$M$66,0)-1))","v":0.44670212440827739},{"$f":"INDEX('Public transport'!$G$23:$G$49,MATCH(D157,'Public transport'!$D$23:$D$49,0),)","v":0.45558510367356447},{"$f":"INDEX('Capital values'!$G$19:$G$45,MATCH($D157,'Capital values'!$D$19:$D$45,0),)/1000","v":643076.30383414833},{"$f":"INDEX('Capital values'!$H$19:$H$45,MATCH($D157,'Capital values'!$D$19:$D$45,0),)/1000","v":853599.85570894135},{"$f":"INDEX('Comparison - Category'!$L$22:$L$49,MATCH(D157,'Comparison - Category'!$D$22:$D$49,0),)","v":109887.40709577865},{"$f":"INDEX('Comparison - Category'!$L$81:$L$108,MATCH(D157,'Comparison - Category'!$D$81:$D$108,0),)","v":140193.22360905298},null,381304.86893978313,131764.15515175182,21876.748055973178,null,388887.37875889771,133085.17810745275,1321.0229557009297,null,7108.0455016002234]
[{"$f":"Control!A89","v":"Carterton district"},{"$f":"Control!B89","v":"Carterton district"},{"$f":"Control!C89","v":"Rural"},{"$f":"Control!D89","v":"Carterton districtRural"},{"$f":"IF(VALUE(LEFT(year_current,4))>2023,Control!N89,INDEX(Control!$H89:$M89,,MATCH(year_current,Control!$H$66:$M$66,0)-1))","v":0.11971679562309516},{"$f":"INDEX('Public transport'!$G$23:$G$49,MATCH(D158,'Public transport'!$D$23:$D$49,0),)","v":0.14143066301924595},{"$f":"INDEX('Capital values'!$G$19:$G$45,MATCH($D158,'Capital values'!$D$19:$D$45,0),)/1000","v":1573910.6346238223},{"$f":"INDEX('Capital values'!$H$19:$H$45,MATCH($D158,'Capital values'!$D$19:$D$45,0),)/1000","v":1764287.7264528167},{"$f":"INDEX('Comparison - Category'!$L$22:$L$49,MATCH(D158,'Comparison - Category'!$D$22:$D$49,0),)","v":72077.971340367745},{"$f":"INDEX('Comparison - Category'!$L$81:$L$108,MATCH(D158,'Comparison - Category'!$D$81:$D$108,0),)","v":89953.106014149846},null,211214.87316808707,72987.657870354902,909.68652998715697,null,249524.38290893991,85392.323730250937,12404.665859896035,null,4560.7822838989086]
[{"$f":"Control!A90","v":"South Wairarapa district"},{"$f":"Control!B90","v":"South Wairarapa district"},{"$f":"Control!C90","v":"Business"},{"$f":"Control!D90","v":"South Wairarapa districtBusiness"},{"$f":"IF(VALUE(LEFT(year_current,4))>2023,Control!N90,INDEX(Control!$H90:$M90,,MATCH(year_current,Control!$H$66:$M$66,0)-1))","v":0.59024972692395639},{"$f":"INDEX('Public transport'!$G$23:$G$49,MATCH(D159,'Public transport'!$D$23:$D$49,0),)","v":0.65854143910329699},{"$f":"INDEX('Capital values'!$G$19:$G$45,MATCH($D159,'Capital values'!$D$19:$D$45,0),)/1000","v":196344.62520795071},{"$f":"INDEX('Capital values'!$H$19:$H$45,MATCH($D159,'Capital values'!$D$19:$D$45,0),)/1000","v":206789.47140512333},{"$f":"INDEX('Comparison - Category'!$L$22:$L$49,MATCH(D159,'Comparison - Category'!$D$22:$D$49,0),)","v":44332.499023699995},{"$f":"INDEX('Comparison - Category'!$L$81:$L$108,MATCH(D159,'Comparison - Category'!$D$81:$D$108,0),)","v":49092.449839139968},null,122057.42902762334,42178.307506373705,-2154.1915173262896,null,136179.43609054,46603.375415580602,4425.0679092068967,null,2489.0744235593666]
[{"$f":"Control!A91","v":"South Wairarapa district"},{"$f":"Control!B91","v":"South Wairarapa district"},{"$f":"Control!C91","v":"Residential"},{"$f":"Control!D91","v":"South Wairarapa districtResidential"},{"$f":"IF(VALUE(LEFT(year_current,4))>2023,Control!N91,INDEX(Control!$H91:$M91,,MATCH(year_current,Control!$H$66:$M$66,0)-1))","v":0.59024972692395627},{"$f":"INDEX('Public transport'!$G$23:$G$49,MATCH(D160,'Public transport'!$D$23:$D$49,0),)","v":0.57520810576996362},{"$f":"INDEX('Capital values'!$G$19:$G$45,MATCH($D160,'Capital values'!$D$19:$D$45,0),)/1000","v":915432.86345302884},{"$f":"INDEX('Capital values'!$H$19:$H$45,MATCH($D160,'Capital values'!$D$19:$D$45,0),)/1000","v":1320775.8471088915},{"$f":"INDEX('Comparison - Category'!$L$22:$L$49,MATCH(D160,'Comparison - Category'!$D$22:$D$49,0),)","v":206694.86868974354},{"$f":"INDEX('Comparison - Category'!$L$81:$L$108,MATCH(D160,'Comparison - Category'!$D$81:$D$108,0),)","v":273878.08936080622},null,779587.58308378025,269395.19429019553,62700.325600451994,null,759720.97316222452,259991.98366359595,-9403.2106265995826,null,13886.105697210267]
[{"$f":"Control!A92","v":"South Wairarapa district"},{"$f":"Control!B92","v":"South Wairarapa district"},{"$f":"Control!C92","v":"Rural"},{"$f":"Control!D92","v":"South Wairarapa districtRural"},{"$f":"IF(VALUE(LEFT(year_current,4))>2023,Control!N92,INDEX(Control!$H92:$M92,,MATCH(year_current,Control!$H$66:$M$66,0)-1))","v":0.15344275637777782},{"$f":"INDEX('Public transport'!$G$23:$G$49,MATCH(D161,'Public transport'!$D$23:$D$49,0),)","v":0.16953563031481486},{"$f":"INDEX('Capital values'!$G$19:$G$45,MATCH($D161,'Capital values'!$D$19:$D$45,0),)/1000","v":2613181.7103390205},{"$f":"INDEX('Capital values'!$H$19:$H$45,MATCH($D161,'Capital values'!$D$19:$D$45,0),)/1000","v":2986563.7324859854},{"$f":"INDEX('Comparison - Category'!$L$22:$L$49,MATCH(D161,'Comparison - Category'!$D$22:$D$49,0),)","v":153385.18071582823},{"$f":"INDEX('Comparison - Category'!$L$81:$L$108,MATCH(D161,'Comparison - Category'!$D$81:$D$108,0),)","v":182530.7111206101},null,458266.57121055387,158359.13073374532,4973.9500179170864,null,506328.96486237767,173276.07978619687,14916.949052451557,null,9254.6313344132213]
[{"$f":"Control!A93","v":"Tararua district"},{"$f":"Control!B93","v":"Tararua district"},{"$f":"Control!C93","v":"Rural"},{"$f":"Control!D93","v":"Tararua districtRural"},{"$f":"IF(VALUE(LEFT(year_current,4))>2023,Control!N93,INDEX(Control!$H93:$M93,,MATCH(year_current,Control!$H$66:$M$66,0)-1))","v":0},{"$f":"INDEX('Public transport'!$G$23:$G$49,MATCH(D162,'Public transport'!$D$23:$D$49,0),)","v":0},{"$f":"INDEX('Capital values'!$G$19:$G$45,MATCH($D162,'Capital values'!$D$19:$D$45,0),)/1000","v":7041.7999999999993},{"$f":"INDEX('Capital values'!$H$19:$H$45,MATCH($D162,'Capital values'!$D$19:$D$45,0),)/1000","v":7041.8},{"$f":"INDEX('Comparison - Category'!$L$22:$L$49,MATCH(D162,'Comparison - Category'!$D$22:$D$49,0),)","v":0},{"$f":"INDEX('Comparison - Category'!$L$81:$L$108,MATCH(D162,'Comparison - Category'!$D$81:$D$108,0),)","v":0},null,0,0,0,null,0,0,0,null,0]
[{"$f":"Control!A94","v":"Region wide"},null,{"$f":"Control!C94","v":0},{"$f":"Control!D94","v":"Region wide"},null,null,{"$f":"SUM(G136:G162)","v":127056566.043},{"$f":"SUM(H136:H162)","v":141502827.37799999},{"$f":"SUM(I136:I162)","v":64656396.127130896},{"$f":"SUM(J136:J162)","v":68109677.793629259},null,{"$f":"SUM(L136:L162)","v":187105503.94362372},{"$f":"SUM(M136:M162)","v":64656396.127130888},0,null,{"$f":"SUM(P136:P162)","v":188932056.65303773},{"$f":"SUM(Q136:Q162)","v":64656396.127130888},0,null,3453281.6664983705]

{"sheet":"4","index":27,"n_rows":53,"n_cols":21,"rows_kept":53,"cut":false,"hidden":false,"merged":[[10,15,10,17],[10,3,10,5],[10,9,10,11],[10,6,10,8],[10,12,10,14],[11,15,11,17],[47,0,47,23],[52,0,53,23],[49,0,50,23],[30,15,30,17],[27,0,28,23],[31,15,31,17],[11,3,11,5]]}
["PAGE NOT USED"]
[]
["RATES AND LEVIES - REGION-WIDE TOTAL RATES BY CITY AND RATE TYPE"]
[{"$f":"+'3'!A4","v":"WHAT IS THE IMPACT ON YOUR CITY OR DISTRICT?"}]
[]
[]
[]
[]
[{"$f":"\"Percentage changes in each rate type which together make up the changes in region-wide rates from \"&year_previous&\" to \"&year_current","v":"Percentage changes in each rate type which together make up the changes in region-wide rates from 2017/18 to 2018/19"}]
[]
[null,null,null,"General rate",null,null,"River management rate",null,null,"Public rransport rate",null,null,"Stadium purposes rate",null,null,"Wellington regional strategy rate"]
[null,null,null,"General rate",null,null,"River Management rate",null,null,"Public transport rate",null,null,"Stadium purposes rate",null,null,"Wellington regional strategy rate"]
[null,null,null,{"$f":"year_previous","v":"2017/18"},{"$f":"year_current","v":"2018/19"},null,{"$f":"year_previous","v":"2017/18"},{"$f":"year_current","v":"2018/19"},null,{"$f":"year_previous","v":"2017/18"},{"$f":"year_current","v":"2018/19"},null,{"$f":"year_previous","v":"2017/18"},{"$f":"year_current","v":"2018/19"},null,{"$f":"year_previous","v":"2017/18"},{"$f":"year_current","v":"2018/19"}]
[null,null,null,"Budget","Plan","Change","Budget","Plan","Change","Budget","Plan","Change","Budget","Plan","Change","Budget","Plan","Change"]
[null,null,null,"$000s","$000s","%   ","$000s","$000s","%   ","$000s","$000s","%   ","$000s","$000s","%   ","$000s","$000s","%   "]
["Wellington city",null,null,{"$f":"INDEX('Comparison - TA'!$B$7:$L$22,MATCH(D$12,'Comparison - TA'!$A$7:$A$22,0),MATCH($A16,'Comparison - TA'!$B$6:$L$6,0))/1000","v":21189.528406917834},{"$f":"INDEX('Comparison - TA'!$B$30:$L$45,MATCH(D$12,'Comparison - TA'!$A$30:$A$45,0),MATCH($A16,'Comparison - TA'!$B$29:$L$29,0))/1000","v":23048.092376524466},{"$f":"IF(D16=0,\"n/a\",E16/D16-1)","v":8.7711436229975792E-2},{"$f":"INDEX('Comparison - TA'!$B$7:$L$22,MATCH(G$12,'Comparison - TA'!$A$7:$A$22,0),MATCH($A16,'Comparison - TA'!$B$6:$L$6,0))/1000","v":43.255000000000003},{"$f":"INDEX('Comparison - TA'!$B$30:$L$45,MATCH(G$12,'Comparison - TA'!$A$30:$A$45,0),MATCH($A16,'Comparison - TA'!$B$29:$L$29,0))/1000","v":42.679000000000002},{"$f":"IF(G16=0,\"n/a\",H16/G16-1)","v":-1.3316379609293771E-2},{"$f":"INDEX('Comparison - TA'!$B$7:$L$22,MATCH(J$12,'Comparison - TA'!$A$7:$A$22,0),MATCH($A16,'Comparison - TA'!$B$6:$L$6,0))/1000","v":38457.358003260495},{"$f":"INDEX('Comparison - TA'!$B$30:$L$45,MATCH(J$12,'Comparison - TA'!$A$30:$A$45,0),MATCH($A16,'Comparison - TA'!$B$29:$L$29,0))/1000","v":40924.832407689973},{"$f":"IF(J16=0,\"n/a\",K16/J16-1)","v":6.4161308330652478E-2},{"$f":"INDEX('Comparison - TA'!$B$7:$L$22,MATCH(M$12,'Comparison - TA'!$A$7:$A$22,0),MATCH($A16,'Comparison - TA'!$B$6:$L$6,0))/1000","v":580.98599999999999},{"$f":"INDEX('Comparison - TA'!$B$30:$L$45,MATCH(M$12,'Comparison - TA'!$A$30:$A$45,0),MATCH($A16,'Comparison - TA'!$B$29:$L$29,0))/1000","v":0},{"$f":"IF(M16=0,\"n/a\",N16/M16-1)","v":-1},{"$f":"INDEX('Comparison - TA'!$B$7:$L$22,MATCH(P$12,'Comparison - TA'!$A$7:$A$22,0),MATCH($A16,'Comparison - TA'!$B$6:$L$6,0))/1000","v":2299.8509726340426},{"$f":"INDEX('Comparison - TA'!$B$30:$L$45,MATCH(P$12,'Comparison - TA'!$A$30:$A$45,0),MATCH($A16,'Comparison - TA'!$B$29:$L$29,0))/1000","v":2351.4724227200213},{"$f":"IF(P16=0,\"n/a\",Q16/P16-1)","v":2.2445563082227116E-2},null,{"$f":"+D16+G16+J16+M16+P16-P36","v":0},{"$f":"+E16+H16+K16+N16+Q16-Q36","v":0}]
["Hutt city",null,null,{"$f":"INDEX('Comparison - TA'!$B$7:$L$22,MATCH(D$12,'Comparison - TA'!$A$7:$A$22,0),MATCH($A17,'Comparison - TA'!$B$6:$L$6,0))/1000","v":7179.4560529976616},{"$f":"INDEX('Comparison - TA'!$B$30:$L$45,MATCH(D$12,'Comparison - TA'!$A$30:$A$45,0),MATCH($A17,'Comparison - TA'!$B$29:$L$29,0))/1000","v":8059.0933870078825},{"$f":"IF(D17=0,\"n/a\",E17/D17-1)","v":0.12252144556869915},{"$f":"INDEX('Comparison - TA'!$B$7:$L$22,MATCH(G$12,'Comparison - TA'!$A$7:$A$22,0),MATCH($A17,'Comparison - TA'!$B$6:$L$6,0))/1000","v":3685.5859999999998},{"$f":"INDEX('Comparison - TA'!$B$30:$L$45,MATCH(G$12,'Comparison - TA'!$A$30:$A$45,0),MATCH($A17,'Comparison - TA'!$B$29:$L$29,0))/1000","v":4356.5619999999999},{"$f":"IF(G17=0,\"n/a\",H17/G17-1)","v":0.18205408854928362},{"$f":"INDEX('Comparison - TA'!$B$7:$L$22,MATCH(J$12,'Comparison - TA'!$A$7:$A$22,0),MATCH($A17,'Comparison - TA'!$B$6:$L$6,0))/1000","v":11536.013198820936},{"$f":"INDEX('Comparison - TA'!$B$30:$L$45,MATCH(J$12,'Comparison - TA'!$A$30:$A$45,0),MATCH($A17,'Comparison - TA'!$B$29:$L$29,0))/1000","v":11715.213077808907},{"$f":"IF(J17=0,\"n/a\",K17/J17-1)","v":1.5533952319531474E-2},{"$f":"INDEX('Comparison - TA'!$B$7:$L$22,MATCH(M$12,'Comparison - TA'!$A$7:$A$22,0),MATCH($A17,'Comparison - TA'!$B$6:$L$6,0))/1000","v":190.92400000000001},{"$f":"INDEX('Comparison - TA'!$B$30:$L$45,MATCH(M$12,'Comparison - TA'!$A$30:$A$45,0),MATCH($A17,'Comparison - TA'!$B$29:$L$29,0))/1000","v":0},{"$f":"IF(M17=0,\"n/a\",N17/M17-1)","v":-1},{"$f":"INDEX('Comparison - TA'!$B$7:$L$22,MATCH(P$12,'Comparison - TA'!$A$7:$A$22,0),MATCH($A17,'Comparison - TA'!$B$6:$L$6,0))/1000","v":862.25231806421573},{"$f":"INDEX('Comparison - TA'!$B$30:$L$45,MATCH(P$12,'Comparison - TA'!$A$30:$A$45,0),MATCH($A17,'Comparison - TA'!$B$29:$L$29,0))/1000","v":883.09145795915526},{"$f":"IF(P17=0,\"n/a\",Q17/P17-1)","v":2.4168261955762604E-2},null,0,0]
["Upper Hutt city",null,null,{"$f":"INDEX('Comparison - TA'!$B$7:$L$22,MATCH(D$12,'Comparison - TA'!$A$7:$A$22,0),MATCH($A18,'Comparison - TA'!$B$6:$L$6,0))/1000","v":2718.1370908558238},{"$f":"INDEX('Comparison - TA'!$B$30:$L$45,MATCH(D$12,'Comparison - TA'!$A$30:$A$45,0),MATCH($A18,'Comparison - TA'!$B$29:$L$29,0))/1000","v":3064.9932456397232},0.12760804300517803,{"$f":"INDEX('Comparison - TA'!$B$7:$L$22,MATCH(G$12,'Comparison - TA'!$A$7:$A$22,0),MATCH($A18,'Comparison - TA'!$B$6:$L$6,0))/1000","v":678.04499999999996},{"$f":"INDEX('Comparison - TA'!$B$30:$L$45,MATCH(G$12,'Comparison - TA'!$A$30:$A$45,0),MATCH($A18,'Comparison - TA'!$B$29:$L$29,0))/1000","v":667.06200000000001},-1.6198039953100429E-2,{"$f":"INDEX('Comparison - TA'!$B$7:$L$22,MATCH(J$12,'Comparison - TA'!$A$7:$A$22,0),MATCH($A18,'Comparison - TA'!$B$6:$L$6,0))/1000","v":4596.3835624092553},{"$f":"INDEX('Comparison - TA'!$B$30:$L$45,MATCH(J$12,'Comparison - TA'!$A$30:$A$45,0),MATCH($A18,'Comparison - TA'!$B$29:$L$29,0))/1000","v":4597.3061914495202},2.0072934030368472E-4,{"$f":"INDEX('Comparison - TA'!$B$7:$L$22,MATCH(M$12,'Comparison - TA'!$A$7:$A$22,0),MATCH($A18,'Comparison - TA'!$B$6:$L$6,0))/1000","v":51.447000000000003},{"$f":"INDEX('Comparison - TA'!$B$30:$L$45,MATCH(M$12,'Comparison - TA'!$A$30:$A$45,0),MATCH($A18,'Comparison - TA'!$B$29:$L$29,0))/1000","v":0},-1,{"$f":"INDEX('Comparison - TA'!$B$7:$L$22,MATCH(P$12,'Comparison - TA'!$A$7:$A$22,0),MATCH($A18,'Comparison - TA'!$B$6:$L$6,0))/1000","v":343.19801081979472},{"$f":"INDEX('Comparison - TA'!$B$30:$L$45,MATCH(P$12,'Comparison - TA'!$A$30:$A$45,0),MATCH($A18,'Comparison - TA'!$B$29:$L$29,0))/1000","v":351.1069446360529},2.3044812519064983E-2,null,0,0]
["Porirua city",null,null,{"$f":"INDEX('Comparison - TA'!$B$7:$L$22,MATCH(D$12,'Comparison - TA'!$A$7:$A$22,0),MATCH($A19,'Comparison - TA'!$B$6:$L$6,0))/1000","v":3367.7566064207804},{"$f":"INDEX('Comparison - TA'!$B$30:$L$45,MATCH(D$12,'Comparison - TA'!$A$30:$A$45,0),MATCH($A19,'Comparison - TA'!$B$29:$L$29,0))/1000","v":3819.2825884013596},0.13407322284506096,{"$f":"INDEX('Comparison - TA'!$B$7:$L$22,MATCH(G$12,'Comparison - TA'!$A$7:$A$22,0),MATCH($A19,'Comparison - TA'!$B$6:$L$6,0))/1000","v":28.308},{"$f":"INDEX('Comparison - TA'!$B$30:$L$45,MATCH(G$12,'Comparison - TA'!$A$30:$A$45,0),MATCH($A19,'Comparison - TA'!$B$29:$L$29,0))/1000","v":33.588000000000001},0.18651971174226367,{"$f":"INDEX('Comparison - TA'!$B$7:$L$22,MATCH(J$12,'Comparison - TA'!$A$7:$A$22,0),MATCH($A19,'Comparison - TA'!$B$6:$L$6,0))/1000","v":6066.0712474005195},{"$f":"INDEX('Comparison - TA'!$B$30:$L$45,MATCH(J$12,'Comparison - TA'!$A$30:$A$45,0),MATCH($A19,'Comparison - TA'!$B$29:$L$29,0))/1000","v":6086.0813056548677},3.2986850035636728E-3,{"$f":"INDEX('Comparison - TA'!$B$7:$L$22,MATCH(M$12,'Comparison - TA'!$A$7:$A$22,0),MATCH($A19,'Comparison - TA'!$B$6:$L$6,0))/1000","v":70.225999999999999},{"$f":"INDEX('Comparison - TA'!$B$30:$L$45,MATCH(M$12,'Comparison - TA'!$A$30:$A$45,0),MATCH($A19,'Comparison - TA'!$B$29:$L$29,0))/1000","v":0},-1,{"$f":"INDEX('Comparison - TA'!$B$7:$L$22,MATCH(P$12,'Comparison - TA'!$A$7:$A$22,0),MATCH($A19,'Comparison - TA'!$B$6:$L$6,0))/1000","v":354.52617078167094},{"$f":"INDEX('Comparison - TA'!$B$30:$L$45,MATCH(P$12,'Comparison - TA'!$A$30:$A$45,0),MATCH($A19,'Comparison - TA'!$B$29:$L$29,0))/1000","v":362.53220642395877},2.2582354427138185E-2,null,0,0]
["Kāpiti Coast district",null,null,{"$f":"INDEX('Comparison - TA'!$B$7:$L$22,MATCH(D$12,'Comparison - TA'!$A$7:$A$22,0),MATCH($A20,'Comparison - TA'!$B$6:$L$6,0))/1000","v":4329.4623984503523},{"$f":"INDEX('Comparison - TA'!$B$30:$L$45,MATCH(D$12,'Comparison - TA'!$A$30:$A$45,0),MATCH($A20,'Comparison - TA'!$B$29:$L$29,0))/1000","v":4904.9331921061303},0.13291968856497216,{"$f":"INDEX('Comparison - TA'!$B$7:$L$22,MATCH(G$12,'Comparison - TA'!$A$7:$A$22,0),MATCH($A20,'Comparison - TA'!$B$6:$L$6,0))/1000","v":1368.2260000000001},{"$f":"INDEX('Comparison - TA'!$B$30:$L$45,MATCH(G$12,'Comparison - TA'!$A$30:$A$45,0),MATCH($A20,'Comparison - TA'!$B$29:$L$29,0))/1000","v":1335.375},-2.4009922337391743E-2,{"$f":"INDEX('Comparison - TA'!$B$7:$L$22,MATCH(J$12,'Comparison - TA'!$A$7:$A$22,0),MATCH($A20,'Comparison - TA'!$B$6:$L$6,0))/1000","v":3090.6200871701712},{"$f":"INDEX('Comparison - TA'!$B$30:$L$45,MATCH(J$12,'Comparison - TA'!$A$30:$A$45,0),MATCH($A20,'Comparison - TA'!$B$29:$L$29,0))/1000","v":3594.2105446725245},0.1629415597189916,{"$f":"INDEX('Comparison - TA'!$B$7:$L$22,MATCH(M$12,'Comparison - TA'!$A$7:$A$22,0),MATCH($A20,'Comparison - TA'!$B$6:$L$6,0))/1000","v":47.34},{"$f":"INDEX('Comparison - TA'!$B$30:$L$45,MATCH(M$12,'Comparison - TA'!$A$30:$A$45,0),MATCH($A20,'Comparison - TA'!$B$29:$L$29,0))/1000","v":0},-1,{"$f":"INDEX('Comparison - TA'!$B$7:$L$22,MATCH(P$12,'Comparison - TA'!$A$7:$A$22,0),MATCH($A20,'Comparison - TA'!$B$6:$L$6,0))/1000","v":491.41964592721399},{"$f":"INDEX('Comparison - TA'!$B$30:$L$45,MATCH(P$12,'Comparison - TA'!$A$30:$A$45,0),MATCH($A20,'Comparison - TA'!$B$29:$L$29,0))/1000","v":485.52992728148985},-1.1985110270899657E-2,null,0,0]
["Masterton district",null,null,{"$f":"INDEX('Comparison - TA'!$B$7:$L$22,MATCH(D$12,'Comparison - TA'!$A$7:$A$22,0),MATCH($A21,'Comparison - TA'!$B$6:$L$6,0))/1000","v":1675.3532248983531},{"$f":"INDEX('Comparison - TA'!$B$30:$L$45,MATCH(D$12,'Comparison - TA'!$A$30:$A$45,0),MATCH($A21,'Comparison - TA'!$B$29:$L$29,0))/1000","v":1968.7282422683882},0.17511233631811263,{"$f":"INDEX('Comparison - TA'!$B$7:$L$22,MATCH(G$12,'Comparison - TA'!$A$7:$A$22,0),MATCH($A21,'Comparison - TA'!$B$6:$L$6,0))/1000","v":0},{"$f":"INDEX('Comparison - TA'!$B$30:$L$45,MATCH(G$12,'Comparison - TA'!$A$30:$A$45,0),MATCH($A21,'Comparison - TA'!$B$29:$L$29,0))/1000","v":0},"n/a",{"$f":"INDEX('Comparison - TA'!$B$7:$L$22,MATCH(J$12,'Comparison - TA'!$A$7:$A$22,0),MATCH($A21,'Comparison - TA'!$B$6:$L$6,0))/1000","v":306.74856603071186},{"$f":"INDEX('Comparison - TA'!$B$30:$L$45,MATCH(J$12,'Comparison - TA'!$A$30:$A$45,0),MATCH($A21,'Comparison - TA'!$B$29:$L$29,0))/1000","v":437.3935929299048},0.42590264916222198,{"$f":"INDEX('Comparison - TA'!$B$7:$L$22,MATCH(M$12,'Comparison - TA'!$A$7:$A$22,0),MATCH($A21,'Comparison - TA'!$B$6:$L$6,0))/1000","v":19.562000000000001},{"$f":"INDEX('Comparison - TA'!$B$30:$L$45,MATCH(M$12,'Comparison - TA'!$A$30:$A$45,0),MATCH($A21,'Comparison - TA'!$B$29:$L$29,0))/1000","v":0},-1,{"$f":"INDEX('Comparison - TA'!$B$7:$L$22,MATCH(P$12,'Comparison - TA'!$A$7:$A$22,0),MATCH($A21,'Comparison - TA'!$B$6:$L$6,0))/1000","v":241.56229325001914},{"$f":"INDEX('Comparison - TA'!$B$30:$L$45,MATCH(P$12,'Comparison - TA'!$A$30:$A$45,0),MATCH($A21,'Comparison - TA'!$B$29:$L$29,0))/1000","v":243.88758058216905},9.6260360044819748E-3,null,0,0]
["Carterton district",null,null,{"$f":"INDEX('Comparison - TA'!$B$7:$L$22,MATCH(D$12,'Comparison - TA'!$A$7:$A$22,0),MATCH($A22,'Comparison - TA'!$B$6:$L$6,0))/1000","v":774.17316904683742},{"$f":"INDEX('Comparison - TA'!$B$30:$L$45,MATCH(D$12,'Comparison - TA'!$A$30:$A$45,0),MATCH($A22,'Comparison - TA'!$B$29:$L$29,0))/1000","v":907.43702995516298},0.17213701822345517,{"$f":"INDEX('Comparison - TA'!$B$7:$L$22,MATCH(G$12,'Comparison - TA'!$A$7:$A$22,0),MATCH($A22,'Comparison - TA'!$B$6:$L$6,0))/1000","v":23.24},{"$f":"INDEX('Comparison - TA'!$B$30:$L$45,MATCH(G$12,'Comparison - TA'!$A$30:$A$45,0),MATCH($A22,'Comparison - TA'!$B$29:$L$29,0))/1000","v":23.704999999999998},2.0008605851979278E-2,{"$f":"INDEX('Comparison - TA'!$B$7:$L$22,MATCH(J$12,'Comparison - TA'!$A$7:$A$22,0),MATCH($A22,'Comparison - TA'!$B$6:$L$6,0))/1000","v":198.78891360953597},{"$f":"INDEX('Comparison - TA'!$B$30:$L$45,MATCH(J$12,'Comparison - TA'!$A$30:$A$45,0),MATCH($A22,'Comparison - TA'!$B$29:$L$29,0))/1000","v":249.1394231030016},0.25328630545446229,{"$f":"INDEX('Comparison - TA'!$B$7:$L$22,MATCH(M$12,'Comparison - TA'!$A$7:$A$22,0),MATCH($A22,'Comparison - TA'!$B$6:$L$6,0))/1000","v":6.8460000000000001},{"$f":"INDEX('Comparison - TA'!$B$30:$L$45,MATCH(M$12,'Comparison - TA'!$A$30:$A$45,0),MATCH($A22,'Comparison - TA'!$B$29:$L$29,0))/1000","v":0},-1,{"$f":"INDEX('Comparison - TA'!$B$7:$L$22,MATCH(P$12,'Comparison - TA'!$A$7:$A$22,0),MATCH($A22,'Comparison - TA'!$B$6:$L$6,0))/1000","v":90.90466357774352},{"$f":"INDEX('Comparison - TA'!$B$30:$L$45,MATCH(P$12,'Comparison - TA'!$A$30:$A$45,0),MATCH($A22,'Comparison - TA'!$B$29:$L$29,0))/1000","v":90.214335422871898},-7.5939795352879536E-3,null,0,0]
["South Wairarapa district",null,null,{"$f":"INDEX('Comparison - TA'!$B$7:$L$22,MATCH(D$12,'Comparison - TA'!$A$7:$A$22,0),MATCH($A23,'Comparison - TA'!$B$6:$L$6,0))/1000","v":1245.4491280744335},{"$f":"INDEX('Comparison - TA'!$B$30:$L$45,MATCH(D$12,'Comparison - TA'!$A$30:$A$45,0),MATCH($A23,'Comparison - TA'!$B$29:$L$29,0))/1000","v":1508.4008206117171},0.2111300145545314,{"$f":"INDEX('Comparison - TA'!$B$7:$L$22,MATCH(G$12,'Comparison - TA'!$A$7:$A$22,0),MATCH($A23,'Comparison - TA'!$B$6:$L$6,0))/1000","v":0},{"$f":"INDEX('Comparison - TA'!$B$30:$L$45,MATCH(G$12,'Comparison - TA'!$A$30:$A$45,0),MATCH($A23,'Comparison - TA'!$B$29:$L$29,0))/1000","v":0},"n/a",{"$f":"INDEX('Comparison - TA'!$B$7:$L$22,MATCH(J$12,'Comparison - TA'!$A$7:$A$22,0),MATCH($A23,'Comparison - TA'!$B$6:$L$6,0))/1000","v":404.41254842927179},{"$f":"INDEX('Comparison - TA'!$B$30:$L$45,MATCH(J$12,'Comparison - TA'!$A$30:$A$45,0),MATCH($A23,'Comparison - TA'!$B$29:$L$29,0))/1000","v":505.50125032055632},0.24996430571679973,{"$f":"INDEX('Comparison - TA'!$B$7:$L$22,MATCH(M$12,'Comparison - TA'!$A$7:$A$22,0),MATCH($A23,'Comparison - TA'!$B$6:$L$6,0))/1000","v":10.76},{"$f":"INDEX('Comparison - TA'!$B$30:$L$45,MATCH(M$12,'Comparison - TA'!$A$30:$A$45,0),MATCH($A23,'Comparison - TA'!$B$29:$L$29,0))/1000","v":0},-1,{"$f":"INDEX('Comparison - TA'!$B$7:$L$22,MATCH(P$12,'Comparison - TA'!$A$7:$A$22,0),MATCH($A23,'Comparison - TA'!$B$6:$L$6,0))/1000","v":138.05114376879905},{"$f":"INDEX('Comparison - TA'!$B$30:$L$45,MATCH(P$12,'Comparison - TA'!$A$30:$A$45,0),MATCH($A23,'Comparison - TA'!$B$29:$L$29,0))/1000","v":139.77394584747486},1.2479448062821419E-2,null,0,0]
["Tararua district",null,null,{"$f":"INDEX('Comparison - TA'!$B$7:$L$22,MATCH(D$12,'Comparison - TA'!$A$7:$A$22,0),MATCH($A24,'Comparison - TA'!$B$6:$L$6,0))/1000","v":2.3544428815298133},{"$f":"INDEX('Comparison - TA'!$B$30:$L$45,MATCH(D$12,'Comparison - TA'!$A$30:$A$45,0),MATCH($A24,'Comparison - TA'!$B$29:$L$29,0))/1000","v":2.3530246429774904},-6.0236693930815211E-4,{"$f":"INDEX('Comparison - TA'!$B$7:$L$22,MATCH(G$12,'Comparison - TA'!$A$7:$A$22,0),MATCH($A24,'Comparison - TA'!$B$6:$L$6,0))/1000","v":0},{"$f":"INDEX('Comparison - TA'!$B$30:$L$45,MATCH(G$12,'Comparison - TA'!$A$30:$A$45,0),MATCH($A24,'Comparison - TA'!$B$29:$L$29,0))/1000","v":0},"n/a",{"$f":"INDEX('Comparison - TA'!$B$7:$L$22,MATCH(J$12,'Comparison - TA'!$A$7:$A$22,0),MATCH($A24,'Comparison - TA'!$B$6:$L$6,0))/1000","v":0},{"$f":"INDEX('Comparison - TA'!$B$30:$L$45,MATCH(J$12,'Comparison - TA'!$A$30:$A$45,0),MATCH($A24,'Comparison - TA'!$B$29:$L$29,0))/1000","v":0},"n/a",{"$f":"INDEX('Comparison - TA'!$B$7:$L$22,MATCH(M$12,'Comparison - TA'!$A$7:$A$22,0),MATCH($A24,'Comparison - TA'!$B$6:$L$6,0))/1000","v":0},{"$f":"INDEX('Comparison - TA'!$B$30:$L$45,MATCH(M$12,'Comparison - TA'!$A$30:$A$45,0),MATCH($A24,'Comparison - TA'!$B$29:$L$29,0))/1000","v":0},"n/a",{"$f":"INDEX('Comparison - TA'!$B$7:$L$22,MATCH(P$12,'Comparison - TA'!$A$7:$A$22,0),MATCH($A24,'Comparison - TA'!$B$6:$L$6,0))/1000","v":0.252},{"$f":"INDEX('Comparison - TA'!$B$30:$L$45,MATCH(P$12,'Comparison - TA'!$A$30:$A$45,0),MATCH($A24,'Comparison - TA'!$B$29:$L$29,0))/1000","v":0.252},0,null,0,0]
["Region-wide rates1",null,null,{"$f":"SUM(D16:D24)","v":42481.670520543608},{"$f":"SUM(E16:E24)","v":47283.313907157804},0.11302859157320988,{"$f":"SUM(G16:G24)","v":5826.66},{"$f":"SUM(H16:H24)","v":6458.9709999999995},0.10852031867313339,{"$f":"SUM(J16:J24)","v":64656.396127130894},{"$f":"SUM(K16:K24)","v":68109.677793629235},5.3409745568068878E-2,{"$f":"SUM(M16:M24)","v":978.09100000000001},{"$f":"SUM(N16:N24)","v":0},-1,{"$f":"SUM(P16:P24)","v":4822.0172188235001},{"$f":"SUM(Q16:Q24)","v":4907.8608208731948},1.7802425448542714E-2]
[null,null,null,{"$f":"E17-D17","v":879.63733401022091}]
[]
["Rates increases vary between city and district councils because of differing capital values.  In addition, some of Greater Wellington’s work programmes impact differently across the region, especially flood protection and public transport"]
[]
[]
[null,null,null,null,null,null,null,null,null,null,null,null,null,null,null,"Total Region-wide rates1"]
[null,null,null,null,null,null,null,null,null,null,null,null,null,null,null,"District-Wide Rates"]
[null,null,null,null,null,null,null,null,null,null,null,null,null,null,null,{"$f":"+J13","v":"2017/18"},{"$f":"+K13","v":"2018/19"},"Change"]
[null,null,null,null,null,null,null,null,null,null,null,null,null,null,null,"Budget","Plan"]
[null,null,null,null,null,null,null,null,null,null,null,null,null,null,null,"$000s","$000s","%   "]
[{"$f":"+A16","v":"Wellington city"},null,null,null,null,null,null,null,null,null,null,null,null,null,null,{"$f":"INDEX('Comparison - TA'!$B$7:$L$22,MATCH(P$32,'Comparison - TA'!$A$7:$A$22,0),MATCH($A36,'Comparison - TA'!$B$6:$L$6,0))/1000","v":62570.978382812369},{"$f":"INDEX('Comparison - TA'!$B$30:$L$45,MATCH(P$32,'Comparison - TA'!$A$30:$A$45,0),MATCH($A36,'Comparison - TA'!$B$29:$L$29,0))/1000","v":66367.076206934464},{"$f":"IF(P36=0,\"n/a\",Q36/P36-1)","v":6.0668666564511309E-2}]
["Hutt city",null,null,null,null,null,null,null,null,null,null,null,null,null,null,{"$f":"INDEX('Comparison - TA'!$B$7:$L$22,MATCH(P$32,'Comparison - TA'!$A$7:$A$22,0),MATCH($A37,'Comparison - TA'!$B$6:$L$6,0))/1000","v":23454.231569882813},{"$f":"INDEX('Comparison - TA'!$B$30:$L$45,MATCH(P$32,'Comparison - TA'!$A$30:$A$45,0),MATCH($A37,'Comparison - TA'!$B$29:$L$29,0))/1000","v":25013.959922775946},{"$f":"IF(P37=0,\"n/a\",Q37/P37-1)","v":6.6500936014290746E-2}]
["Upper Hutt city",null,null,null,null,null,null,null,null,null,null,null,null,null,null,{"$f":"INDEX('Comparison - TA'!$B$7:$L$22,MATCH(P$32,'Comparison - TA'!$A$7:$A$22,0),MATCH($A38,'Comparison - TA'!$B$6:$L$6,0))/1000","v":8387.2106640848742},{"$f":"INDEX('Comparison - TA'!$B$30:$L$45,MATCH(P$32,'Comparison - TA'!$A$30:$A$45,0),MATCH($A38,'Comparison - TA'!$B$29:$L$29,0))/1000","v":8680.4683817252971},3.4964868462907583E-2]
["Porirua city",null,null,null,null,null,null,null,null,null,null,null,null,null,null,{"$f":"INDEX('Comparison - TA'!$B$7:$L$22,MATCH(P$32,'Comparison - TA'!$A$7:$A$22,0),MATCH($A39,'Comparison - TA'!$B$6:$L$6,0))/1000","v":9886.8880246029694},{"$f":"INDEX('Comparison - TA'!$B$30:$L$45,MATCH(P$32,'Comparison - TA'!$A$30:$A$45,0),MATCH($A39,'Comparison - TA'!$B$29:$L$29,0))/1000","v":10301.484100480186},4.1933930559900912E-2]
["Kāpiti Coast district",null,null,null,null,null,null,null,null,null,null,null,null,null,null,{"$f":"INDEX('Comparison - TA'!$B$7:$L$22,MATCH(P$32,'Comparison - TA'!$A$7:$A$22,0),MATCH($A40,'Comparison - TA'!$B$6:$L$6,0))/1000","v":9327.0681315477359},{"$f":"INDEX('Comparison - TA'!$B$30:$L$45,MATCH(P$32,'Comparison - TA'!$A$30:$A$45,0),MATCH($A40,'Comparison - TA'!$B$29:$L$29,0))/1000","v":10320.048664060143},0.10646223641851238]
["Masterton district",null,null,null,null,null,null,null,null,null,null,null,null,null,null,{"$f":"INDEX('Comparison - TA'!$B$7:$L$22,MATCH(P$32,'Comparison - TA'!$A$7:$A$22,0),MATCH($A41,'Comparison - TA'!$B$6:$L$6,0))/1000","v":2243.2260841790844},{"$f":"INDEX('Comparison - TA'!$B$30:$L$45,MATCH(P$32,'Comparison - TA'!$A$30:$A$45,0),MATCH($A41,'Comparison - TA'!$B$29:$L$29,0))/1000","v":2650.0094157804619},0.1813385349208978]
["Carterton district",null,null,null,null,null,null,null,null,null,null,null,null,null,null,{"$f":"INDEX('Comparison - TA'!$B$7:$L$22,MATCH(P$32,'Comparison - TA'!$A$7:$A$22,0),MATCH($A42,'Comparison - TA'!$B$6:$L$6,0))/1000","v":1093.9527462341168},{"$f":"INDEX('Comparison - TA'!$B$30:$L$45,MATCH(P$32,'Comparison - TA'!$A$30:$A$45,0),MATCH($A42,'Comparison - TA'!$B$29:$L$29,0))/1000","v":1270.4957884810365},0.16138086663675466]
["South Wairarapa district",null,null,null,null,null,null,null,null,null,null,null,null,null,null,{"$f":"INDEX('Comparison - TA'!$B$7:$L$22,MATCH(P$32,'Comparison - TA'!$A$7:$A$22,0),MATCH($A43,'Comparison - TA'!$B$6:$L$6,0))/1000","v":1798.6728202725044},{"$f":"INDEX('Comparison - TA'!$B$30:$L$45,MATCH(P$32,'Comparison - TA'!$A$30:$A$45,0),MATCH($A43,'Comparison - TA'!$B$29:$L$29,0))/1000","v":2153.6760167797484},0.19736952296497146]
["Tararua district",null,null,null,null,null,null,null,null,null,null,null,null,null,null,{"$f":"INDEX('Comparison - TA'!$B$7:$L$22,MATCH(P$32,'Comparison - TA'!$A$7:$A$22,0),MATCH($A44,'Comparison - TA'!$B$6:$L$6,0))/1000","v":2.6064428815298135},{"$f":"INDEX('Comparison - TA'!$B$30:$L$45,MATCH(P$32,'Comparison - TA'!$A$30:$A$45,0),MATCH($A44,'Comparison - TA'!$B$29:$L$29,0))/1000","v":2.6050246429774901},-5.4412800003156292E-4]
["Region-wide rates1",null,null,null,null,null,null,null,null,null,null,null,null,null,null,{"$f":"SUM(P36:P44)","v":118764.83486649801},{"$f":"SUM(Q36:Q44)","v":126759.82352166026},6.731781056361763E-2,null,{"$f":"ROUND(P45-ESSbase!F14/1000,2)","v":0},{"$f":"ROUND(Q45-ESSbase!G14/1000,2)","v":0}]
[]
[]
[{"$f":"+'1'!$A$43","v":0}]
[]
["1 Region-wide rates are rates that are charged to all ratepayers in  the region. It excludes South Wairarapa Region river rates, Wairarapa river and drainage schemes and any \"Warm Greater Wellington\" targeted rates as they impact only certain ratepayers that are covered by these programmes"]
[]
[]
["This information should be read in conjunction with the Funding Impact Statement and the Revenue and Financing Policy contained within the 2015/25 long term plan available at www.gw.govt.nz"]

{"sheet":"5","index":28,"n_rows":44,"n_cols":17,"rows_kept":44,"cut":false,"hidden":false,"merged":[[17,12,17,13],[31,0,31,1],[31,10,31,11],[31,8,31,9],[31,4,31,5],[31,6,31,7],[43,0,43,11],[31,2,31,3],[17,10,17,11],[17,2,17,3],[17,6,17,7],[17,8,17,9],[17,4,17,5],[17,0,17,1]]}
["Residential region-wide rates"]
["All figures on this page include GST"]
[]
["Average value of residential property in each city or district"]
[null,null,{"$f":"year_previous","v":"2017/18"},{"$f":"year_current","v":"2018/19"}]
["Wellington city",null,{"$f":"INDEX('Comparison - Category'!$H$22:$H$49,MATCH($A6&\"residential\",'Comparison - Category'!$D$22:$D$49,0),)","v":551092.39798840438},{"$f":"INDEX('Comparison - Category'!$H$81:$H$108,MATCH($A6&\"residential\",'Comparison - Category'!$D$81:$D$108,0),)","v":554459.5066612442}]
["Hutt city",null,{"$f":"INDEX('Comparison - Category'!$H$22:$H$49,MATCH($A7&\"residential\",'Comparison - Category'!$D$22:$D$49,0),)","v":471132.13358377991},{"$f":"INDEX('Comparison - Category'!$H$81:$H$108,MATCH($A7&\"residential\",'Comparison - Category'!$D$81:$D$108,0),)","v":474858.71116478206}]
["Upper Hutt city",null,{"$f":"INDEX('Comparison - Category'!$H$22:$H$49,MATCH($A8&\"residential\",'Comparison - Category'!$D$22:$D$49,0),)","v":413719.04409750755},{"$f":"INDEX('Comparison - Category'!$H$81:$H$108,MATCH($A8&\"residential\",'Comparison - Category'!$D$81:$D$108,0),)","v":415367.22795655398}]
["Porirua city",null,{"$f":"INDEX('Comparison - Category'!$H$22:$H$49,MATCH($A9&\"residential\",'Comparison - Category'!$D$22:$D$49,0),)","v":488077.22728867066},{"$f":"INDEX('Comparison - Category'!$H$81:$H$108,MATCH($A9&\"residential\",'Comparison - Category'!$D$81:$D$108,0),)","v":495584.87684729067}]
["Kāpiti Coast district excl Ōtaki ",null,{"$f":"INDEX('Comparison - Category'!$H$22:$H$49,MATCH($A10&\"residential\",'Comparison - Category'!$D$22:$D$49,0),)","v":414346.12113254936},{"$f":"INDEX('Comparison - Category'!$H$81:$H$108,MATCH($A10&\"residential\",'Comparison - Category'!$D$81:$D$108,0),)","v":571428.5434721834}]
["Ōtaki rating area",null,{"$f":"INDEX('Comparison - Category'!$H$22:$H$49,MATCH($A11&\"residential\",'Comparison - Category'!$D$22:$D$49,0),)","v":249396.73735725938},{"$f":"INDEX('Comparison - Category'!$H$81:$H$108,MATCH($A11&\"residential\",'Comparison - Category'!$D$81:$D$108,0),)","v":350606.44239923835}]
["Masterton district",null,{"$f":"INDEX('Comparison - Category'!$H$22:$H$49,MATCH($A12&\"residential\",'Comparison - Category'!$D$22:$D$49,0),)","v":251835.81994389187},{"$f":"INDEX('Comparison - Category'!$H$81:$H$108,MATCH($A12&\"residential\",'Comparison - Category'!$D$81:$D$108,0),)","v":329152.65419615776}]
["Carterton district",null,{"$f":"INDEX('Comparison - Category'!$H$22:$H$49,MATCH($A13&\"residential\",'Comparison - Category'!$D$22:$D$49,0),)","v":264354.71944323619},{"$f":"INDEX('Comparison - Category'!$H$81:$H$108,MATCH($A13&\"residential\",'Comparison - Category'!$D$81:$D$108,0),)","v":352806.64715719066}]
["South Wairarapa district",null,{"$f":"INDEX('Comparison - Category'!$H$22:$H$49,MATCH($A14&\"residential\",'Comparison - Category'!$D$22:$D$49,0),)","v":282112.83698760724},{"$f":"INDEX('Comparison - Category'!$H$81:$H$108,MATCH($A14&\"residential\",'Comparison - Category'!$D$81:$D$108,0),)","v":408450.32517807372}]
[]
[]
[{"$f":"year_current&\" residential region-wide rates, for an average value residential property\"","v":"2018/19 residential region-wide rates, for an average value residential property"}]
[null,null,"General rate",null,"River management rate",null,"Public transport rate",null,"Stadium purposes rate",null,"Wellington regional strategy rate",null,"Total region-wide rates"]
[null,null,{"$f":"year_previous","v":"2017/18"},{"$f":"year_current","v":"2018/19"},{"$f":"year_previous","v":"2017/18"},{"$f":"year_current","v":"2018/19"},{"$f":"year_previous","v":"2017/18"},{"$f":"year_current","v":"2018/19"},{"$f":"year_previous","v":"2017/18"},{"$f":"year_current","v":"2018/19"},{"$f":"year_previous","v":"2017/18"},{"$f":"year_current","v":"2018/19"},{"$f":"year_previous","v":"2017/18"},{"$f":"year_current","v":"2018/19"}]
["Wellington city",null,{"$f":"INDEX('Comparison - Category'!$Q$22:$U$49,MATCH($A20&\"residential\",'Comparison - Category'!$D$22:$D$49,0),MATCH(C$18,'Comparison - Category'!$Q$7:$U$7,0))*(1+GST)","v":261.67624851938803},{"$f":"INDEX('Comparison - Category'!$Q$81:$U$108,MATCH($A20&\"residential\",'Comparison - Category'!$D$81:$D$108,0),MATCH(C$18,'Comparison - Category'!$Q$7:$U$7,0))*(1+GST)","v":282.65660691641028},{"$f":"INDEX('Comparison - Category'!$Q$22:$U$49,MATCH($A20&\"residential\",'Comparison - Category'!$D$22:$D$49,0),MATCH(E$18,'Comparison - Category'!$Q$7:$U$7,0))*(1+GST)","v":0.53417503637976949},{"$f":"INDEX('Comparison - Category'!$Q$81:$U$108,MATCH($A20&\"residential\",'Comparison - Category'!$D$81:$D$108,0),MATCH(E$18,'Comparison - Category'!$Q$7:$U$7,0))*(1+GST)","v":0.52340563069213908},{"$f":"INDEX('Comparison - Category'!$Q$22:$U$49,MATCH($A20&\"residential\",'Comparison - Category'!$D$22:$D$49,0),MATCH(G$18,'Comparison - Category'!$Q$7:$U$7,0))*(1+GST)","v":197.89886015597997},{"$f":"INDEX('Comparison - Category'!$Q$81:$U$108,MATCH($A20&\"residential\",'Comparison - Category'!$D$81:$D$108,0),MATCH(G$18,'Comparison - Category'!$Q$7:$U$7,0))*(1+GST)","v":218.8026812403082},{"$f":"INDEX('Comparison - Category'!$Q$22:$U$49,MATCH($A20&\"residential\",'Comparison - Category'!$D$22:$D$49,0),MATCH(I$18,'Comparison - Category'!$Q$7:$U$7,0))*(1+GST)","v":6.1183657301414884},{"$f":"INDEX('Comparison - Category'!$Q$81:$U$108,MATCH($A20&\"residential\",'Comparison - Category'!$D$81:$D$108,0),MATCH(I$18,'Comparison - Category'!$Q$7:$U$7,0))*(1+GST)","v":0},{"$f":"INDEX('Comparison - Category'!$Q$22:$U$49,MATCH($A20&\"residential\",'Comparison - Category'!$D$22:$D$49,0),MATCH(K$18,'Comparison - Category'!$Q$7:$U$7,0))*(1+GST)","v":16.099999999999998},{"$f":"INDEX('Comparison - Category'!$Q$81:$U$108,MATCH($A20&\"residential\",'Comparison - Category'!$D$81:$D$108,0),MATCH(K$18,'Comparison - Category'!$Q$7:$U$7,0))*(1+GST)","v":16.099999999999998},{"$f":"INDEX('Comparison - Category'!$V$22:$V$49,MATCH(A20&\"Residential\",'Comparison - Category'!$D$22:$D$49,0),)*(1+GST)","v":482.32764944188921},{"$f":"INDEX('Comparison - Category'!$V$81:$V$108,MATCH(A20&\"Residential\",'Comparison - Category'!$D$81:$D$108,0),)*(1+GST)","v":518.08269378741056},null,{"$f":"M20-SUM(C20,E20,G20,I20,K20)","v":0},{"$f":"N20-SUM(D20,F20,H20,J20,L20)","v":0}]
["Hutt city",null,{"$f":"INDEX('Comparison - Category'!$Q$22:$U$49,MATCH($A21&\"residential\",'Comparison - Category'!$D$22:$D$49,0),MATCH(C$18,'Comparison - Category'!$Q$7:$U$7,0))*(1+GST)","v":183.73605934246515},{"$f":"INDEX('Comparison - Category'!$Q$81:$U$108,MATCH($A21&\"residential\",'Comparison - Category'!$D$81:$D$108,0),MATCH(C$18,'Comparison - Category'!$Q$7:$U$7,0))*(1+GST)","v":205.62850284212226},{"$f":"INDEX('Comparison - Category'!$Q$22:$U$49,MATCH($A21&\"residential\",'Comparison - Category'!$D$22:$D$49,0),MATCH(E$18,'Comparison - Category'!$Q$7:$U$7,0))*(1+GST)","v":94.321226939291634},{"$f":"INDEX('Comparison - Category'!$Q$81:$U$108,MATCH($A21&\"residential\",'Comparison - Category'!$D$81:$D$108,0),MATCH(E$18,'Comparison - Category'!$Q$7:$U$7,0))*(1+GST)","v":111.15807679348406},{"$f":"INDEX('Comparison - Category'!$Q$22:$U$49,MATCH($A21&\"residential\",'Comparison - Category'!$D$22:$D$49,0),MATCH(G$18,'Comparison - Category'!$Q$7:$U$7,0))*(1+GST)","v":298.57096724373025},{"$f":"INDEX('Comparison - Category'!$Q$81:$U$108,MATCH($A21&\"residential\",'Comparison - Category'!$D$81:$D$108,0),MATCH(G$18,'Comparison - Category'!$Q$7:$U$7,0))*(1+GST)","v":299.5482532358053},{"$f":"INDEX('Comparison - Category'!$Q$22:$U$49,MATCH($A21&\"residential\",'Comparison - Category'!$D$22:$D$49,0),MATCH(I$18,'Comparison - Category'!$Q$7:$U$7,0))*(1+GST)","v":4.4119749587039383},{"$f":"INDEX('Comparison - Category'!$Q$81:$U$108,MATCH($A21&\"residential\",'Comparison - Category'!$D$81:$D$108,0),MATCH(I$18,'Comparison - Category'!$Q$7:$U$7,0))*(1+GST)","v":0},{"$f":"INDEX('Comparison - Category'!$Q$22:$U$49,MATCH($A21&\"residential\",'Comparison - Category'!$D$22:$D$49,0),MATCH(K$18,'Comparison - Category'!$Q$7:$U$7,0))*(1+GST)","v":16.099999999999998},{"$f":"INDEX('Comparison - Category'!$Q$81:$U$108,MATCH($A21&\"residential\",'Comparison - Category'!$D$81:$D$108,0),MATCH(K$18,'Comparison - Category'!$Q$7:$U$7,0))*(1+GST)","v":16.099999999999998},{"$f":"INDEX('Comparison - Category'!$V$22:$V$49,MATCH(A21&\"Residential\",'Comparison - Category'!$D$22:$D$49,0),)*(1+GST)","v":597.14022848419097},{"$f":"INDEX('Comparison - Category'!$V$81:$V$108,MATCH(A21&\"Residential\",'Comparison - Category'!$D$81:$D$108,0),)*(1+GST)","v":632.43483287141157},null,{"$f":"M21-SUM(C21,E21,G21,I21,K21)","v":0},{"$f":"N21-SUM(D21,F21,H21,J21,L21)","v":0}]
["Upper Hutt city",null,{"$f":"INDEX('Comparison - Category'!$Q$22:$U$49,MATCH($A22&\"residential\",'Comparison - Category'!$D$22:$D$49,0),MATCH(C$18,'Comparison - Category'!$Q$7:$U$7,0))*(1+GST)","v":161.4062469778242},{"$f":"INDEX('Comparison - Category'!$Q$81:$U$108,MATCH($A22&\"residential\",'Comparison - Category'!$D$81:$D$108,0),MATCH(C$18,'Comparison - Category'!$Q$7:$U$7,0))*(1+GST)","v":178.84130719489625},{"$f":"INDEX('Comparison - Category'!$Q$22:$U$49,MATCH($A22&\"residential\",'Comparison - Category'!$D$22:$D$49,0),MATCH(E$18,'Comparison - Category'!$Q$7:$U$7,0))*(1+GST)","v":40.263152698646707},{"$f":"INDEX('Comparison - Category'!$Q$81:$U$108,MATCH($A22&\"residential\",'Comparison - Category'!$D$81:$D$108,0),MATCH(E$18,'Comparison - Category'!$Q$7:$U$7,0))*(1+GST)","v":38.922839464575077},{"$f":"INDEX('Comparison - Category'!$Q$22:$U$49,MATCH($A22&\"residential\",'Comparison - Category'!$D$22:$D$49,0),MATCH(G$18,'Comparison - Category'!$Q$7:$U$7,0))*(1+GST)","v":294.86970649878322},{"$f":"INDEX('Comparison - Category'!$Q$81:$U$108,MATCH($A22&\"residential\",'Comparison - Category'!$D$81:$D$108,0),MATCH(G$18,'Comparison - Category'!$Q$7:$U$7,0))*(1+GST)","v":288.8973000544151},{"$f":"INDEX('Comparison - Category'!$Q$22:$U$49,MATCH($A22&\"residential\",'Comparison - Category'!$D$22:$D$49,0),MATCH(I$18,'Comparison - Category'!$Q$7:$U$7,0))*(1+GST)","v":3.2887685388763348},{"$f":"INDEX('Comparison - Category'!$Q$81:$U$108,MATCH($A22&\"residential\",'Comparison - Category'!$D$81:$D$108,0),MATCH(I$18,'Comparison - Category'!$Q$7:$U$7,0))*(1+GST)","v":0},{"$f":"INDEX('Comparison - Category'!$Q$22:$U$49,MATCH($A22&\"residential\",'Comparison - Category'!$D$22:$D$49,0),MATCH(K$18,'Comparison - Category'!$Q$7:$U$7,0))*(1+GST)","v":16.099999999999998},{"$f":"INDEX('Comparison - Category'!$Q$81:$U$108,MATCH($A22&\"residential\",'Comparison - Category'!$D$81:$D$108,0),MATCH(K$18,'Comparison - Category'!$Q$7:$U$7,0))*(1+GST)","v":16.099999999999998},{"$f":"INDEX('Comparison - Category'!$V$22:$V$49,MATCH(A22&\"Residential\",'Comparison - Category'!$D$22:$D$49,0),)*(1+GST)","v":515.92787471413044},{"$f":"INDEX('Comparison - Category'!$V$81:$V$108,MATCH(A22&\"Residential\",'Comparison - Category'!$D$81:$D$108,0),)*(1+GST)","v":522.76144671388636},null,0,0]
["Porirua city",null,{"$f":"INDEX('Comparison - Category'!$Q$22:$U$49,MATCH($A23&\"residential\",'Comparison - Category'!$D$22:$D$49,0),MATCH(C$18,'Comparison - Category'!$Q$7:$U$7,0))*(1+GST)","v":188.18917499261528},{"$f":"INDEX('Comparison - Category'!$Q$81:$U$108,MATCH($A23&\"residential\",'Comparison - Category'!$D$81:$D$108,0),MATCH(C$18,'Comparison - Category'!$Q$7:$U$7,0))*(1+GST)","v":211.79995327008001},{"$f":"INDEX('Comparison - Category'!$Q$22:$U$49,MATCH($A23&\"residential\",'Comparison - Category'!$D$22:$D$49,0),MATCH(E$18,'Comparison - Category'!$Q$7:$U$7,0))*(1+GST)","v":1.5818242065220693},{"$f":"INDEX('Comparison - Category'!$Q$81:$U$108,MATCH($A23&\"residential\",'Comparison - Category'!$D$81:$D$108,0),MATCH(E$18,'Comparison - Category'!$Q$7:$U$7,0))*(1+GST)","v":1.8626369392093434},{"$f":"INDEX('Comparison - Category'!$Q$22:$U$49,MATCH($A23&\"residential\",'Comparison - Category'!$D$22:$D$49,0),MATCH(G$18,'Comparison - Category'!$Q$7:$U$7,0))*(1+GST)","v":354.78418887344861},{"$f":"INDEX('Comparison - Category'!$Q$81:$U$108,MATCH($A23&\"residential\",'Comparison - Category'!$D$81:$D$108,0),MATCH(G$18,'Comparison - Category'!$Q$7:$U$7,0))*(1+GST)","v":351.85353251153202},{"$f":"INDEX('Comparison - Category'!$Q$22:$U$49,MATCH($A23&\"residential\",'Comparison - Category'!$D$22:$D$49,0),MATCH(I$18,'Comparison - Category'!$Q$7:$U$7,0))*(1+GST)","v":3.8137900762890209},{"$f":"INDEX('Comparison - Category'!$Q$81:$U$108,MATCH($A23&\"residential\",'Comparison - Category'!$D$81:$D$108,0),MATCH(I$18,'Comparison - Category'!$Q$7:$U$7,0))*(1+GST)","v":0},{"$f":"INDEX('Comparison - Category'!$Q$22:$U$49,MATCH($A23&\"residential\",'Comparison - Category'!$D$22:$D$49,0),MATCH(K$18,'Comparison - Category'!$Q$7:$U$7,0))*(1+GST)","v":16.099999999999998},{"$f":"INDEX('Comparison - Category'!$Q$81:$U$108,MATCH($A23&\"residential\",'Comparison - Category'!$D$81:$D$108,0),MATCH(K$18,'Comparison - Category'!$Q$7:$U$7,0))*(1+GST)","v":16.099999999999998},{"$f":"INDEX('Comparison - Category'!$V$22:$V$49,MATCH(A23&\"Residential\",'Comparison - Category'!$D$22:$D$49,0),)*(1+GST)","v":564.46897814887495},{"$f":"INDEX('Comparison - Category'!$V$81:$V$108,MATCH(A23&\"Residential\",'Comparison - Category'!$D$81:$D$108,0),)*(1+GST)","v":581.61612272082141},null,0,0]
["Kāpiti Coast district excl Ōtaki ",null,{"$f":"INDEX('Comparison - Category'!$Q$22:$U$49,MATCH($A24&\"residential\",'Comparison - Category'!$D$22:$D$49,0),MATCH(C$18,'Comparison - Category'!$Q$7:$U$7,0))*(1+GST)","v":187.97932768039846},{"$f":"INDEX('Comparison - Category'!$Q$81:$U$108,MATCH($A24&\"residential\",'Comparison - Category'!$D$81:$D$108,0),MATCH(C$18,'Comparison - Category'!$Q$7:$U$7,0))*(1+GST)","v":218.22429131186666},{"$f":"INDEX('Comparison - Category'!$Q$22:$U$49,MATCH($A24&\"residential\",'Comparison - Category'!$D$22:$D$49,0),MATCH(E$18,'Comparison - Category'!$Q$7:$U$7,0))*(1+GST)","v":59.406490071766505},{"$f":"INDEX('Comparison - Category'!$Q$81:$U$108,MATCH($A24&\"residential\",'Comparison - Category'!$D$81:$D$108,0),MATCH(E$18,'Comparison - Category'!$Q$7:$U$7,0))*(1+GST)","v":59.411872006651095},{"$f":"INDEX('Comparison - Category'!$Q$22:$U$49,MATCH($A24&\"residential\",'Comparison - Category'!$D$22:$D$49,0),MATCH(G$18,'Comparison - Category'!$Q$7:$U$7,0))*(1+GST)","v":151.40186524277686},{"$f":"INDEX('Comparison - Category'!$Q$81:$U$108,MATCH($A24&\"residential\",'Comparison - Category'!$D$81:$D$108,0),MATCH(G$18,'Comparison - Category'!$Q$7:$U$7,0))*(1+GST)","v":177.35335336713484},{"$f":"INDEX('Comparison - Category'!$Q$22:$U$49,MATCH($A24&\"residential\",'Comparison - Category'!$D$22:$D$49,0),MATCH(I$18,'Comparison - Category'!$Q$7:$U$7,0))*(1+GST)","v":2.2120360623680488},{"$f":"INDEX('Comparison - Category'!$Q$81:$U$108,MATCH($A24&\"residential\",'Comparison - Category'!$D$81:$D$108,0),MATCH(I$18,'Comparison - Category'!$Q$7:$U$7,0))*(1+GST)","v":0},{"$f":"INDEX('Comparison - Category'!$Q$22:$U$49,MATCH($A24&\"residential\",'Comparison - Category'!$D$22:$D$49,0),MATCH(K$18,'Comparison - Category'!$Q$7:$U$7,0))*(1+GST)","v":16.099999999999998},{"$f":"INDEX('Comparison - Category'!$Q$81:$U$108,MATCH($A24&\"residential\",'Comparison - Category'!$D$81:$D$108,0),MATCH(K$18,'Comparison - Category'!$Q$7:$U$7,0))*(1+GST)","v":16.099999999999998},{"$f":"INDEX('Comparison - Category'!$V$22:$V$49,MATCH(A24&\"Residential\",'Comparison - Category'!$D$22:$D$49,0),)*(1+GST)","v":417.09971905730993},{"$f":"INDEX('Comparison - Category'!$V$81:$V$108,MATCH(A24&\"Residential\",'Comparison - Category'!$D$81:$D$108,0),)*(1+GST)","v":471.08951668565254},null,0,0]
["Ōtaki rating area",null,{"$f":"INDEX('Comparison - Category'!$Q$22:$U$49,MATCH($A25&\"residential\",'Comparison - Category'!$D$22:$D$49,0),MATCH(C$18,'Comparison - Category'!$Q$7:$U$7,0))*(1+GST)","v":113.14557714685387},{"$f":"INDEX('Comparison - Category'!$Q$81:$U$108,MATCH($A25&\"residential\",'Comparison - Category'!$D$81:$D$108,0),MATCH(C$18,'Comparison - Category'!$Q$7:$U$7,0))*(1+GST)","v":133.89398078899617},{"$f":"INDEX('Comparison - Category'!$Q$22:$U$49,MATCH($A25&\"residential\",'Comparison - Category'!$D$22:$D$49,0),MATCH(E$18,'Comparison - Category'!$Q$7:$U$7,0))*(1+GST)","v":35.757025457963508},{"$f":"INDEX('Comparison - Category'!$Q$81:$U$108,MATCH($A25&\"residential\",'Comparison - Category'!$D$81:$D$108,0),MATCH(E$18,'Comparison - Category'!$Q$7:$U$7,0))*(1+GST)","v":36.452825674335308},{"$f":"INDEX('Comparison - Category'!$Q$22:$U$49,MATCH($A25&\"residential\",'Comparison - Category'!$D$22:$D$49,0),MATCH(G$18,'Comparison - Category'!$Q$7:$U$7,0))*(1+GST)","v":91.129442983907637},{"$f":"INDEX('Comparison - Category'!$Q$81:$U$108,MATCH($A25&\"residential\",'Comparison - Category'!$D$81:$D$108,0),MATCH(G$18,'Comparison - Category'!$Q$7:$U$7,0))*(1+GST)","v":96.77954692934226},{"$f":"INDEX('Comparison - Category'!$Q$22:$U$49,MATCH($A25&\"residential\",'Comparison - Category'!$D$22:$D$49,0),MATCH(I$18,'Comparison - Category'!$Q$7:$U$7,0))*(1+GST)","v":1.331434153077806},{"$f":"INDEX('Comparison - Category'!$Q$81:$U$108,MATCH($A25&\"residential\",'Comparison - Category'!$D$81:$D$108,0),MATCH(I$18,'Comparison - Category'!$Q$7:$U$7,0))*(1+GST)","v":0},{"$f":"INDEX('Comparison - Category'!$Q$22:$U$49,MATCH($A25&\"residential\",'Comparison - Category'!$D$22:$D$49,0),MATCH(K$18,'Comparison - Category'!$Q$7:$U$7,0))*(1+GST)","v":16.099999999999998},{"$f":"INDEX('Comparison - Category'!$Q$81:$U$108,MATCH($A25&\"residential\",'Comparison - Category'!$D$81:$D$108,0),MATCH(K$18,'Comparison - Category'!$Q$7:$U$7,0))*(1+GST)","v":16.099999999999998},{"$f":"INDEX('Comparison - Category'!$V$22:$V$49,MATCH(A25&\"Residential\",'Comparison - Category'!$D$22:$D$49,0),)*(1+GST)","v":257.46347974180281},{"$f":"INDEX('Comparison - Category'!$V$81:$V$108,MATCH(A25&\"Residential\",'Comparison - Category'!$D$81:$D$108,0),)*(1+GST)","v":283.22635339267373},null,0,0]
["Masterton district",null,{"$f":"INDEX('Comparison - Category'!$Q$22:$U$49,MATCH($A26&\"residential\",'Comparison - Category'!$D$22:$D$49,0),MATCH(C$18,'Comparison - Category'!$Q$7:$U$7,0))*(1+GST)","v":102.70960696240682},{"$f":"INDEX('Comparison - Category'!$Q$81:$U$108,MATCH($A26&\"residential\",'Comparison - Category'!$D$81:$D$108,0),MATCH(C$18,'Comparison - Category'!$Q$7:$U$7,0))*(1+GST)","v":127.46294314050067},{"$f":"INDEX('Comparison - Category'!$Q$22:$U$49,MATCH($A26&\"residential\",'Comparison - Category'!$D$22:$D$49,0),MATCH(E$18,'Comparison - Category'!$Q$7:$U$7,0))*(1+GST)","v":0},{"$f":"INDEX('Comparison - Category'!$Q$81:$U$108,MATCH($A26&\"residential\",'Comparison - Category'!$D$81:$D$108,0),MATCH(E$18,'Comparison - Category'!$Q$7:$U$7,0))*(1+GST)","v":0},{"$f":"INDEX('Comparison - Category'!$Q$22:$U$49,MATCH($A26&\"residential\",'Comparison - Category'!$D$22:$D$49,0),MATCH(G$18,'Comparison - Category'!$Q$7:$U$7,0))*(1+GST)","v":29.258456077544214},{"$f":"INDEX('Comparison - Category'!$Q$81:$U$108,MATCH($A26&\"residential\",'Comparison - Category'!$D$81:$D$108,0),MATCH(G$18,'Comparison - Category'!$Q$7:$U$7,0))*(1+GST)","v":39.991975335088341},{"$f":"INDEX('Comparison - Category'!$Q$22:$U$49,MATCH($A26&\"residential\",'Comparison - Category'!$D$22:$D$49,0),MATCH(I$18,'Comparison - Category'!$Q$7:$U$7,0))*(1+GST)","v":1.7673741386777935},{"$f":"INDEX('Comparison - Category'!$Q$81:$U$108,MATCH($A26&\"residential\",'Comparison - Category'!$D$81:$D$108,0),MATCH(I$18,'Comparison - Category'!$Q$7:$U$7,0))*(1+GST)","v":0},{"$f":"INDEX('Comparison - Category'!$Q$22:$U$49,MATCH($A26&\"residential\",'Comparison - Category'!$D$22:$D$49,0),MATCH(K$18,'Comparison - Category'!$Q$7:$U$7,0))*(1+GST)","v":16.099999999999998},{"$f":"INDEX('Comparison - Category'!$Q$81:$U$108,MATCH($A26&\"residential\",'Comparison - Category'!$D$81:$D$108,0),MATCH(K$18,'Comparison - Category'!$Q$7:$U$7,0))*(1+GST)","v":16.099999999999998},{"$f":"INDEX('Comparison - Category'!$V$22:$V$49,MATCH(A26&\"Residential\",'Comparison - Category'!$D$22:$D$49,0),)*(1+GST)","v":149.83543717862884},{"$f":"INDEX('Comparison - Category'!$V$81:$V$108,MATCH(A26&\"Residential\",'Comparison - Category'!$D$81:$D$108,0),)*(1+GST)","v":183.55491847558901},null,0,0]
["Carterton district",null,{"$f":"INDEX('Comparison - Category'!$Q$22:$U$49,MATCH($A27&\"residential\",'Comparison - Category'!$D$22:$D$49,0),MATCH(C$18,'Comparison - Category'!$Q$7:$U$7,0))*(1+GST)","v":107.55382222088416},{"$f":"INDEX('Comparison - Category'!$Q$81:$U$108,MATCH($A27&\"residential\",'Comparison - Category'!$D$81:$D$108,0),MATCH(C$18,'Comparison - Category'!$Q$7:$U$7,0))*(1+GST)","v":137.13041407990423},{"$f":"INDEX('Comparison - Category'!$Q$22:$U$49,MATCH($A27&\"residential\",'Comparison - Category'!$D$22:$D$49,0),MATCH(E$18,'Comparison - Category'!$Q$7:$U$7,0))*(1+GST)","v":3.2286270192851596},{"$f":"INDEX('Comparison - Category'!$Q$81:$U$108,MATCH($A27&\"residential\",'Comparison - Category'!$D$81:$D$108,0),MATCH(E$18,'Comparison - Category'!$Q$7:$U$7,0))*(1+GST)","v":3.5822612021075968},{"$f":"INDEX('Comparison - Category'!$Q$22:$U$49,MATCH($A27&\"residential\",'Comparison - Category'!$D$22:$D$49,0),MATCH(G$18,'Comparison - Category'!$Q$7:$U$7,0))*(1+GST)","v":54.967602505500402},{"$f":"INDEX('Comparison - Category'!$Q$81:$U$108,MATCH($A27&\"residential\",'Comparison - Category'!$D$81:$D$108,0),MATCH(G$18,'Comparison - Category'!$Q$7:$U$7,0))*(1+GST)","v":67.400588273583168},{"$f":"INDEX('Comparison - Category'!$Q$22:$U$49,MATCH($A27&\"residential\",'Comparison - Category'!$D$22:$D$49,0),MATCH(I$18,'Comparison - Category'!$Q$7:$U$7,0))*(1+GST)","v":1.6547664215453133},{"$f":"INDEX('Comparison - Category'!$Q$81:$U$108,MATCH($A27&\"residential\",'Comparison - Category'!$D$81:$D$108,0),MATCH(I$18,'Comparison - Category'!$Q$7:$U$7,0))*(1+GST)","v":0},{"$f":"INDEX('Comparison - Category'!$Q$22:$U$49,MATCH($A27&\"residential\",'Comparison - Category'!$D$22:$D$49,0),MATCH(K$18,'Comparison - Category'!$Q$7:$U$7,0))*(1+GST)","v":16.099999999999998},{"$f":"INDEX('Comparison - Category'!$Q$81:$U$108,MATCH($A27&\"residential\",'Comparison - Category'!$D$81:$D$108,0),MATCH(K$18,'Comparison - Category'!$Q$7:$U$7,0))*(1+GST)","v":16.099999999999998},{"$f":"INDEX('Comparison - Category'!$V$22:$V$49,MATCH(A27&\"Residential\",'Comparison - Category'!$D$22:$D$49,0),)*(1+GST)","v":183.50481816721503},{"$f":"INDEX('Comparison - Category'!$V$81:$V$108,MATCH(A27&\"Residential\",'Comparison - Category'!$D$81:$D$108,0),)*(1+GST)","v":224.21326355559498},null,0,0]
["South Wairarapa district",null,{"$f":"INDEX('Comparison - Category'!$Q$22:$U$49,MATCH($A28&\"residential\",'Comparison - Category'!$D$22:$D$49,0),MATCH(C$18,'Comparison - Category'!$Q$7:$U$7,0))*(1+GST)","v":111.84899071509064},{"$f":"INDEX('Comparison - Category'!$Q$81:$U$108,MATCH($A28&\"residential\",'Comparison - Category'!$D$81:$D$108,0),MATCH(C$18,'Comparison - Category'!$Q$7:$U$7,0))*(1+GST)","v":157.1815992241909},{"$f":"INDEX('Comparison - Category'!$Q$22:$U$49,MATCH($A28&\"residential\",'Comparison - Category'!$D$22:$D$49,0),MATCH(E$18,'Comparison - Category'!$Q$7:$U$7,0))*(1+GST)","v":0},{"$f":"INDEX('Comparison - Category'!$Q$81:$U$108,MATCH($A28&\"residential\",'Comparison - Category'!$D$81:$D$108,0),MATCH(E$18,'Comparison - Category'!$Q$7:$U$7,0))*(1+GST)","v":0},{"$f":"INDEX('Comparison - Category'!$Q$22:$U$49,MATCH($A28&\"residential\",'Comparison - Category'!$D$22:$D$49,0),MATCH(G$18,'Comparison - Category'!$Q$7:$U$7,0))*(1+GST)","v":75.531966632731198},{"$f":"INDEX('Comparison - Category'!$Q$81:$U$108,MATCH($A28&\"residential\",'Comparison - Category'!$D$81:$D$108,0),MATCH(G$18,'Comparison - Category'!$Q$7:$U$7,0))*(1+GST)","v":97.540973293566779},{"$f":"INDEX('Comparison - Category'!$Q$22:$U$49,MATCH($A28&\"residential\",'Comparison - Category'!$D$22:$D$49,0),MATCH(I$18,'Comparison - Category'!$Q$7:$U$7,0))*(1+GST)","v":2.1189545186695886},{"$f":"INDEX('Comparison - Category'!$Q$81:$U$108,MATCH($A28&\"residential\",'Comparison - Category'!$D$81:$D$108,0),MATCH(I$18,'Comparison - Category'!$Q$7:$U$7,0))*(1+GST)","v":0},{"$f":"INDEX('Comparison - Category'!$Q$22:$U$49,MATCH($A28&\"residential\",'Comparison - Category'!$D$22:$D$49,0),MATCH(K$18,'Comparison - Category'!$Q$7:$U$7,0))*(1+GST)","v":16.099999999999998},{"$f":"INDEX('Comparison - Category'!$Q$81:$U$108,MATCH($A28&\"residential\",'Comparison - Category'!$D$81:$D$108,0),MATCH(K$18,'Comparison - Category'!$Q$7:$U$7,0))*(1+GST)","v":16.099999999999998},{"$f":"INDEX('Comparison - Category'!$V$22:$V$49,MATCH(A28&\"Residential\",'Comparison - Category'!$D$22:$D$49,0),)*(1+GST)","v":205.59991186649142},{"$f":"INDEX('Comparison - Category'!$V$81:$V$108,MATCH(A28&\"Residential\",'Comparison - Category'!$D$81:$D$108,0),)*(1+GST)","v":270.82257251775769},null,0,0]
[]
[]
[{"$f":"year_current&\" residential region-wide rates per $100k of valued residential property\"","v":"2018/19 residential region-wide rates per $100k of valued residential property"}]
[null,null,"General rate",null,"River management rate",null,"Public transport rate",null,"Stadium purposes rate",null,"Total region-wide rates excl Wellington regional strategy rate"]
[null,null,{"$f":"year_previous","v":"2017/18"},{"$f":"year_current","v":"2018/19"},{"$f":"year_previous","v":"2017/18"},{"$f":"year_current","v":"2018/19"},{"$f":"year_previous","v":"2017/18"},{"$f":"year_current","v":"2018/19"},{"$f":"year_previous","v":"2017/18"},{"$f":"year_current","v":"2018/19"},{"$f":"year_previous","v":"2017/18"},{"$f":"year_current","v":"2018/19"}]
["Wellington city",null,{"$f":"C20/INDEX($C$6:$D$14,MATCH($A34,$A$6:$A$14,0),MATCH(C$33,$C$5:$D$5,0))*100000","v":47.483189656500038},{"$f":"D20/INDEX($C$6:$D$14,MATCH($A34,$A$6:$A$14,0),MATCH(D$33,$C$5:$D$5,0))*100000","v":50.97876463846147},9.6930213214628497E-2,9.4399252678324441E-2,35.91028671024128,39.46233739554026,1.1102250280487858,0,{"$f":"SUM(C34,E34,G34,I34)","v":84.600631608004733},{"$f":"SUM(D34,F34,H34,J34)","v":90.535501286680045},null,null,null,{"$f":"K34-SUM(C34,E34,G34,I34)","v":0},{"$f":"L34-SUM(D34,F34,H34,J34)","v":0}]
["Hutt city",null,{"$f":"C21/INDEX($C$6:$D$14,MATCH($A35,$A$6:$A$14,0),MATCH(C$33,$C$5:$D$5,0))*100000","v":38.998838382097311},43.303091637033596,20.020121790847618,23.408663288670464,63.373084950198233,63.081553774393797,0.93646233067211715,0,{"$f":"SUM(C35,E35,G35,I35)","v":123.32850745381528},{"$f":"SUM(D35,F35,H35,J35)","v":129.79330870009784},null,null,null,{"$f":"K35-SUM(C35,E35,G35,I35)","v":0},{"$f":"L35-SUM(D35,F35,H35,J35)","v":0}]
["Upper Hutt city",null,{"$f":"C22/INDEX($C$6:$D$14,MATCH($A36,$A$6:$A$14,0),MATCH(C$33,$C$5:$D$5,0))*100000","v":39.013492194906817},43.056191042015101,9.7320037047067309,9.3707054492624238,71.272935269880094,69.552261374995325,0.79492800387047691,0,{"$f":"SUM(C36,E36,G36,I36)","v":120.81335917336412},121.97915786627286,null,null,null,0,0]
["Porirua city",null,{"$f":"C23/INDEX($C$6:$D$14,MATCH($A37,$A$6:$A$14,0),MATCH(C$33,$C$5:$D$5,0))*100000","v":38.557253744049767},42.737372176783346,0.32409301603955143,0.37584620238185668,72.690174635747425,70.997633089589229,0.78139070275314748,0,112.35291209858988,114.11085146875443,null,null,null,0,0]
["Kāpiti Coast district excl Ōtaki ",null,{"$f":"C24/INDEX($C$6:$D$14,MATCH($A38,$A$6:$A$14,0),MATCH(C$33,$C$5:$D$5,0))*100000","v":45.367705426223566},38.189252847935414,14.33740707150541,10.397078109827254,36.539949940630287,31.036838357684914,0.53386189698646125,0,96.778924335345735,79.623169315447583,null,null,null,0,0]
["Ōtaki rating area",null,{"$f":"C25/INDEX($C$6:$D$14,MATCH($A39,$A$6:$A$14,0),MATCH(C$33,$C$5:$D$5,0))*100000","v":45.367705426223552},38.189252847935414,14.337407071505421,10.397078109827254,36.53994994063023,27.603470793938982,0.53386189698646069,0,96.778924335345678,76.189801751701651,null,null,null,0,0]
["Masterton district",null,{"$f":"C26/INDEX($C$6:$D$14,MATCH($A40,$A$6:$A$14,0),MATCH(C$33,$C$5:$D$5,0))*100000","v":40.784351878652593},38.724567921770252,0,0,11.618067709376248,12.14997808015706,0.70179616985048365,0,53.104215757879324,50.874546001927314,null,null,null,0,0]
["Carterton district",null,{"$f":"C27/INDEX($C$6:$D$14,MATCH($A41,$A$6:$A$14,0),MATCH(C$33,$C$5:$D$5,0))*100000","v":40.685417853483322},38.868432662723244,1.2213237675820763,1.0153610287596266,20.793123202517052,19.104115190764329,0.62596439550254923,0,63.325829219085001,58.987908882247197,null,null,null,0,0]
["South Wairarapa district",null,{"$f":"C28/INDEX($C$6:$D$14,MATCH($A42,$A$6:$A$14,0),MATCH(C$33,$C$5:$D$5,0))*100000","v":39.64689870528791},38.482427246364367,0,0,26.773672350134568,23.880743209358798,0.75110177236021025,0,67.171672827782686,62.363170455723164,null,null,null,0,0]
[]
["Region-wide rates are charged to all ratepayers in the region. They exclude targeted rates for pest management, Wairarapa river and drainage schemes, and \"Warm Greater Wellington\", because those rates only apply to highly specific ratepayers in those work programmes."]

{"sheet":"5b","index":29,"n_rows":40,"n_cols":6,"rows_kept":40,"cut":false,"hidden":false,"merged":[[1,0,1,5],[3,1,3,2],[3,3,3,4],[8,6,9,6],[8,7,9,7]]}
["Average rates for each area and category "]
["These tables show the region-wide rates that are charged to all ratepayers in the region. They exclude targeted rates for pest management, Wairarapa river and drainage schemes, and \"Warm Greater Wellington\", because those rates only apply to highly specific ratepayers in those work programmes."]
[]
[]
["Residential, including GST","Average capital value","Increase in 2018/19","Increase \nper week","Rates \n2018/19","Rates\nper week"]
["Wellington city",{"$f":"INDEX(Changes!C$66:C$74,MATCH($A6,Changes!$B$66:$B$74,0),)","v":554459.5066612442},{"$f":"INDEX(Changes!D$66:D$74,MATCH($A6,Changes!$B$66:$B$74,0),)","v":35.75504434552132},{"$f":"INDEX(Changes!E$66:E$74,MATCH($A6,Changes!$B$66:$B$74,0),)","v":0.68759700664464074},{"$f":"INDEX(Changes!F$66:F$74,MATCH($A6,Changes!$B$66:$B$74,0),)","v":518.08269378741056},{"$f":"INDEX(Changes!G$66:G$74,MATCH($A6,Changes!$B$66:$B$74,0),)","v":9.9631287266809725}]
["Hutt city",{"$f":"INDEX(Changes!C$66:C$74,MATCH($A7,Changes!$B$66:$B$74,0),)","v":474858.71116478206},{"$f":"INDEX(Changes!D$66:D$74,MATCH($A7,Changes!$B$66:$B$74,0),)","v":35.294604387220637},{"$f":"INDEX(Changes!E$66:E$74,MATCH($A7,Changes!$B$66:$B$74,0),)","v":0.67874239206193532},{"$f":"INDEX(Changes!F$66:F$74,MATCH($A7,Changes!$B$66:$B$74,0),)","v":632.43483287141157},{"$f":"INDEX(Changes!G$66:G$74,MATCH($A7,Changes!$B$66:$B$74,0),)","v":12.162208324450223}]
["Upper Hutt city",{"$f":"INDEX(Changes!C$66:C$74,MATCH($A8,Changes!$B$66:$B$74,0),)","v":415367.22795655398},{"$f":"INDEX(Changes!D$66:D$74,MATCH($A8,Changes!$B$66:$B$74,0),)","v":6.8335719997559599},{"$f":"INDEX(Changes!E$66:E$74,MATCH($A8,Changes!$B$66:$B$74,0),)","v":0.13141484614915308},{"$f":"INDEX(Changes!F$66:F$74,MATCH($A8,Changes!$B$66:$B$74,0),)","v":522.76144671388636},{"$f":"INDEX(Changes!G$66:G$74,MATCH($A8,Changes!$B$66:$B$74,0),)","v":10.053104744497814}]
["Porirua city",{"$f":"INDEX(Changes!C$66:C$74,MATCH($A9,Changes!$B$66:$B$74,0),)","v":495584.87684729067},{"$f":"INDEX(Changes!D$66:D$74,MATCH($A9,Changes!$B$66:$B$74,0),)","v":17.147144571946473},{"$f":"INDEX(Changes!E$66:E$74,MATCH($A9,Changes!$B$66:$B$74,0),)","v":0.32975278022973986},{"$f":"INDEX(Changes!F$66:F$74,MATCH($A9,Changes!$B$66:$B$74,0),)","v":581.61612272082141},{"$f":"INDEX(Changes!G$66:G$74,MATCH($A9,Changes!$B$66:$B$74,0),)","v":11.184925436938872}]
["Kāpiti Coast district excl Ōtaki ",{"$f":"INDEX(Changes!C$66:C$74,MATCH($A10,Changes!$B$66:$B$74,0),)","v":571428.5434721834},{"$f":"INDEX(Changes!D$66:D$74,MATCH($A10,Changes!$B$66:$B$74,0),)","v":53.989797628342622},{"$f":"INDEX(Changes!E$66:E$74,MATCH($A10,Changes!$B$66:$B$74,0),)","v":1.0382653390065888},{"$f":"INDEX(Changes!F$66:F$74,MATCH($A10,Changes!$B$66:$B$74,0),)","v":471.08951668565254},{"$f":"INDEX(Changes!G$66:G$74,MATCH($A10,Changes!$B$66:$B$74,0),)","v":9.0594137824163958}]
["Ōtaki rating area",{"$f":"INDEX(Changes!C$66:C$74,MATCH($A11,Changes!$B$66:$B$74,0),)","v":350606.44239923835},{"$f":"INDEX(Changes!D$66:D$74,MATCH($A11,Changes!$B$66:$B$74,0),)","v":25.762873650870905},{"$f":"INDEX(Changes!E$66:E$74,MATCH($A11,Changes!$B$66:$B$74,0),)","v":0.49543987790136357},{"$f":"INDEX(Changes!F$66:F$74,MATCH($A11,Changes!$B$66:$B$74,0),)","v":283.22635339267373},{"$f":"INDEX(Changes!G$66:G$74,MATCH($A11,Changes!$B$66:$B$74,0),)","v":5.4466606421668029}]
["Masterton district",{"$f":"INDEX(Changes!C$66:C$74,MATCH($A12,Changes!$B$66:$B$74,0),)","v":329152.65419615776},{"$f":"INDEX(Changes!D$66:D$74,MATCH($A12,Changes!$B$66:$B$74,0),)","v":33.719481296960154},{"$f":"INDEX(Changes!E$66:E$74,MATCH($A12,Changes!$B$66:$B$74,0),)","v":0.64845156340307986},{"$f":"INDEX(Changes!F$66:F$74,MATCH($A12,Changes!$B$66:$B$74,0),)","v":183.55491847558901},{"$f":"INDEX(Changes!G$66:G$74,MATCH($A12,Changes!$B$66:$B$74,0),)","v":3.5299022783767118}]
["Carterton district",{"$f":"INDEX(Changes!C$66:C$74,MATCH($A13,Changes!$B$66:$B$74,0),)","v":352806.64715719066},{"$f":"INDEX(Changes!D$66:D$74,MATCH($A13,Changes!$B$66:$B$74,0),)","v":40.708445388379971},{"$f":"INDEX(Changes!E$66:E$74,MATCH($A13,Changes!$B$66:$B$74,0),)","v":0.78285471900730719},{"$f":"INDEX(Changes!F$66:F$74,MATCH($A13,Changes!$B$66:$B$74,0),)","v":224.21326355559498},{"$f":"INDEX(Changes!G$66:G$74,MATCH($A13,Changes!$B$66:$B$74,0),)","v":4.3117935299152883}]
["South Wairarapa district",{"$f":"INDEX(Changes!C$66:C$74,MATCH($A14,Changes!$B$66:$B$74,0),)","v":408450.32517807372},{"$f":"INDEX(Changes!D$66:D$74,MATCH($A14,Changes!$B$66:$B$74,0),)","v":65.222660651266267},{"$f":"INDEX(Changes!E$66:E$74,MATCH($A14,Changes!$B$66:$B$74,0),)","v":1.2542819356012744},{"$f":"INDEX(Changes!F$66:F$74,MATCH($A14,Changes!$B$66:$B$74,0),)","v":270.82257251775769},{"$f":"INDEX(Changes!G$66:G$74,MATCH($A14,Changes!$B$66:$B$74,0),)","v":5.2081263945722629}]
["These projected rates exclude the targeted rural pest and river management rates that are not charged to all ratepayers"]
[]
["Rural, excluding GST","Average capital value","Increase in 2018/19","Increase \nper week","Rates \n2018/19","Rates\nper week"]
["Wellington city",{"$f":"INDEX(Changes!C$78:C$86,MATCH($A18,Changes!$B$78:$B$86,0),)","v":763000},{"$f":"INDEX(Changes!D$78:D$86,MATCH($A18,Changes!$B$78:$B$86,0),)","v":32.689590044108058},{"$f":"INDEX(Changes!E$78:E$86,MATCH($A18,Changes!$B$78:$B$86,0),)","v":0.62864596238669346},{"$f":"INDEX(Changes!F$78:F$86,MATCH($A18,Changes!$B$78:$B$86,0),)","v":433.71959020736989},{"$f":"INDEX(Changes!G$78:G$86,MATCH($A18,Changes!$B$78:$B$86,0),)","v":8.3407613501417295}]
["Hutt city",{"$f":"INDEX(Changes!C$78:C$86,MATCH($A19,Changes!$B$78:$B$86,0),)","v":649000},{"$f":"INDEX(Changes!D$78:D$86,MATCH($A19,Changes!$B$78:$B$86,0),)","v":38.194401666548117},{"$f":"INDEX(Changes!E$78:E$86,MATCH($A19,Changes!$B$78:$B$86,0),)","v":0.73450772435669454},{"$f":"INDEX(Changes!F$78:F$86,MATCH($A19,Changes!$B$78:$B$86,0),)","v":495.04124589837693},{"$f":"INDEX(Changes!G$78:G$86,MATCH($A19,Changes!$B$78:$B$86,0),)","v":9.5200239595841722}]
["Upper Hutt city",{"$f":"INDEX(Changes!C$78:C$86,MATCH($A20,Changes!$B$78:$B$86,0),)","v":682000},{"$f":"INDEX(Changes!D$78:D$86,MATCH($A20,Changes!$B$78:$B$86,0),)","v":40.282795369192513},{"$f":"INDEX(Changes!E$78:E$86,MATCH($A20,Changes!$B$78:$B$86,0),)","v":0.77466914171524059},{"$f":"INDEX(Changes!F$78:F$86,MATCH($A20,Changes!$B$78:$B$86,0),)","v":443.89635279370498},{"$f":"INDEX(Changes!G$78:G$86,MATCH($A20,Changes!$B$78:$B$86,0),)","v":8.5364683229558658}]
["Porirua city",{"$f":"INDEX(Changes!C$78:C$86,MATCH($A21,Changes!$B$78:$B$86,0),)","v":1005000},{"$f":"INDEX(Changes!D$78:D$86,MATCH($A21,Changes!$B$78:$B$86,0),)","v":42.025091503544104},{"$f":"INDEX(Changes!E$78:E$86,MATCH($A21,Changes!$B$78:$B$86,0),)","v":0.80817483660661737},{"$f":"INDEX(Changes!F$78:F$86,MATCH($A21,Changes!$B$78:$B$86,0),)","v":562.28429608424813},{"$f":"INDEX(Changes!G$78:G$86,MATCH($A21,Changes!$B$78:$B$86,0),)","v":10.813159540081696}]
["Kāpiti Coast district",{"$f":"INDEX(Changes!C$78:C$86,MATCH($A22,Changes!$B$78:$B$86,0),)","v":744000},{"$f":"INDEX(Changes!D$78:D$86,MATCH($A22,Changes!$B$78:$B$86,0),)","v":1.4951803804180486},{"$f":"INDEX(Changes!E$78:E$86,MATCH($A22,Changes!$B$78:$B$86,0),)","v":2.8753468854193241E-2},{"$f":"INDEX(Changes!F$78:F$86,MATCH($A22,Changes!$B$78:$B$86,0),)","v":393.89530332685047},{"$f":"INDEX(Changes!G$78:G$86,MATCH($A22,Changes!$B$78:$B$86,0),)","v":7.5749096793625093}]
["Masterton district",{"$f":"INDEX(Changes!C$78:C$86,MATCH($A23,Changes!$B$78:$B$86,0),)","v":724000},{"$f":"INDEX(Changes!D$78:D$86,MATCH($A23,Changes!$B$78:$B$86,0),)","v":36.60966313734798},{"$f":"INDEX(Changes!E$78:E$86,MATCH($A23,Changes!$B$78:$B$86,0),)","v":0.70403198341053808},{"$f":"INDEX(Changes!F$78:F$86,MATCH($A23,Changes!$B$78:$B$86,0),)","v":298.41187206473904},{"$f":"INDEX(Changes!G$78:G$86,MATCH($A23,Changes!$B$78:$B$86,0),)","v":5.7386898473988275}]
["Carterton district",{"$f":"INDEX(Changes!C$78:C$86,MATCH($A24,Changes!$B$78:$B$86,0),)","v":854000},{"$f":"INDEX(Changes!D$78:D$86,MATCH($A24,Changes!$B$78:$B$86,0),)","v":37.16417285276242},{"$f":"INDEX(Changes!E$78:E$86,MATCH($A24,Changes!$B$78:$B$86,0),)","v":0.71469563178389273},{"$f":"INDEX(Changes!F$78:F$86,MATCH($A24,Changes!$B$78:$B$86,0),)","v":368.13322411308059},{"$f":"INDEX(Changes!G$78:G$86,MATCH($A24,Changes!$B$78:$B$86,0),)","v":7.0794850790977035}]
["South Wairarapa district",{"$f":"INDEX(Changes!C$78:C$86,MATCH($A25,Changes!$B$78:$B$86,0),)","v":955000},{"$f":"INDEX(Changes!D$78:D$86,MATCH($A25,Changes!$B$78:$B$86,0),)","v":49.486030334290263},{"$f":"INDEX(Changes!E$78:E$86,MATCH($A25,Changes!$B$78:$B$86,0),)","v":0.95165442950558199},{"$f":"INDEX(Changes!F$78:F$86,MATCH($A25,Changes!$B$78:$B$86,0),)","v":405.87900913234574},{"$f":"INDEX(Changes!G$78:G$86,MATCH($A25,Changes!$B$78:$B$86,0),)","v":7.8053655602374183}]
["Tararua district",{"$f":"INDEX(Changes!C$78:C$86,MATCH($A26,Changes!$B$78:$B$86,0),)","v":1076000},{"$f":"INDEX(Changes!D$78:D$86,MATCH($A26,Changes!$B$78:$B$86,0),)","v":39.098890836931218},{"$f":"INDEX(Changes!E$78:E$86,MATCH($A26,Changes!$B$78:$B$86,0),)","v":0.75190174686406186},{"$f":"INDEX(Changes!F$78:F$86,MATCH($A26,Changes!$B$78:$B$86,0),)","v":263.302464297749},{"$f":"INDEX(Changes!G$78:G$86,MATCH($A26,Changes!$B$78:$B$86,0),)","v":5.0635089288028654}]
["These projected rates exclude the targeted rural pest and river management rates that are not charged to all ratepayers"]
[]
[]
["Business, excluding GST","Average capital value","Increase in 2018/19","Increase \nper week","Rates \n2018/19","Rates\nper week"]
["Wellington city",{"$f":"INDEX(Changes!C$91:C$99,MATCH($A31,Changes!$B$91:$B$99,0),)","v":2052000},{"$f":"INDEX(Changes!D$91:D$99,MATCH($A31,Changes!$B$91:$B$99,0),)","v":201.6458637892531},{"$f":"INDEX(Changes!E$91:E$99,MATCH($A31,Changes!$B$91:$B$99,0),)","v":3.877805072870252},{"$f":"INDEX(Changes!F$91:F$99,MATCH($A31,Changes!$B$91:$B$99,0),)","v":1910.9375867822318},{"$f":"INDEX(Changes!G$91:G$99,MATCH($A31,Changes!$B$91:$B$99,0),)","v":36.74879974581215}]
["Wellington city - CBD",{"$f":"INDEX(Changes!C$91:C$99,MATCH($A32,Changes!$B$91:$B$99,0),)","v":2355000},{"$f":"INDEX(Changes!D$91:D$99,MATCH($A32,Changes!$B$91:$B$99,0),)","v":348},{"$f":"INDEX(Changes!E$91:E$99,MATCH($A32,Changes!$B$91:$B$99,0),)","v":6.6923076923076925},{"$f":"INDEX(Changes!F$91:F$99,MATCH($A32,Changes!$B$91:$B$99,0),)","v":8954},{"$f":"INDEX(Changes!G$91:G$99,MATCH($A32,Changes!$B$91:$B$99,0),)","v":172.19230769230768}]
["Hutt city",{"$f":"INDEX(Changes!C$91:C$99,MATCH($A33,Changes!$B$91:$B$99,0),)","v":1598000},{"$f":"INDEX(Changes!D$91:D$99,MATCH($A33,Changes!$B$91:$B$99,0),)","v":118.03674252012024},{"$f":"INDEX(Changes!E$91:E$99,MATCH($A33,Changes!$B$91:$B$99,0),)","v":2.2699373561561584},{"$f":"INDEX(Changes!F$91:F$99,MATCH($A33,Changes!$B$91:$B$99,0),)","v":1999.3061349838358},{"$f":"INDEX(Changes!G$91:G$99,MATCH($A33,Changes!$B$91:$B$99,0),)","v":38.448194903535303}]
["Upper Hutt city",{"$f":"INDEX(Changes!C$91:C$99,MATCH($A34,Changes!$B$91:$B$99,0),)","v":1641000},{"$f":"INDEX(Changes!D$91:D$99,MATCH($A34,Changes!$B$91:$B$99,0),)","v":90.458213830435398},{"$f":"INDEX(Changes!E$91:E$99,MATCH($A34,Changes!$B$91:$B$99,0),)","v":1.7395810352006806},{"$f":"INDEX(Changes!F$91:F$99,MATCH($A34,Changes!$B$91:$B$99,0),)","v":1939.9001272602159},{"$f":"INDEX(Changes!G$91:G$99,MATCH($A34,Changes!$B$91:$B$99,0),)","v":37.305771678081072}]
["Porirua city",{"$f":"INDEX(Changes!C$91:C$99,MATCH($A35,Changes!$B$91:$B$99,0),)","v":1380000},{"$f":"INDEX(Changes!D$91:D$99,MATCH($A35,Changes!$B$91:$B$99,0),)","v":63.740468046868727},{"$f":"INDEX(Changes!E$91:E$99,MATCH($A35,Changes!$B$91:$B$99,0),)","v":1.2257782316705526},{"$f":"INDEX(Changes!F$91:F$99,MATCH($A35,Changes!$B$91:$B$99,0),)","v":1536.2739993179648},{"$f":"INDEX(Changes!G$91:G$99,MATCH($A35,Changes!$B$91:$B$99,0),)","v":29.543730756114709}]
["Kāpiti Coast district",{"$f":"INDEX(Changes!C$91:C$99,MATCH($A36,Changes!$B$91:$B$99,0),)","v":1109000},{"$f":"INDEX(Changes!D$91:D$99,MATCH($A36,Changes!$B$91:$B$99,0),)","v":22.714766916727172},{"$f":"INDEX(Changes!E$91:E$99,MATCH($A36,Changes!$B$91:$B$99,0),)","v":0.43682244070629178},{"$f":"INDEX(Changes!F$91:F$99,MATCH($A36,Changes!$B$91:$B$99,0),)","v":887.4370891787745},{"$f":"INDEX(Changes!G$91:G$99,MATCH($A36,Changes!$B$91:$B$99,0),)","v":17.066097868822588}]
["Masterton district",{"$f":"INDEX(Changes!C$91:C$99,MATCH($A37,Changes!$B$91:$B$99,0),)","v":788000},{"$f":"INDEX(Changes!D$91:D$99,MATCH($A37,Changes!$B$91:$B$99,0),)","v":51.222654941909298},{"$f":"INDEX(Changes!E$91:E$99,MATCH($A37,Changes!$B$91:$B$99,0),)","v":0.98505105657517877},{"$f":"INDEX(Changes!F$91:F$99,MATCH($A37,Changes!$B$91:$B$99,0),)","v":439.61366010404049},{"$f":"INDEX(Changes!G$91:G$99,MATCH($A37,Changes!$B$91:$B$99,0),)","v":8.4541088481546254}]
["Carterton district",{"$f":"INDEX(Changes!C$91:C$99,MATCH($A38,Changes!$B$91:$B$99,0),)","v":426000},{"$f":"INDEX(Changes!D$91:D$99,MATCH($A38,Changes!$B$91:$B$99,0),)","v":1.0374329101177864},{"$f":"INDEX(Changes!E$91:E$99,MATCH($A38,Changes!$B$91:$B$99,0),)","v":1.9950632886880506E-2},{"$f":"INDEX(Changes!F$91:F$99,MATCH($A38,Changes!$B$91:$B$99,0),)","v":267.77983886509003},{"$f":"INDEX(Changes!G$91:G$99,MATCH($A38,Changes!$B$91:$B$99,0),)","v":5.1496122858671161}]
["South Wairarapa district",{"$f":"INDEX(Changes!C$91:C$99,MATCH($A39,Changes!$B$91:$B$99,0),)","v":679000},{"$f":"INDEX(Changes!D$91:D$99,MATCH($A39,Changes!$B$91:$B$99,0),)","v":33.732189668251351},{"$f":"INDEX(Changes!E$91:E$99,MATCH($A39,Changes!$B$91:$B$99,0),)","v":0.64869595515867984},{"$f":"INDEX(Changes!F$91:F$99,MATCH($A39,Changes!$B$91:$B$99,0),)","v":446.34640854692702},{"$f":"INDEX(Changes!G$91:G$99,MATCH($A39,Changes!$B$91:$B$99,0),)","v":8.5835847797485965}]
["These projected rates exclude the targeted rural pest and river management rates that are not charged to all ratepayers"]

{"sheet":"6","index":30,"n_rows":23,"n_cols":9,"rows_kept":23,"cut":false,"hidden":false,"merged":[[2,0,2,8],[3,0,3,8],[22,0,22,8]]}
["Rates calculator - Residential region-wide1 rates"]
[]
["To calculate region-wide rates for all property types, use the calculator on our website http://www.gw.govt.nz/regional-rates-calculator/"]
["Note: These calculations do not include GWRC targeted rates that are specific to individual properties, and they do not include rates set by city or district councils. Greater Wellington rates are set and assessed by Greater Wellington but are invoiced and collected by the relevant city and district Council within the region. This combined collection arrangement is cost effective and more convenient for ratepayers. "]
[]
[null,{"$f":"year_current&\" region-wide rates per $100,000 of capital value\"","v":"2018/19 region-wide rates per $100,000 of capital value"},null,"Enter the capital value of your property",null,null,"Wellington regional strategy rate",null,{"$f":"\"Indicative rates on your property for \"&year_current&\" 1\"","v":"Indicative rates on your property for 2018/19 1"}]
[]
[]
[{"$f":"+'5'!A20","v":"Wellington city"},{"$f":"INDEX('5'!$L$34:$L$42,MATCH(A9,'5'!$A$34:$A$42,0),)/(1+GST)","v":78.726522857982658},"x",null,"÷ 100,000","+",{"$f":"+'5'!L20/(1+GST)","v":14},"="]
[{"$f":"+'5'!A21","v":"Hutt city"},{"$f":"INDEX('5'!$L$34:$L$42,MATCH(A10,'5'!$A$34:$A$42,0),)/(1+GST)","v":112.86374669573726},"x",null,"÷ 100,000","+",{"$f":"+G9","v":14},"="]
[{"$f":"+'5'!A22","v":"Upper Hutt city"},{"$f":"INDEX('5'!$L$34:$L$42,MATCH(A11,'5'!$A$34:$A$42,0),)/(1+GST)","v":106.0688329271938},"x",null,"÷ 100,000","+",{"$f":"+G10","v":14},"="]
[{"$f":"+'5'!A23","v":"Porirua city"},{"$f":"INDEX('5'!$L$34:$L$42,MATCH(A12,'5'!$A$34:$A$42,0),)/(1+GST)","v":99.226827364134294},"x",null,"÷ 100,000","+",14,"="]
["Kāpiti Coast district excl Ōtaki ",{"$f":"INDEX('5'!$L$34:$L$42,MATCH(A13,'5'!$A$34:$A$42,0),)/(1+GST)","v":69.237538535171822},"x",null,"÷ 100,000","+",14,"="]
["Ōtaki rating area",{"$f":"INDEX('5'!$L$34:$L$42,MATCH(A14,'5'!$A$34:$A$42,0),)/(1+GST)","v":66.252001523218837},"x",null,"÷ 100,000","+",14,"="]
[{"$f":"+'5'!A26","v":"Masterton district"},{"$f":"INDEX('5'!$L$34:$L$42,MATCH(A15,'5'!$A$34:$A$42,0),)/(1+GST)","v":44.238735653849844},"x",null,"÷ 100,000","+",{"$f":"+G13","v":14},"="]
[{"$f":"+'5'!A27","v":"Carterton district"},{"$f":"INDEX('5'!$L$34:$L$42,MATCH(A16,'5'!$A$34:$A$42,0),)/(1+GST)","v":51.293833810649744},"x",null,"÷ 100,000","+",14,"="]
[{"$f":"+'5'!A28","v":"South Wairarapa district"},{"$f":"INDEX('5'!$L$34:$L$42,MATCH(A17,'5'!$A$34:$A$42,0),)/(1+GST)","v":54.228843874541887},"x",null,"÷ 100,000","+",14,"="]
[]
[{"$f":"A10&\" example\"","v":"Hutt city example"},{"$f":"+B10","v":112.86374669573726},"x",350000,"÷ 100,000","+",{"$f":"+G9","v":14},"=",{"$f":"ROUND(+B19*D19/100000+G19,2)","v":409.02}]
[]
[null,null,null,null,null,null,{"$f":"\"includes GST @ \"&ROUND(GST*100,0)&\"%\"","v":"includes GST @ 15%"},null,{"$f":"ROUND(I19*(1+GST),2)","v":470.37}]
[]
["1  Region-wide rates are charged to all ratepayers in the region. They exclude targeted rates for pest management, Wairarapa river and drainage schemes, and \"Warm Greater Wellington\", because those rates only apply to highly specific ratepayers in those work programmes."]

{"sheet":"Impact","index":31,"n_rows":262,"n_cols":19,"rows_kept":262,"cut":false,"hidden":false,"merged":[[111,4,112,4],[111,2,112,2],[158,6,159,6],[243,0,244,0],[244,2,245,2],[155,0,156,0],[244,4,245,4],[195,2,196,2],[233,0,234,0],[156,4,157,4],[194,0,195,0],[234,2,235,2],[234,4,235,4],[195,4,196,4],[156,2,157,2],[155,6,156,6],[8,2,10,2],[8,9,10,9],[8,4,9,4],[8,11,9,11],[7,0,8,0],[7,6,8,6],[62,11,63,11],[156,8,157,8],[156,9,157,9],[111,11,112,11],[62,9,64,9],[111,9,112,9],[62,8,64,8],[61,6,62,7],[259,9,259,10],[234,9,235,9],[255,9,255,10],[195,9,196,9],[194,6,195,6],[201,6,203,6],[211,6,214,6],[49,11,50,11],[49,9,50,9],[195,11,196,11],[212,11,213,11],[233,6,234,6],[202,11,203,11],[234,11,235,11],[202,9,203,9],[212,9,214,9],[220,6,228,11],[63,7,64,7],[156,11,157,11],[110,6,111,6],[188,0,189,11],[48,6,49,6],[110,0,111,0],[45,4,47,4],[45,2,47,2],[26,4,28,4],[26,2,28,2],[25,0,26,0],[44,0,45,0]]}
["Wellington Regional Council"]
[{"$f":"\"Rates tables for annual plan \"&year_current","v":"Rates tables for annual plan 2018/19"}]
["Printed :",{"$f":"NOW()","v":"2018-11-12T16:52:19.590"}]
[{"$f":"check_total","v":0}]
[null,null,null,null,null,null,null,null,null,null,null,"Rates funding impact statement"]
[]
[]
["General rate",null,{"$f":"year_current","v":"2018/19"},null,{"$f":"year_current","v":"2018/19"},null,"Targeted rate\nPublic transport rate",null,null,{"$f":"year_current","v":"2018/19"},null,{"$f":"year_current","v":"2018/19"}]
[null,null,"Cents per $ of rateable capital value",null,"Revenue required\n $",null,null,null,null,{"$f":"+$C$9","v":"Cents per $ of rateable capital value"},null,"Revenue required\n $"]
[]
[]
["Wellington city",null,{"$f":"INDEX(Gen!$E$10:$E$25,MATCH(S12,Gen!$A$10:$A$25,0),)","v":4.4329360555183883E-2},null,{"$f":"INDEX(Gen!$D$10:$D$19,MATCH(A12,Gen!$A$10:$A$19,0),)","v":23048092.376524467},null,"Wellington city",null,null,null,null,null,null,null,null,null,null,null,"Wellington city"]
["Hutt city",null,{"$f":"INDEX(Gen!$E$10:$E$25,MATCH(S13,Gen!$A$10:$A$25,0),)","v":3.7654862293072695E-2},null,{"$f":"INDEX(Gen!$D$10:$D$19,MATCH(A13,Gen!$A$10:$A$19,0),)","v":8059093.3870078828},null,"Regional CBD",null,null,{"$f":"INDEX('Public transport'!$J$23:$J$60,MATCH(N13&O13,'Public transport'!$D$23:$D$60,0),)","v":0.32453831715582415},null,{"$f":"INDEX('Public transport'!$I$23:$I$60,MATCH(N13&O13,'Public transport'!$D$23:$D$60,0),)","v":25844164.269209553},null,"Wellington City","Regional CBD",null,null,null,"Hutt city"]
["Upper Hutt city",null,{"$f":"INDEX(Gen!$E$10:$E$25,MATCH(S14,Gen!$A$10:$A$25,0),)","v":3.7522778909524594E-2},null,{"$f":"INDEX(Gen!$D$10:$D$19,MATCH(A14,Gen!$A$10:$A$19,0),)","v":3064993.2456397233},null,"Business",null,null,{"$f":"INDEX('Public transport'!$J$23:$J$60,MATCH(N14&O14,'Public transport'!$D$23:$D$60,0),)","v":3.7503386367268597E-2},null,{"$f":"INDEX('Public transport'!$I$23:$I$60,MATCH(N14&O14,'Public transport'!$D$23:$D$60,0),)","v":1461180.8372846076},null,"Wellington City","Business",null,null,null,"Rest of Upper Hutt city"]
["Porirua city",null,{"$f":"INDEX(Gen!$E$10:$E$25,MATCH(S15,Gen!$A$10:$A$25,0),)","v":3.7162932327637697E-2},null,{"$f":"INDEX(Gen!$D$10:$D$19,MATCH(A15,Gen!$A$10:$A$19,0),)","v":3819282.5884013595},null,"Residential",null,null,{"$f":"INDEX('Public transport'!$J$23:$J$60,MATCH(N15&O15,'Public transport'!$D$23:$D$60,0),)","v":3.431507599612197E-2},null,{"$f":"INDEX('Public transport'!$I$23:$I$60,MATCH(N15&O15,'Public transport'!$D$23:$D$60,0),)","v":13567288.342507737},null,"Wellington City","Residential",null,null,null,"Porirua city"]
["Kāpiti Coast district",null,{"$f":"INDEX(Gen!$E$10:$E$25,MATCH(S16,Gen!$A$10:$A$25,0),)","v":3.3208045954726456E-2},null,{"$f":"INDEX(Gen!$D$10:$D$19,MATCH(A16,Gen!$A$10:$A$19,0),)","v":4904933.1921061305},null,"Rural",null,null,{"$f":"INDEX('Public transport'!$J$23:$J$60,MATCH(N16&O16,'Public transport'!$D$23:$D$60,0),)","v":8.7590147603388378E-3},null,{"$f":"INDEX('Public transport'!$I$23:$I$60,MATCH(N16&O16,'Public transport'!$D$23:$D$60,0),)","v":52198.958688082472},null,"Wellington City","Rural",null,null,null,"Kāpiti Coast district"]
["Masterton district",null,{"$f":"INDEX(Gen!$E$10:$E$25,MATCH(S17,Gen!$A$10:$A$25,0),)","v":3.3673537323278477E-2},null,{"$f":"INDEX(Gen!$D$10:$D$19,MATCH(A17,Gen!$A$10:$A$19,0),)","v":1968728.2422683882},null,"Hutt city",null,null,null,null,null,null,null,null,null,null,null,"Masterton district"]
["Carterton district",null,{"$f":"INDEX(Gen!$E$10:$E$25,MATCH(S18,Gen!$A$10:$A$25,0),)","v":3.3798637098020202E-2},null,{"$f":"INDEX(Gen!$D$10:$D$19,MATCH(A18,Gen!$A$10:$A$19,0),)","v":907437.02995516302},null,"Business",null,null,{"$f":"INDEX('Public transport'!$J$23:$J$60,MATCH(N18&O18,'Public transport'!$D$23:$D$60,0),)","v":5.7561783982530645E-2},null,{"$f":"INDEX('Public transport'!$I$23:$I$60,MATCH(N18&O18,'Public transport'!$D$23:$D$60,0),)","v":2181032.9758243612},null,"Hutt City","Business",null,null,null,"Carterton district"]
["South Wairarapa district",null,{"$f":"INDEX(Gen!$E$10:$E$25,MATCH(S19,Gen!$A$10:$A$25,0),)","v":3.3462980214229887E-2},null,{"$f":"INDEX(Gen!$D$10:$D$19,MATCH(A19,Gen!$A$10:$A$19,0),)","v":1508400.8206117172},null,"Residential",null,null,{"$f":"INDEX('Public transport'!$J$23:$J$60,MATCH(N19&O19,'Public transport'!$D$23:$D$60,0),)","v":5.4853525021212005E-2},null,{"$f":"INDEX('Public transport'!$I$23:$I$60,MATCH(N19&O19,'Public transport'!$D$23:$D$60,0),)","v":9490730.5694780909},null,"Hutt City","Residential",null,null,null,"South Wairarapa district"]
["Tararua district",null,{"$f":"INDEX(Gen!$E$10:$E$25,MATCH(S20,Gen!$A$10:$A$25,0),)","v":2.1867242627921474E-2},null,{"$f":"INDEX(Gen!$D$10:$D$19,MATCH(A20,Gen!$A$10:$A$19,0),)","v":2353.0246429774902},null,"Rural",null,null,{"$f":"INDEX('Public transport'!$J$23:$J$60,MATCH(N20&O20,'Public transport'!$D$23:$D$60,0),)","v":1.3946291757140664E-2},null,{"$f":"INDEX('Public transport'!$I$23:$I$60,MATCH(N20&O20,'Public transport'!$D$23:$D$60,0),)","v":43449.532506454168},null,"Hutt City","Rural",null,null,null,"Tararua district"]
["Total general rate",null,null,null,{"$f":"SUM(E12:E20)","v":47283313.907157809},null,"Upper Hutt city"]
[null,null,null,null,null,null,"Business",null,null,{"$f":"INDEX('Public transport'!$J$23:$J$60,MATCH(Q22&O22,'Public transport'!$D$23:$D$60,0),)","v":6.1941086618388853E-2},null,{"$f":"INDEX('Public transport'!$I$23:$I$60,MATCH(N22&O22,'Public transport'!$D$23:$D$60,0),)","v":742078.90929759946},null,"Upper Hutt City","Business",null,"Rest of Upper Hutt City"]
[null,null,null,null,null,null,"Residential",null,null,{"$f":"INDEX('Public transport'!$J$23:$J$60,MATCH(Q23&O23,'Public transport'!$D$23:$D$60,0),)","v":6.0549972571654891E-2},null,{"$f":"INDEX('Public transport'!$I$23:$I$60,MATCH(N23&O23,'Public transport'!$D$23:$D$60,0),)","v":3723760.5901796483},null,"Upper Hutt City","Residential",null,"Rest of Upper Hutt City"]
[null,null,null,null,null,null,"Rural",null,null,{"$f":"INDEX('Public transport'!$J$23:$J$60,MATCH(Q24&O24,'Public transport'!$D$23:$D$60,0),)","v":1.5366243043867274E-2},null,{"$f":"INDEX('Public transport'!$I$23:$I$60,MATCH(N24&O24,'Public transport'!$D$23:$D$60,0),)","v":131466.69197227218},null,"Upper Hutt City","Rural",null,"Rest of Upper Hutt City"]
[null,null,null,null,null,null,"Porirua city"]
["Targeted rate\nRiver management rate",null,{"$f":"+C8","v":"2018/19"},null,{"$f":"+E8","v":"2018/19"},null,"Business",null,null,{"$f":"INDEX('Public transport'!$J$23:$J$60,MATCH(N26&O26,'Public transport'!$D$23:$D$60,0),)","v":6.4409950025790655E-2},null,{"$f":"INDEX('Public transport'!$I$23:$I$60,MATCH(N26&O26,'Public transport'!$D$23:$D$60,0),)","v":708506.55183594604},null,"Porirua City","Business"]
[null,null,{"$f":"+$C$9","v":"Cents per $ of rateable capital value"},null,{"$f":"+$E$9","v":"Revenue required\n $"},null,"Residential",null,null,{"$f":"INDEX('Public transport'!$J$23:$J$60,MATCH(N27&O27,'Public transport'!$D$23:$D$60,0),)","v":6.1737072251816724E-2},null,{"$f":"INDEX('Public transport'!$I$23:$I$60,MATCH(N27&O27,'Public transport'!$D$23:$D$60,0),)","v":5279332.7856404223},null,"Porirua City","Residential"]
[" based on capital value",null,null,null,null,null,"Rural",null,null,{"$f":"INDEX('Public transport'!$J$23:$J$60,MATCH(N28&O28,'Public transport'!$D$23:$D$60,0),)","v":1.5698201754363456E-2},null,{"$f":"INDEX('Public transport'!$I$23:$I$60,MATCH(N28&O28,'Public transport'!$D$23:$D$60,0),)","v":98241.968178499475},null,"Porirua City","Rural"]
[null,null,null,null,null,null,"Kāpiti Coast district"]
["Wellington city",null,{"$f":"INDEX('River management'!$D$10:$D$25,MATCH(S12,'River management'!$A$10:$A$25,0),)","v":8.2086306676803879E-5},null,{"$f":"INDEX('River management'!$C$10:$C$19,MATCH(A30,'River management'!$A$10:$A$19,0),)","v":42679},null,"Business",null,null,{"$f":"INDEX('Public transport'!$J$23:$J$60,MATCH(N30&O30,'Public transport'!$D$23:$D$60,0),)","v":2.9376984703201457E-2},null,{"$f":"INDEX('Public transport'!$I$23:$I$60,MATCH(N30&O30,'Public transport'!$D$23:$D$60,0),)","v":434529.5223524808},null,"Kāpiti Coast district","Business"]
["Hutt city",null,{"$f":"INDEX('River management'!$D$10:$D$25,MATCH(S13,'River management'!$A$10:$A$25,0),)","v":2.0355359381452581E-2},null,{"$f":"INDEX('River management'!$C$10:$C$19,MATCH(A31,'River management'!$A$10:$A$19,0),)","v":4356562},null,"Residential excl Otaki",null,null,{"$f":"INDEX('Public transport'!$J$23:$J$60,MATCH(N31&O31,'Public transport'!$D$23:$D$60,0),)","v":2.6988555093639063E-2},null,{"$f":"INDEX('Public transport'!$I$23:$I$60,MATCH(N31&O31,'Public transport'!$D$23:$D$60,0),)","v":2758230.1956271366},null,"Kāpiti Coast district excl Ōtaki ","Residential"]
["Upper Hutt city",null,{"$f":"INDEX('River management'!$D$10:$D$25,MATCH(S14,'River management'!$A$10:$A$25,0),)","v":8.1664192834855816E-3},null,{"$f":"INDEX('River management'!$C$10:$C$19,MATCH(A32,'River management'!$A$10:$A$19,0),)","v":667062},null,"Residential Otaki rating area",null,null,{"$f":"INDEX('Public transport'!$J$23:$J$60,MATCH(N32&O32,'Public transport'!$D$23:$D$60,0),)","v":2.4003018081686076E-2},null,{"$f":"INDEX('Public transport'!$I$23:$I$60,MATCH(N32&O32,'Public transport'!$D$23:$D$60,0),)","v":265175.95858639781},null,"Ōtaki rating area","Residential"]
["Porirua city",null,{"$f":"INDEX('River management'!$D$10:$D$25,MATCH(S15,'River management'!$A$10:$A$25,0),)","v":3.2682278467987543E-4},null,{"$f":"INDEX('River management'!$C$10:$C$19,MATCH(A33,'River management'!$A$10:$A$19,0),)","v":33588},null,"Rural",null,null,{"$f":"INDEX('Public transport'!$J$23:$J$60,MATCH(N33&O33,'Public transport'!$D$23:$D$60,0),)","v":6.9301501773774117E-3},null,{"$f":"INDEX('Public transport'!$I$23:$I$60,MATCH(N33&O33,'Public transport'!$D$23:$D$60,0),)","v":136274.86810650953},null,"Kāpiti Coast district","Rural"]
["Kāpiti Coast district",null,{"$f":"INDEX('River management'!$D$10:$D$25,MATCH(S16,'River management'!$A$10:$A$25,0),)","v":9.0409374868063077E-3},null,{"$f":"INDEX('River management'!$C$10:$C$19,MATCH(A34,'River management'!$A$10:$A$19,0),)","v":1335375},null,"Masterton district"]
["Masterton District",null,{"$f":"INDEX('River management'!$D$10:$D$25,MATCH(S17,'River management'!$A$10:$A$25,0),)","v":0},null,{"$f":"INDEX('River management'!$C$10:$C$19,MATCH(A35,'River management'!$A$10:$A$19,0),)","v":0},null,"Business",null,null,{"$f":"INDEX('Public transport'!$J$23:$J$60,MATCH(N35&O35,'Public transport'!$D$23:$D$60,0),)","v":1.3592584890415588E-2},null,{"$f":"INDEX('Public transport'!$I$23:$I$60,MATCH(N35&O35,'Public transport'!$D$23:$D$60,0),)","v":58905.247251236593},null,"Masterton District","Business"]
["Carterton district",null,{"$f":"INDEX('River management'!$D$10:$D$25,MATCH(S18,'River management'!$A$10:$A$25,0),)","v":8.8292263370402303E-4},null,{"$f":"INDEX('River management'!$C$10:$C$19,MATCH(A36,'River management'!$A$10:$A$19,0),)","v":23705},null,"Residential",null,null,{"$f":"INDEX('Public transport'!$J$23:$J$60,MATCH(N36&O36,'Public transport'!$D$23:$D$60,0),)","v":1.0565198330571358E-2},null,{"$f":"INDEX('Public transport'!$I$23:$I$60,MATCH(N36&O36,'Public transport'!$D$23:$D$60,0),)","v":275144.79030540778},null,"Masterton District","Residential"]
["South Wairarapa District",null,{"$f":"INDEX('River management'!$D$10:$D$25,MATCH(S19,'River management'!$A$10:$A$25,0),)","v":0},null,{"$f":"INDEX('River management'!$C$10:$C$19,MATCH(A37,'River management'!$A$10:$A$19,0),)","v":0},null,"Rural",null,null,{"$f":"INDEX('Public transport'!$J$23:$J$60,MATCH(N37&O37,'Public transport'!$D$23:$D$60,0),)","v":3.6791525955347168E-3},null,{"$f":"INDEX('Public transport'!$I$23:$I$60,MATCH(N37&O37,'Public transport'!$D$23:$D$60,0),)","v":103343.55537326045},null,"Masterton District","Rural"]
["Total district-wide river management rate",null,null,null,{"$f":"SUM(E30:E37)","v":6458971},null,"Carterton district"]
["Greytown ward",null,{"$f":"'River management'!D29","v":1.2521342659613331E-2},null,{"$f":"'River management'!C29","v":92549},null,"Business",null,null,{"$f":"INDEX('Public transport'!$J$23:$J$60,MATCH(N39&O39,'Public transport'!$D$23:$D$60,0),)","v":1.9650907612114316E-2},null,{"$f":"INDEX('Public transport'!$I$23:$I$60,MATCH(N39&O39,'Public transport'!$D$23:$D$60,0),)","v":18993.09347979879},null,"Carterton District","Business"]
["Total river management rates based upon capital value",null,null,null,{"$f":"+E39+E38","v":6551520},null,"Residential",null,null,{"$f":"INDEX('Public transport'!$J$23:$J$60,MATCH(N40&O40,'Public transport'!$D$23:$D$60,0),)","v":1.6612274078925505E-2},null,{"$f":"INDEX('Public transport'!$I$23:$I$60,MATCH(N40&O40,'Public transport'!$D$23:$D$60,0),)","v":140193.22360905298},null,"Carterton District","Residential"]
[null,null,null,null,null,null,"Rural",null,null,{"$f":"INDEX('Public transport'!$J$23:$J$60,MATCH(N41&O41,'Public transport'!$D$23:$D$60,0),)","v":5.1570714632568826E-3},null,{"$f":"INDEX('Public transport'!$I$23:$I$60,MATCH(N41&O41,'Public transport'!$D$23:$D$60,0),)","v":89953.106014149846},null,"Carterton District","Rural"]
[null,null,null,null,null,null,"South Wairarapa district"]
[null,null,null,null,null,null,"Business",null,null,{"$f":"INDEX('Public transport'!$J$23:$J$60,MATCH(N43&O43,'Public transport'!$D$23:$D$60,0),)","v":2.3774320288444759E-2},null,{"$f":"INDEX('Public transport'!$I$23:$I$60,MATCH(N43&O43,'Public transport'!$D$23:$D$60,0),)","v":49092.449839139968},null,"South Wairarapa District","Business"]
[null,null,null,null,null,null,"Residential",null,null,{"$f":"INDEX('Public transport'!$J$23:$J$60,MATCH(N44&O44,'Public transport'!$D$23:$D$60,0),)","v":2.0765863660312002E-2},null,{"$f":"INDEX('Public transport'!$I$23:$I$60,MATCH(N44&O44,'Public transport'!$D$23:$D$60,0),)","v":273878.08936080622},null,"South Wairarapa District","Residential"]
["Targeted rate\nRiver management",null,{"$f":"year_current","v":"2018/19"},null,{"$f":"year_current","v":"2018/19"},null,"Rural",null,null,{"$f":"INDEX('Public transport'!$J$23:$J$60,MATCH(N45&O45,'Public transport'!$D$23:$D$60,0),)","v":6.1204870887032305E-3},null,{"$f":"INDEX('Public transport'!$I$23:$I$60,MATCH(N45&O45,'Public transport'!$D$23:$D$60,0),)","v":182530.7111206101},null,"South Wairarapa District","Rural"]
[null,null,"Cents per $ of rateable land value",null,"Revenue required\n $",null,"Total public transport rate",null,null,null,null,{"$f":"SUM(L13:L45)","v":68109677.793629259}]
[]
[]
[null,null,null,null,null,null,"Targeted rate\nWarm Greater Wellington\nBased on extent of service provided",null,null,{"$f":"year_current","v":"2018/19"},null,{"$f":"year_current","v":"2018/19"}]
["Featherston urban: Donalds Creek Stopbank",null,{"$f":"'River management'!D30","v":1.6120729778964142E-3},null,{"$f":"'River management'!C30","v":2615},null,null,null,null,"Percentage of service provided",null,"Revenue required\n $"]
["Total river management rates based upon land value",null,null,null,{"$f":"+E50+E49","v":2615}]
[]
["Total river management rates",null,null,null,{"$f":"+E51+E40","v":6554135},null,"For any ratepayer that utilises the service",null,null,0.15,null,{"$f":"INDEX(ESSbase!$G$8:$G$25,MATCH(\"Warm Greater Wellington Rate\",ESSbase!$B$8:$B$25,0),)","v":3237058}]
[]
["All figures on this page exclude GST."]
[]
[]
[]
[null,null,null,null,null,null,null,null,null,null,null,"Rates funding impact statement"]
[]
[]
[null,null,null,null,null,null,"Targeted rate\nWellington regional strategy rate",null,null,{"$f":"year_current","v":"2018/19"},null,{"$f":"year_current","v":"2018/19"}]
[null,null,null,null,null,null,null,null,"$ per rating  unit",{"$f":"+$C$9","v":"Cents per $ of rateable capital value"},null,"Revenue required\n $"]
[]
[]
[null,null,null,null,null,null,"Wellington city"]
[null,null,null,null,null,null,"Regional CBD",null,null,{"$f":"INDEX(WRS!$L$23:$L$49,MATCH(G66&G67,WRS!$D$23:$D$49,0),)","v":1.1225542085297009E-2},null,{"$f":"SUMIFS(WRS!$K$23:$K$49,WRS!$A$23:$A$49,N67,WRS!$C$23:$C$49,O67)","v":893930.66496997047},null,"Wellington City","Regional CBD"]
[null,null,null,null,null,null,"Business",null,null,{"$f":"INDEX(WRS!$L$23:$L$49,MATCH(G66&G68,WRS!$D$23:$D$49,0),)","v":1.1225542085297009E-2},null,{"$f":"SUMIFS(WRS!$K$23:$K$49,WRS!$A$23:$A$49,N68,WRS!$C$23:$C$49,O68)","v":437361.75775005075},null,"Wellington City","Business"]
[null,null,null,null,null,null,"Residential – per rating unit",null,{"$f":"SUMIFS(WRS!$H$23:$H$49,WRS!$A$23:$A$49,N69,WRS!$C$23:$C$49,O69)/COUNTIFS(WRS!$A$23:$A$49,N69,WRS!$C$23:$C$49,O69)","v":14},null,null,{"$f":"SUMIFS(WRS!$K$23:$K$49,WRS!$A$23:$A$49,N69,WRS!$C$23:$C$49,O69)","v":998312},null,"Wellington City","Residential"]
[null,null,null,null,null,null,"Rural – per rating unit",null,{"$f":"SUMIFS(WRS!$H$23:$H$49,WRS!$A$23:$A$49,N70,WRS!$C$23:$C$49,O70)/COUNTIFS(WRS!$A$23:$A$49,N70,WRS!$C$23:$C$49,O70)","v":28},null,null,{"$f":"SUMIFS(WRS!$K$23:$K$49,WRS!$A$23:$A$49,N70,WRS!$C$23:$C$49,O70)","v":21868},null,"Wellington City","Rural"]
[null,null,null,null,null,null,"Hutt city"]
[null,null,null,null,null,null,"Business",null,null,{"$f":"INDEX(WRS!$L$23:$L$49,MATCH(G71&G72,WRS!$D$23:$D$49,0),)","v":9.5353561633435488E-3},null,{"$f":"SUMIFS(WRS!$K$23:$K$49,WRS!$A$23:$A$49,N72,WRS!$C$23:$C$49,O72)","v":361297.45795915526},null,"Hutt City","Business"]
[null,null,null,null,null,null,"Residential – per rating unit",null,{"$f":"SUMIFS(WRS!$H$23:$H$49,WRS!$A$23:$A$49,N73,WRS!$C$23:$C$49,O73)/COUNTIFS(WRS!$A$23:$A$49,N73,WRS!$C$23:$C$49,O73)","v":14},null,null,{"$f":"SUMIFS(WRS!$K$23:$K$49,WRS!$A$23:$A$49,N73,WRS!$C$23:$C$49,O73)","v":508354},null,"Hutt City","Residential"]
[null,null,null,null,null,null,"Rural – per rating unit",null,{"$f":"SUMIFS(WRS!$H$23:$H$49,WRS!$A$23:$A$49,N74,WRS!$C$23:$C$49,O74)/COUNTIFS(WRS!$A$23:$A$49,N74,WRS!$C$23:$C$49,O74)","v":28},null,null,{"$f":"SUMIFS(WRS!$K$23:$K$49,WRS!$A$23:$A$49,N74,WRS!$C$23:$C$49,O74)","v":13440},null,"Hutt City","Rural"]
[null,null,null,null,null,null,"Upper Hutt city"]
[null,null,null,null,null,null,"Business",null,null,{"$f":"INDEX(WRS!$L$23:$L$49,MATCH(G75&G76,WRS!$D$23:$D$49,0),)","v":9.4809885646007976E-3},null,{"$f":"SUMIFS(WRS!$K$23:$K$49,WRS!$A$23:$A$49,N76,WRS!$C$23:$C$49,O76)","v":111370.9446360529},null,"Upper Hutt City","Business"]
[null,null,null,null,null,null,"Residential – per rating unit",null,{"$f":"SUMIFS(WRS!$H$23:$H$49,WRS!$A$23:$A$49,N77,WRS!$C$23:$C$49,O77)/COUNTIFS(WRS!$A$23:$A$49,N77,WRS!$C$23:$C$49,O77)","v":14},null,null,{"$f":"SUMIFS(WRS!$K$23:$K$49,WRS!$A$23:$A$49,N77,WRS!$C$23:$C$49,O77)","v":206920},null,"Upper Hutt City","Residential"]
[null,null,null,null,null,null,"Rural – per rating unit",null,{"$f":"SUMIFS(WRS!$H$23:$H$49,WRS!$A$23:$A$49,N78,WRS!$C$23:$C$49,O78)/COUNTIFS(WRS!$A$23:$A$49,N78,WRS!$C$23:$C$49,O78)","v":28},null,null,{"$f":"SUMIFS(WRS!$K$23:$K$49,WRS!$A$23:$A$49,N78,WRS!$C$23:$C$49,O78)","v":32816},null,"Upper Hutt City","Rural"]
[null,null,null,null,null,null,"Porirua city"]
[null,null,null,null,null,null,"Business",null,null,{"$f":"INDEX(WRS!$L$23:$L$49,MATCH(G79&G80,WRS!$D$23:$D$49,0),)","v":9.4107845372057193E-3},null,{"$f":"SUMIFS(WRS!$K$23:$K$49,WRS!$A$23:$A$49,N80,WRS!$C$23:$C$49,O80)","v":103518.20642395873},null,"Porirua City","Business"]
[null,null,null,null,null,null,"Residential – per rating unit",null,{"$f":"SUMIFS(WRS!$H$23:$H$49,WRS!$A$23:$A$49,N81,WRS!$C$23:$C$49,O81)/COUNTIFS(WRS!$A$23:$A$49,N81,WRS!$C$23:$C$49,O81)","v":14},null,null,{"$f":"SUMIFS(WRS!$K$23:$K$49,WRS!$A$23:$A$49,N81,WRS!$C$23:$C$49,O81)","v":241570},null,"Porirua City","Residential"]
[null,null,null,null,null,null,"Rural – per rating unit",null,{"$f":"SUMIFS(WRS!$H$23:$H$49,WRS!$A$23:$A$49,N82,WRS!$C$23:$C$49,O82)/COUNTIFS(WRS!$A$23:$A$49,N82,WRS!$C$23:$C$49,O82)","v":28},null,null,{"$f":"SUMIFS(WRS!$K$23:$K$49,WRS!$A$23:$A$49,N82,WRS!$C$23:$C$49,O82)","v":17444},null,"Porirua City","Rural"]
[null,null,null,null,null,null,"Kāpiti Coast district"]
[null,null,null,null,null,null,"Business",null,null,{"$f":"INDEX(WRS!$L$23:$L$49,MATCH(G83&G84,WRS!$D$23:$D$49,0),)","v":8.4092870451222008E-3},null,{"$f":"SUMIFS(WRS!$K$23:$K$49,WRS!$A$23:$A$49,N84,WRS!$C$23:$C$49,O84)","v":124385.92728148981},null,"Kāpiti Coast district","Business"]
[null,null,null,null,null,null,"Residential – per rating unit",null,{"$f":"SUMIFS(WRS!$H$23:$H$49,WRS!$A$23:$A$49,N85,WRS!$C$23:$C$49,O85)/COUNTIFS(WRS!$A$23:$A$49,N85,WRS!$C$23:$C$49,O85)","v":14},null,null,{"$f":"SUMIFS(WRS!$K$23:$K$49,WRS!$A$23:$A$49,N85,WRS!$C$23:$C$49,O85)","v":291536},null,"Kāpiti Coast district","Residential"]
[null,null,null,null,null,null,"Rural – per rating unit",null,{"$f":"SUMIFS(WRS!$H$23:$H$49,WRS!$A$23:$A$49,N86,WRS!$C$23:$C$49,O86)/COUNTIFS(WRS!$A$23:$A$49,N86,WRS!$C$23:$C$49,O86)","v":28},null,null,{"$f":"SUMIFS(WRS!$K$23:$K$49,WRS!$A$23:$A$49,N86,WRS!$C$23:$C$49,O86)","v":69608},null,"Kāpiti Coast district","Rural"]
[null,null,null,null,null,null,"Masterton district"]
[null,null,null,null,null,null,"Business",null,null,{"$f":"INDEX(WRS!$L$23:$L$49,MATCH(G87&G88,WRS!$D$23:$D$49,0),)","v":8.5271636145691793E-3},null,{"$f":"SUMIFS(WRS!$K$23:$K$49,WRS!$A$23:$A$49,N88,WRS!$C$23:$C$49,O88)","v":36953.580582169045},null,"Masterton District","Business"]
[null,null,null,null,null,null,"Residential – per rating unit",null,{"$f":"SUMIFS(WRS!$H$23:$H$49,WRS!$A$23:$A$49,N89,WRS!$C$23:$C$49,O89)/COUNTIFS(WRS!$A$23:$A$49,N89,WRS!$C$23:$C$49,O89)","v":14},null,null,{"$f":"SUMIFS(WRS!$K$23:$K$49,WRS!$A$23:$A$49,N89,WRS!$C$23:$C$49,O89)","v":110558},null,"Masterton District","Residential"]
[null,null,null,null,null,null,"Rural – per rating unit",null,{"$f":"SUMIFS(WRS!$H$23:$H$49,WRS!$A$23:$A$49,N90,WRS!$C$23:$C$49,O90)/COUNTIFS(WRS!$A$23:$A$49,N90,WRS!$C$23:$C$49,O90)","v":28},null,null,{"$f":"SUMIFS(WRS!$K$23:$K$49,WRS!$A$23:$A$49,N90,WRS!$C$23:$C$49,O90)","v":96376},null,"Masterton District","Rural"]
[null,null,null,null,null,null,"Carterton district"]
[null,null,null,null,null,null,"Business",null,null,{"$f":"INDEX(WRS!$L$23:$L$49,MATCH(G91&G92,WRS!$D$23:$D$49,0),)","v":8.5588426816397781E-3},null,{"$f":"SUMIFS(WRS!$K$23:$K$49,WRS!$A$23:$A$49,N92,WRS!$C$23:$C$49,O92)","v":8272.3354228718872},null,"Carterton District","Business"]
[null,null,null,null,null,null,"Residential – per rating unit",null,{"$f":"SUMIFS(WRS!$H$23:$H$49,WRS!$A$23:$A$49,N93,WRS!$C$23:$C$49,O93)/COUNTIFS(WRS!$A$23:$A$49,N93,WRS!$C$23:$C$49,O93)","v":14},null,null,{"$f":"SUMIFS(WRS!$K$23:$K$49,WRS!$A$23:$A$49,N93,WRS!$C$23:$C$49,O93)","v":32970},null,"Carterton District","Residential"]
[null,null,null,null,null,null,"Rural – per rating unit",null,{"$f":"SUMIFS(WRS!$H$23:$H$49,WRS!$A$23:$A$49,N94,WRS!$C$23:$C$49,O94)/COUNTIFS(WRS!$A$23:$A$49,N94,WRS!$C$23:$C$49,O94)","v":28},null,null,{"$f":"SUMIFS(WRS!$K$23:$K$49,WRS!$A$23:$A$49,N94,WRS!$C$23:$C$49,O94)","v":48972},null,"Carterton District","Rural"]
[null,null,null,null,null,null,"South Wairarapa district"]
[null,null,null,null,null,null,"Business",null,null,{"$f":"INDEX(WRS!$L$23:$L$49,MATCH(G95&G96,WRS!$D$23:$D$49,0),)","v":8.47384415181625E-3},null,{"$f":"SUMIFS(WRS!$K$23:$K$49,WRS!$A$23:$A$49,N96,WRS!$C$23:$C$49,O96)","v":17497.945847474839},null,"South Wairarapa District","Business"]
[null,null,null,null,null,null,"Residential – per rating unit",null,{"$f":"SUMIFS(WRS!$H$23:$H$49,WRS!$A$23:$A$49,N97,WRS!$C$23:$C$49,O97)/COUNTIFS(WRS!$A$23:$A$49,N97,WRS!$C$23:$C$49,O97)","v":14},null,null,{"$f":"SUMIFS(WRS!$K$23:$K$49,WRS!$A$23:$A$49,N97,WRS!$C$23:$C$49,O97)","v":44240},null,"South Wairarapa District","Residential"]
[null,null,null,null,null,null,"Rural – per rating unit",null,{"$f":"SUMIFS(WRS!$H$23:$H$49,WRS!$A$23:$A$49,N98,WRS!$C$23:$C$49,O98)/COUNTIFS(WRS!$A$23:$A$49,N98,WRS!$C$23:$C$49,O98)","v":28},null,null,{"$f":"SUMIFS(WRS!$K$23:$K$49,WRS!$A$23:$A$49,N98,WRS!$C$23:$C$49,O98)","v":78036},null,"South Wairarapa District","Rural"]
[null,null,null,null,null,null,"Tararua district  – per rating unit",null,{"$f":"SUMIFS(WRS!$H$23:$H$49,WRS!$A$23:$A$49,N99,WRS!$C$23:$C$49,O99)/COUNTIFS(WRS!$A$23:$A$49,N99,WRS!$C$23:$C$49,O99)","v":28},null,null,{"$f":"SUMIFS(WRS!$K$23:$K$49,WRS!$A$23:$A$49,N99,WRS!$C$23:$C$49,O99)","v":252},null,"Tararua District","Rural"]
[null,null,null,null,null,null,"Total Wellington regional strategy rate",null,null,null,null,{"$f":"SUM(L67:L99)","v":4907860.8208731934}]
[]
[null,null,null,null,null,null,{"$f":"+$A$55","v":"All figures on this page exclude GST."}]
[]
[]
[]
[]
[]
[null,null,null,null,null,null,null,null,null,null,null,"Rates funding impact statement"]
[]
[]
["Targeted rate\nRiver management schemes 1",null,{"$f":"year_current","v":"2018/19"},null,{"$f":"year_current","v":"2018/19"},null,"Targeted rate \nRiver management schemes 1",null,null,{"$f":"year_current","v":"2018/19"},null,{"$f":"year_current","v":"2018/19"}]
[null,null,"$ per hectare",null,"Revenue required\n $",null,null,null,null,"$ per hectare",null,"Revenue required\n $"]
[]
["Waingawa","A",{"$f":"INDEX('Class Rates'!$E$9:$E$139,MATCH(A114&B114,'Class Rates'!$M$9:$M$139,0),)","v":146.8098727324633},null,{"$f":"INDEX('Class Rates'!$F$9:$F$139,MATCH(A114&B114,'Class Rates'!$M$9:$M$139,0),)","v":4979.9523739451624},null,{"$f":"'Class Rates'!A42","v":"Waiohine Rural"},null,"A",{"$f":"INDEX('Class Rates'!$E$9:$E$139,MATCH(G114&I114,'Class Rates'!$M$9:$M$139,0),)","v":45.785193650716508},null,{"$f":"INDEX('Class Rates'!$F$9:$F$139,MATCH(G114&I114,'Class Rates'!$M$9:$M$139,0),)","v":5150.2116070719567}]
[{"$f":"A114","v":"Waingawa"},"B",{"$f":"INDEX('Class Rates'!$E$9:$E$139,MATCH(A115&B115,'Class Rates'!$M$9:$M$139,0),)","v":95.426417276101148},null,{"$f":"INDEX('Class Rates'!$F$9:$F$139,MATCH(A115&B115,'Class Rates'!$M$9:$M$139,0),)","v":12423.794288577074},null,{"$f":"G114","v":"Waiohine Rural"},null,"B",{"$f":"INDEX('Class Rates'!$E$9:$E$139,MATCH(G115&I115,'Class Rates'!$M$9:$M$139,0),)","v":38.154328042263757},null,{"$f":"INDEX('Class Rates'!$F$9:$F$139,MATCH(G115&I115,'Class Rates'!$M$9:$M$139,0),)","v":14613.989005164794}]
["Waingawa","C",{"$f":"INDEX('Class Rates'!$E$9:$E$139,MATCH(A116&B116,'Class Rates'!$M$9:$M$139,0),)","v":73.404936366231652},null,{"$f":"INDEX('Class Rates'!$F$9:$F$139,MATCH(A116&B116,'Class Rates'!$M$9:$M$139,0),)","v":8381.0012691208594},null,{"$f":"G115","v":"Waiohine Rural"},null,"C",{"$f":"INDEX('Class Rates'!$E$9:$E$139,MATCH(G116&I116,'Class Rates'!$M$9:$M$139,0),)","v":30.523462433811005},null,{"$f":"INDEX('Class Rates'!$F$9:$F$139,MATCH(G116&I116,'Class Rates'!$M$9:$M$139,0),)","v":39000.598089160994}]
["Waingawa","D",{"$f":"INDEX('Class Rates'!$E$9:$E$139,MATCH(A117&B117,'Class Rates'!$M$9:$M$139,0),)","v":66.064442729608487},null,{"$f":"INDEX('Class Rates'!$F$9:$F$139,MATCH(A117&B117,'Class Rates'!$M$9:$M$139,0),)","v":153.95657733707961},null,"Waiohine Rural",null,"D",{"$f":"INDEX('Class Rates'!$E$9:$E$139,MATCH(G117&I117,'Class Rates'!$M$9:$M$139,0),)","v":22.892596825358254},null,{"$f":"INDEX('Class Rates'!$F$9:$F$139,MATCH(G117&I117,'Class Rates'!$M$9:$M$139,0),)","v":8505.1079362701148}]
["Waingawa","E",{"$f":"INDEX('Class Rates'!$E$9:$E$139,MATCH(A118&B118,'Class Rates'!$M$9:$M$139,0),)","v":58.723949092985322},null,{"$f":"INDEX('Class Rates'!$F$9:$F$139,MATCH(A118&B118,'Class Rates'!$M$9:$M$139,0),)","v":9854.2603634720381},null,"Waiohine Rural",null,"E",{"$f":"INDEX('Class Rates'!$E$9:$E$139,MATCH(G118&I118,'Class Rates'!$M$9:$M$139,0),)","v":15.261731216905503},null,{"$f":"INDEX('Class Rates'!$F$9:$F$139,MATCH(G118&I118,'Class Rates'!$M$9:$M$139,0),)","v":12230.313171877911}]
["Waingawa","F",{"$f":"INDEX('Class Rates'!$E$9:$E$139,MATCH(A119&B119,'Class Rates'!$M$9:$M$139,0),)","v":51.383455456362157},null,{"$f":"INDEX('Class Rates'!$F$9:$F$139,MATCH(A119&B119,'Class Rates'!$M$9:$M$139,0),)","v":1333.7500765897012},null,"Waiohine Rural",null,"S",{"$f":"INDEX('Class Rates'!$E$9:$E$139,MATCH(G119&I119,'Class Rates'!$M$9:$M$139,0),)","v":763.08656084527513},null,{"$f":"INDEX('Class Rates'!$F$9:$F$139,MATCH(G119&I119,'Class Rates'!$M$9:$M$139,0),)","v":13048.780190454185}]
["Waingawa","G",{"$f":"INDEX('Class Rates'!$E$9:$E$139,MATCH(A120&B120,'Class Rates'!$M$9:$M$139,0),)","v":22.021480909869496},null,{"$f":"INDEX('Class Rates'!$F$9:$F$139,MATCH(A120&B120,'Class Rates'!$M$9:$M$139,0),)","v":1030.1343992341158},null,null,null,null,null,null,{"$f":"SUM(L114:L119)","v":92548.999999999971}]
["Waingawa","H",{"$f":"INDEX('Class Rates'!$E$9:$E$139,MATCH(A121&B121,'Class Rates'!$M$9:$M$139,0),)","v":14.68098727324633},null,{"$f":"INDEX('Class Rates'!$F$9:$F$139,MATCH(A121&B121,'Class Rates'!$M$9:$M$139,0),)","v":2478.1506517239814},null,{"$f":"'Class Rates'!A48","v":"Mangatarere"},null,"A",{"$f":"INDEX('Class Rates'!$E$9:$E$139,MATCH(G121&I121,'Class Rates'!$M$9:$M$139,0),)","v":34.614077181897954},null,{"$f":"INDEX('Class Rates'!$F$9:$F$139,MATCH(G121&I121,'Class Rates'!$M$9:$M$139,0),)","v":742.71425409198446}]
[null,null,null,null,{"$f":"SUM(E114:E121)","v":40635.000000000015},null,{"$f":"G121","v":"Mangatarere"},null,"B",{"$f":"INDEX('Class Rates'!$E$9:$E$139,MATCH(G122&I122,'Class Rates'!$M$9:$M$139,0),)","v":33.109117304424132},null,{"$f":"INDEX('Class Rates'!$F$9:$F$139,MATCH(G122&I122,'Class Rates'!$M$9:$M$139,0),)","v":6937.9758002013114}]
["Upper Ruamahanga","A",{"$f":"INDEX('Class Rates'!$E$9:$E$139,MATCH(A123&B123,'Class Rates'!$M$9:$M$139,0),)","v":132.77572476680345},null,{"$f":"INDEX('Class Rates'!$F$9:$F$139,MATCH(A123&B123,'Class Rates'!$M$9:$M$139,0),)","v":11819.576546679356},null,"Mangatarere",null,"C",{"$f":"INDEX('Class Rates'!$E$9:$E$139,MATCH(G123&I123,'Class Rates'!$M$9:$M$139,0),)","v":28.056752001476291},null,{"$f":"INDEX('Class Rates'!$F$9:$F$139,MATCH(G123&I123,'Class Rates'!$M$9:$M$139,0),)","v":442.41008826007874}]
[{"$f":"A123","v":"Upper Ruamahanga"},"B",{"$f":"INDEX('Class Rates'!$E$9:$E$139,MATCH(A124&B124,'Class Rates'!$M$9:$M$139,0),)","v":110.64643730566955},null,{"$f":"INDEX('Class Rates'!$F$9:$F$139,MATCH(A124&B124,'Class Rates'!$M$9:$M$139,0),)","v":729.50671087960427},null,"Mangatarere",null,"D",{"$f":"INDEX('Class Rates'!$E$9:$E$139,MATCH(G124&I124,'Class Rates'!$M$9:$M$139,0),)","v":24.831837978318099},null,{"$f":"INDEX('Class Rates'!$F$9:$F$139,MATCH(G124&I124,'Class Rates'!$M$9:$M$139,0),)","v":1783.8993748919897}]
["Upper Ruamahanga","C",{"$f":"INDEX('Class Rates'!$E$9:$E$139,MATCH(A125&B125,'Class Rates'!$M$9:$M$139,0),)","v":88.517149844535638},null,{"$f":"INDEX('Class Rates'!$F$9:$F$139,MATCH(A125&B125,'Class Rates'!$M$9:$M$139,0),)","v":11043.781131309606},null,null,null,null,null,null,{"$f":"SUM(L121:L124)","v":9906.9995174453652}]
["Upper Ruamahanga","D",{"$f":"INDEX('Class Rates'!$E$9:$E$139,MATCH(A126&B126,'Class Rates'!$M$9:$M$139,0),)","v":66.387862383401725},null,{"$f":"INDEX('Class Rates'!$F$9:$F$139,MATCH(A126&B126,'Class Rates'!$M$9:$M$139,0),)","v":1169.435473456098},null,{"$f":"'Class Rates'!A52","v":"Waipoua"},null,"A",{"$f":"INDEX('Class Rates'!$E$9:$E$139,MATCH(G126&I126,'Class Rates'!$M$9:$M$139,0),)","v":111.47839521806316},null,{"$f":"INDEX('Class Rates'!$F$9:$F$139,MATCH(G126&I126,'Class Rates'!$M$9:$M$139,0),)","v":9754.1812161481757}]
["Upper Ruamahanga","E",{"$f":"INDEX('Class Rates'!$E$9:$E$139,MATCH(A127&B127,'Class Rates'!$M$9:$M$139,0),)","v":44.258574922267819},null,{"$f":"INDEX('Class Rates'!$F$9:$F$139,MATCH(A127&B127,'Class Rates'!$M$9:$M$139,0),)","v":13130.681138894855},null,{"$f":"G126","v":"Waipoua"},null,"B",{"$f":"INDEX('Class Rates'!$E$9:$E$139,MATCH(G127&I127,'Class Rates'!$M$9:$M$139,0),)","v":89.182716174450519},null,{"$f":"INDEX('Class Rates'!$F$9:$F$139,MATCH(G127&I127,'Class Rates'!$M$9:$M$139,0),)","v":26784.191639043016}]
["Upper Ruamahanga","F",{"$f":"INDEX('Class Rates'!$E$9:$E$139,MATCH(A128&B128,'Class Rates'!$M$9:$M$139,0),)","v":22.129287461133909},null,{"$f":"INDEX('Class Rates'!$F$9:$F$139,MATCH(A128&B128,'Class Rates'!$M$9:$M$139,0),)","v":872.40436925265033},null,"Waipoua",null,"C",{"$f":"INDEX('Class Rates'!$E$9:$E$139,MATCH(G128&I128,'Class Rates'!$M$9:$M$139,0),)","v":66.887037130837882},null,{"$f":"INDEX('Class Rates'!$F$9:$F$139,MATCH(G128&I128,'Class Rates'!$M$9:$M$139,0),)","v":1501.7276915504331}]
["Upper Ruamahanga","S",{"$f":"INDEX('Class Rates'!$E$9:$E$139,MATCH(A129&B129,'Class Rates'!$M$9:$M$139,0),)","v":1246.7748575107094},null,{"$f":"INDEX('Class Rates'!$F$9:$F$139,MATCH(A129&B129,'Class Rates'!$M$9:$M$139,0),)","v":3241.6146295278454},null,"Waipoua",null,"D",{"$f":"INDEX('Class Rates'!$E$9:$E$139,MATCH(G129&I129,'Class Rates'!$M$9:$M$139,0),)","v":44.59135808722526},null,{"$f":"INDEX('Class Rates'!$F$9:$F$139,MATCH(G129&I129,'Class Rates'!$M$9:$M$139,0),)","v":13253.916119080815}]
[null,null,null,null,{"$f":"SUM(E123:E129)","v":42007.000000000022},null,"Waipoua",null,"SA",{"$f":"INDEX('Class Rates'!$E$9:$E$139,MATCH(G130&I130,'Class Rates'!$M$9:$M$139,0),)","v":3767.9697583705342},null,{"$f":"INDEX('Class Rates'!$F$9:$F$139,MATCH(G130&I130,'Class Rates'!$M$9:$M$139,0),)","v":376.79697583705342}]
["Middle Ruamahanga","A",{"$f":"INDEX('Class Rates'!$E$9:$E$139,MATCH(A131&B131,'Class Rates'!$M$9:$M$139,0),)","v":130.9622033006674},null,{"$f":"INDEX('Class Rates'!$F$9:$F$139,MATCH(A131&B131,'Class Rates'!$M$9:$M$139,0),)","v":5283.1667484972813},null,"Waipoua",null,"SC",{"$f":"INDEX('Class Rates'!$E$9:$E$139,MATCH(G131&I131,'Class Rates'!$M$9:$M$139,0),)","v":2251.8635834048755},null,{"$f":"INDEX('Class Rates'!$F$9:$F$139,MATCH(G131&I131,'Class Rates'!$M$9:$M$139,0),)","v":225.18635834048757}]
[{"$f":"A131","v":"Middle Ruamahanga"},"B",{"$f":"INDEX('Class Rates'!$E$9:$E$139,MATCH(A132&B132,'Class Rates'!$M$9:$M$139,0),)","v":109.13516941722281},null,{"$f":"INDEX('Class Rates'!$F$9:$F$139,MATCH(A132&B132,'Class Rates'!$M$9:$M$139,0),)","v":5956.5527318534587},null,null,null,null,null,null,{"$f":"SUM(L126:L131)","v":51895.999999999978}]
["Middle Ruamahanga","C",{"$f":"INDEX('Class Rates'!$E$9:$E$139,MATCH(A133&B133,'Class Rates'!$M$9:$M$139,0),)","v":87.308135533778255},null,{"$f":"INDEX('Class Rates'!$F$9:$F$139,MATCH(A133&B133,'Class Rates'!$M$9:$M$139,0),)","v":446.43268942486833}]
["Middle Ruamahanga","D",{"$f":"INDEX('Class Rates'!$E$9:$E$139,MATCH(A134&B134,'Class Rates'!$M$9:$M$139,0),)","v":65.481101650333699},null,{"$f":"INDEX('Class Rates'!$F$9:$F$139,MATCH(A134&B134,'Class Rates'!$M$9:$M$139,0),)","v":7412.9898756430821}]
["Middle Ruamahanga","E",{"$f":"INDEX('Class Rates'!$E$9:$E$139,MATCH(A135&B135,'Class Rates'!$M$9:$M$139,0),)","v":43.654067766889128},null,{"$f":"INDEX('Class Rates'!$F$9:$F$139,MATCH(A135&B135,'Class Rates'!$M$9:$M$139,0),)","v":1316.3534902563281}]
["Middle Ruamahanga","F",{"$f":"INDEX('Class Rates'!$E$9:$E$139,MATCH(A136&B136,'Class Rates'!$M$9:$M$139,0),)","v":21.827033883444564},null,{"$f":"INDEX('Class Rates'!$F$9:$F$139,MATCH(A136&B136,'Class Rates'!$M$9:$M$139,0),)","v":6452.9734893659961}]
["Middle Ruamahanga","S",{"$f":"INDEX('Class Rates'!$E$9:$E$139,MATCH(A137&B137,'Class Rates'!$M$9:$M$139,0),)","v":1320.729035694756},null,{"$f":"INDEX('Class Rates'!$F$9:$F$139,MATCH(A137&B137,'Class Rates'!$M$9:$M$139,0),)","v":2773.5309749589878}]
[null,null,null,null,{"$f":"SUM(E131:E137)","v":29642.000000000004}]
["Lower Ruamahanga","A",{"$f":"INDEX('Class Rates'!$E$9:$E$139,MATCH(A139&B139,'Class Rates'!$M$9:$M$139,0),)","v":63.010582513684838},null,{"$f":"INDEX('Class Rates'!$F$9:$F$139,MATCH(A139&B139,'Class Rates'!$M$9:$M$139,0),)","v":7906.1665794171458}]
[{"$f":"A139","v":"Lower Ruamahanga"},"B",{"$f":"INDEX('Class Rates'!$E$9:$E$139,MATCH(A140&B140,'Class Rates'!$M$9:$M$139,0),)","v":54.009070726015572},null,{"$f":"INDEX('Class Rates'!$F$9:$F$139,MATCH(A140&B140,'Class Rates'!$M$9:$M$139,0),)","v":2907.3676871592165}]
["Lower Ruamahanga","C",{"$f":"INDEX('Class Rates'!$E$9:$E$139,MATCH(A141&B141,'Class Rates'!$M$9:$M$139,0),)","v":45.007558938346307},null,{"$f":"INDEX('Class Rates'!$F$9:$F$139,MATCH(A141&B141,'Class Rates'!$M$9:$M$139,0),)","v":10080.649026822206}]
["Lower Ruamahanga","D",{"$f":"INDEX('Class Rates'!$E$9:$E$139,MATCH(A142&B142,'Class Rates'!$M$9:$M$139,0),)","v":36.006047150677048},null,{"$f":"INDEX('Class Rates'!$F$9:$F$139,MATCH(A142&B142,'Class Rates'!$M$9:$M$139,0),)","v":11468.354489451733}]
["Lower Ruamahanga","E",{"$f":"INDEX('Class Rates'!$E$9:$E$139,MATCH(A143&B143,'Class Rates'!$M$9:$M$139,0),)","v":27.004535363007786},null,{"$f":"INDEX('Class Rates'!$F$9:$F$139,MATCH(A143&B143,'Class Rates'!$M$9:$M$139,0),)","v":8736.6138675413567}]
["Lower Ruamahanga","F",{"$f":"INDEX('Class Rates'!$E$9:$E$139,MATCH(A144&B144,'Class Rates'!$M$9:$M$139,0),)","v":18.003023575338524},null,{"$f":"INDEX('Class Rates'!$F$9:$F$139,MATCH(A144&B144,'Class Rates'!$M$9:$M$139,0),)","v":22040.946937284196}]
["Lower Ruamahanga","SA",{"$f":"INDEX('Class Rates'!$E$9:$E$139,MATCH(A145&B145,'Class Rates'!$M$9:$M$139,0),)","v":1579.9713699813096},null,{"$f":"INDEX('Class Rates'!$F$9:$F$139,MATCH(A145&B145,'Class Rates'!$M$9:$M$139,0),)","v":4107.925561951407}]
["Lower Ruamahanga","SB",{"$f":"INDEX('Class Rates'!$E$9:$E$139,MATCH(A146&B146,'Class Rates'!$M$9:$M$139,0),)","v":789.98579433688678},null,{"$f":"INDEX('Class Rates'!$F$9:$F$139,MATCH(A146&B146,'Class Rates'!$M$9:$M$139,0),)","v":1342.9758503727078}]
[null,null,null,null,{"$f":"SUM(E139:E146)","v":68590.999999999956}]
[]
[{"$f":"+G102","v":"All figures on this page exclude GST."}]
[]
[]
[]
[]
[]
[]
["Targeted rate\nRiver management schemes 1",null,{"$f":"year_current","v":"2018/19"},null,{"$f":"year_current","v":"2018/19"},null,"Targeted rate \nRiver management schemes 2",null,{"$f":"year_current","v":"2018/19"},{"$f":"year_current","v":"2018/19"},null,{"$f":"year_current","v":"2018/19"}]
[null,null,{"$f":"+$C$112","v":"$ per hectare"},null,"Revenue required\n $",null,null,null,"$ per \ndwelling","$ per point",null,"Revenue required\n $"]
[]
["Kopuaranga","A2",{"$f":"INDEX('Class Rates'!$E$9:$E$139,MATCH(A159&B159,'Class Rates'!$M$9:$M$139,0),)","v":122.7145},null,{"$f":"INDEX('Class Rates'!$F$9:$F$139,MATCH(A159&B159,'Class Rates'!$M$9:$M$139,0),)","v":3197.203583},null,"Lower Wairarapa valley Development Scheme","A",null,{"$f":"INDEX('Class Rates'!$E$9:$E$139,MATCH(G159&H159,'Class Rates'!$M$9:$M$139,0),)","v":0.2341872774},null,{"$f":"INDEX('Class Rates'!$F$9:$F$139,MATCH(G159&H159,'Class Rates'!$M$9:$M$139,0),)","v":676524.10774034355}]
[{"$f":"A159","v":"Kopuaranga"},"A3",{"$f":"INDEX('Class Rates'!$E$9:$E$139,MATCH(A160&B160,'Class Rates'!$M$9:$M$139,0),)","v":110.5441},null,{"$f":"INDEX('Class Rates'!$F$9:$F$139,MATCH(A160&B160,'Class Rates'!$M$9:$M$139,0),)","v":7616.8753943500005},null,null,"Sa",{"$f":"INDEX('Class Rates'!$E$9:$E$139,MATCH(G159&H160,'Class Rates'!$M$9:$M$139,0),)","v":18.802472939999998},null,null,{"$f":"INDEX('Class Rates'!$F$9:$F$139,MATCH(G159&H160,'Class Rates'!$M$9:$M$139,0),)","v":7840.6312159799991}]
["Kopuaranga","A4",{"$f":"INDEX('Class Rates'!$E$9:$E$139,MATCH(A161&B161,'Class Rates'!$M$9:$M$139,0),)","v":61.458300000000001},null,{"$f":"INDEX('Class Rates'!$F$9:$F$139,MATCH(A161&B161,'Class Rates'!$M$9:$M$139,0),)","v":693.53847800999995},null,{"$f":"G159","v":"Lower Wairarapa valley Development Scheme"},"Sb",{"$f":"INDEX('Class Rates'!$E$9:$E$139,MATCH(G161&H161,'Class Rates'!$M$9:$M$139,0),)","v":37.6193034},null,null,{"$f":"INDEX('Class Rates'!$F$9:$F$139,MATCH(G161&H161,'Class Rates'!$M$9:$M$139,0),)","v":85094.864290800004}]
["Kopuaranga","A5",{"$f":"INDEX('Class Rates'!$E$9:$E$139,MATCH(A162&B162,'Class Rates'!$M$9:$M$139,0),)","v":42.950899999999997},null,{"$f":"INDEX('Class Rates'!$F$9:$F$139,MATCH(A162&B162,'Class Rates'!$M$9:$M$139,0),)","v":2479.2977516000001},null,"Total river management scheme rates 2",null,null,null,null,{"$f":"SUM(L159:L161)","v":769459.60324712354}]
["Kopuaranga","A6",{"$f":"INDEX('Class Rates'!$E$9:$E$139,MATCH(A163&B163,'Class Rates'!$M$9:$M$139,0),)","v":24.543900000000001},null,{"$f":"INDEX('Class Rates'!$F$9:$F$139,MATCH(A163&B163,'Class Rates'!$M$9:$M$139,0),)","v":1991.2711509000001}]
["Kopuaranga","B2",{"$f":"INDEX('Class Rates'!$E$9:$E$139,MATCH(A164&B164,'Class Rates'!$M$9:$M$139,0),)","v":24.543900000000001},null,{"$f":"INDEX('Class Rates'!$F$9:$F$139,MATCH(A164&B164,'Class Rates'!$M$9:$M$139,0),)","v":1503.97901469},null,"Total river management scheme rates",null,null,null,null,{"$f":"+E186+L162","v":1132982.1844111388}]
["Kopuaranga","B3",{"$f":"INDEX('Class Rates'!$E$9:$E$139,MATCH(A165&B165,'Class Rates'!$M$9:$M$139,0),)","v":22.089600000000001},null,{"$f":"INDEX('Class Rates'!$F$9:$F$139,MATCH(A165&B165,'Class Rates'!$M$9:$M$139,0),)","v":1622.2889404800001}]
["Kopuaranga","B4",{"$f":"INDEX('Class Rates'!$E$9:$E$139,MATCH(A166&B166,'Class Rates'!$M$9:$M$139,0),)","v":12.272500000000001},null,{"$f":"INDEX('Class Rates'!$F$9:$F$139,MATCH(A166&B166,'Class Rates'!$M$9:$M$139,0),)","v":113.87898200000001},null,null,null,null,null,null,{"$f":"E122+E130+E138+E147+E171+E176+E183+L120+L125+L132+L162","v":1132982.1844111388}]
["Kopuaranga","B5",{"$f":"INDEX('Class Rates'!$E$9:$E$139,MATCH(A167&B167,'Class Rates'!$M$9:$M$139,0),)","v":8.5909999999999993},null,{"$f":"INDEX('Class Rates'!$F$9:$F$139,MATCH(A167&B167,'Class Rates'!$M$9:$M$139,0),)","v":266.91377899999998}]
["Kopuaranga","B6",{"$f":"INDEX('Class Rates'!$E$9:$E$139,MATCH(A168&B168,'Class Rates'!$M$9:$M$139,0),)","v":4.9093999999999998},null,{"$f":"INDEX('Class Rates'!$F$9:$F$139,MATCH(A168&B168,'Class Rates'!$M$9:$M$139,0),)","v":590.42457253999987}]
["Kopuaranga","SA",{"$f":"INDEX('Class Rates'!$E$9:$E$139,MATCH(A169&B169,'Class Rates'!$M$9:$M$139,0),)","v":153.57},null,{"$f":"INDEX('Class Rates'!$F$9:$F$139,MATCH(A169&B169,'Class Rates'!$M$9:$M$139,0),)","v":767.84999999999991}]
["Kopuaranga","SB",{"$f":"INDEX('Class Rates'!$E$9:$E$139,MATCH(A170&B170,'Class Rates'!$M$9:$M$139,0),)","v":76.790000000000006},null,{"$f":"INDEX('Class Rates'!$F$9:$F$139,MATCH(A170&B170,'Class Rates'!$M$9:$M$139,0),)","v":1075.0600000000002}]
[null,null,null,null,{"$f":"SUM(E159:E170)","v":21918.581646569997}]
["Lower Taueru","A",{"$f":"INDEX('Class Rates'!$E$9:$E$139,MATCH(A172&B172,'Class Rates'!$M$9:$M$139,0),)","v":4.0587685087116778},null,{"$f":"INDEX('Class Rates'!$F$9:$F$139,MATCH(A172&B172,'Class Rates'!$M$9:$M$139,0),)","v":1653.6785433079754}]
[{"$f":"A172","v":"Lower Taueru"},"B",{"$f":"INDEX('Class Rates'!$E$9:$E$139,MATCH(A173&B173,'Class Rates'!$M$9:$M$139,0),)","v":0.81175370174233563},null,{"$f":"INDEX('Class Rates'!$F$9:$F$139,MATCH(A173&B173,'Class Rates'!$M$9:$M$139,0),)","v":228.94946066506537}]
["Lower Taueru","C",{"$f":"INDEX('Class Rates'!$E$9:$E$139,MATCH(A174&B174,'Class Rates'!$M$9:$M$139,0),)","v":0.40587685087116782},null,{"$f":"INDEX('Class Rates'!$F$9:$F$139,MATCH(A174&B174,'Class Rates'!$M$9:$M$139,0),)","v":72.311466215743224}]
["Lower Taueru","S",{"$f":"INDEX('Class Rates'!$E$9:$E$139,MATCH(A175&B175,'Class Rates'!$M$9:$M$139,0),)","v":202.93842543558389},null,{"$f":"INDEX('Class Rates'!$F$9:$F$139,MATCH(A175&B175,'Class Rates'!$M$9:$M$139,0),)","v":308.06052981121627}]
[null,null,null,null,{"$f":"SUM(E172:E175)","v":2263}]
["Lower Whangaehu","A",{"$f":"INDEX('Class Rates'!$E$9:$E$139,MATCH(A177&B177,'Class Rates'!$M$9:$M$139,0),)","v":21.623069428869243},null,{"$f":"INDEX('Class Rates'!$F$9:$F$139,MATCH(A177&B177,'Class Rates'!$M$9:$M$139,0),)","v":721.99645053688687}]
[{"$f":"A177","v":"Lower Whangaehu"},"B",{"$f":"INDEX('Class Rates'!$E$9:$E$139,MATCH(A178&B178,'Class Rates'!$M$9:$M$139,0),)","v":17.298455543095393},null,{"$f":"INDEX('Class Rates'!$F$9:$F$139,MATCH(A178&B178,'Class Rates'!$M$9:$M$139,0),)","v":1125.8353821112773}]
["Lower Whangaehu","C",{"$f":"INDEX('Class Rates'!$E$9:$E$139,MATCH(A179&B179,'Class Rates'!$M$9:$M$139,0),)","v":12.973841657321547},null,{"$f":"INDEX('Class Rates'!$F$9:$F$139,MATCH(A179&B179,'Class Rates'!$M$9:$M$139,0),)","v":705.83666582991577}]
["Lower Whangaehu","D",{"$f":"INDEX('Class Rates'!$E$9:$E$139,MATCH(A180&B180,'Class Rates'!$M$9:$M$139,0),)","v":8.6492277715476966},null,{"$f":"INDEX('Class Rates'!$F$9:$F$139,MATCH(A180&B180,'Class Rates'!$M$9:$M$139,0),)","v":662.2609913940812}]
["Lower Whangaehu","E",{"$f":"INDEX('Class Rates'!$E$9:$E$139,MATCH(A181&B181,'Class Rates'!$M$9:$M$139,0),)","v":4.3246138857738483},null,{"$f":"INDEX('Class Rates'!$F$9:$F$139,MATCH(A181&B181,'Class Rates'!$M$9:$M$139,0),)","v":753.53110253056116}]
["Lower Whangaehu","S",{"$f":"INDEX('Class Rates'!$E$9:$E$139,MATCH(A182&B182,'Class Rates'!$M$9:$M$139,0),)","v":108.11534714434622},null,{"$f":"INDEX('Class Rates'!$F$9:$F$139,MATCH(A182&B182,'Class Rates'!$M$9:$M$139,0),)","v":144.53940759727647}]
[null,null,null,null,{"$f":"SUM(E177:E182)","v":4113.9999999999982}]
[]
[]
["Total river management scheme rates 1",null,null,null,{"$f":"+E183+E176+L132+L125+L120+E147+E138+E130+E122+E171","v":363522.58116401528}]
[]
[]
["1  \"Separately used or inhabited part\" (dwelling) includes any part of a rating unit separately used or inhabited by the owner or any other person who has the right to use or inhabit that part by virtue of a tenancy, lease, licence or other agreement. At a minimum, the land or premises intended to form the separately used or inhabited part of the rating unit must be capable of actual habitation, or actual separate use. To avoid doubt, a rating unit that has only one use (ie, it does not have separate parts or is vacant land) is treated as being one separately used or inhabited part (dwelling)."]
[]
[{"$f":"+A149","v":"All figures on this page exclude GST."}]
[]
[null,null,null,null,null,null,null,null,null,null,null,"Rates funding impact statement"]
[]
["Targeted rate\nCatchment schemes 1",null,{"$f":"year_current","v":"2018/19"},null,{"$f":"year_current","v":"2018/19"},null,"Targeted rate\nCatchment schemes 2",null,null,{"$f":"year_current","v":"2018/19"},null,{"$f":"year_current","v":"2018/19"}]
[null,null,{"$f":"+$C$157","v":"$ per hectare"},null,"Revenue required\n $",null,null,null,null,"Cents per $ of rateable land value",null,"Revenue required\n $"]
[]
["Whareama","A",{"$f":"INDEX('Class Rates'!$E$9:$E$139,MATCH(A198&B198,'Class Rates'!$M$9:$M$139,0),)","v":4.4592049999999999},null,{"$f":"INDEX('Class Rates'!$F$9:$F$139,MATCH(A198&B198,'Class Rates'!$M$9:$M$139,0),)","v":3190.0529940230949},null,"Awhea-Opouawe","Land value",null,{"$f":"'Class Rates'!K147","v":1.5526603122141235E-4},null,{"$f":"'Class Rates'!H147","v":10523}]
[{"$f":"A198","v":"Whareama"},"B",{"$f":"INDEX('Class Rates'!$E$9:$E$139,MATCH(A199&B199,'Class Rates'!$M$9:$M$139,0),)","v":1.718925},null,{"$f":"INDEX('Class Rates'!$F$9:$F$139,MATCH(A199&B199,'Class Rates'!$M$9:$M$139,0),)","v":1637.3876898023741},null,"Mataikona-Whakataki","Land value within scheme area",null,{"$f":"'Class Rates'!K152","v":5.2348966158448263E-5},null,{"$f":"'Class Rates'!H151","v":3885}]
["Whareama","C",{"$f":"INDEX('Class Rates'!$E$9:$E$139,MATCH(A200&B200,'Class Rates'!$M$9:$M$139,0),)","v":0.3008538},null,{"$f":"INDEX('Class Rates'!$F$9:$F$139,MATCH(A200&B200,'Class Rates'!$M$9:$M$139,0),)","v":13711.448046429548},null,"Catchment management scheme 2 rates",null,null,null,null,{"$f":"+L198+L199","v":14408}]
["Whareama","D",{"$f":"INDEX('Class Rates'!$E$9:$E$139,MATCH(A201&B201,'Class Rates'!$M$9:$M$139,0),)","v":0.25781080000000001},null,{"$f":"INDEX('Class Rates'!$F$9:$F$139,MATCH(A201&B201,'Class Rates'!$M$9:$M$139,0),)","v":0}]
["Whareama","E",{"$f":"INDEX('Class Rates'!$E$9:$E$139,MATCH(A202&B202,'Class Rates'!$M$9:$M$139,0),)","v":0.2148796},null,{"$f":"INDEX('Class Rates'!$F$9:$F$139,MATCH(A202&B202,'Class Rates'!$M$9:$M$139,0),)","v":3.3096830389999998},null,"Targeted rate\nCatchment schemes 3",null,null,{"$f":"+J195","v":"2018/19"},null,{"$f":"+L195","v":"2018/19"}]
["Whareama","F",{"$f":"INDEX('Class Rates'!$E$9:$E$139,MATCH(A203&B203,'Class Rates'!$M$9:$M$139,0),)","v":0.17183660000000001},null,{"$f":"INDEX('Class Rates'!$F$9:$F$139,MATCH(A203&B203,'Class Rates'!$M$9:$M$139,0),)","v":474.18043811240744},null,null,null,null,"$ per \ndwelling",null,"Revenue required\n $"]
[null,null,null,null,{"$f":"SUM(E198:E203)","v":19016.378851406422}]
["Homewood","A",{"$f":"INDEX('Class Rates'!$E$9:$E$139,MATCH(A205&B205,'Class Rates'!$M$9:$M$139,0),)","v":1.97},null,{"$f":"INDEX('Class Rates'!$F$9:$F$139,MATCH(A205&B205,'Class Rates'!$M$9:$M$139,0),)","v":4520.6251388100009}]
[{"$f":"A205","v":"Homewood"},"B",{"$f":"INDEX('Class Rates'!$E$9:$E$139,MATCH(A206&B206,'Class Rates'!$M$9:$M$139,0),)","v":1.71061},null,{"$f":"INDEX('Class Rates'!$F$9:$F$139,MATCH(A206&B206,'Class Rates'!$M$9:$M$139,0),)","v":944.99595155844975},null,"Awhea-Opouawe","Charge per dwelling",null,{"$f":"'Class Rates'!F148","v":"$114.54 / $57.27"},null,{"$f":"'Class Rates'!H148","v":11820.7}]
["Homewood","C",{"$f":"INDEX('Class Rates'!$E$9:$E$139,MATCH(A207&B207,'Class Rates'!$M$9:$M$139,0),)","v":1.5598000000000001},null,{"$f":"INDEX('Class Rates'!$F$9:$F$139,MATCH(A207&B207,'Class Rates'!$M$9:$M$139,0),)","v":5712.7267611436009},null,"Maungaraki","Charge per dwelling",null,{"$f":"'Class Rates'!F157","v":22.18},null,{"$f":"'Class Rates'!H157","v":421.42}]
["Homewood","D",{"$f":"INDEX('Class Rates'!$E$9:$E$139,MATCH(A208&B208,'Class Rates'!$M$9:$M$139,0),)","v":0.223},null,{"$f":"INDEX('Class Rates'!$F$9:$F$139,MATCH(A208&B208,'Class Rates'!$M$9:$M$139,0),)","v":387.88476428727557},null,"Mataikona-Whakataki","Charge per dwelling",null,{"$f":"'Class Rates'!F152","v":15.3},null,{"$f":"'Class Rates'!H152","v":2668.14}]
[null,null,null,null,{"$f":"SUM(E205:E208)","v":11566.232615799327},null,"Catchment management scheme 3 rates",null,null,null,null,{"$f":"+L206+L208+L207","v":14910.26}]
["Maungaraki","A",{"$f":"'Class Rates'!F155","v":0.99},null,{"$f":"'Class Rates'!H155","v":3272.4170819999999}]
[{"$f":"A210","v":"Maungaraki"},"B",{"$f":"'Class Rates'!F156","v":0.49},null,{"$f":"'Class Rates'!H156","v":1455.896281}]
[null,null,null,null,{"$f":"SUM(E210:E211)","v":4728.3133630000002},null,"Targeted rate\nCatchment schemes 4",null,null,{"$f":"+$C$26","v":"2018/19"},null,{"$f":"+$C$26","v":"2018/19"}]
["Upper Kaiwhata","A",{"$f":"INDEX('Class Rates'!$E$9:$E$139,MATCH(A213&B213,'Class Rates'!$M$9:$M$139,0),)","v":9.8000000000000007},null,{"$f":"INDEX('Class Rates'!$F$9:$F$139,MATCH(A213&B213,'Class Rates'!$M$9:$M$139,0),)","v":319.61818000000005},null,null,null,null,"Cents per metre of river frontage",null,"Revenue required\n $"]
[{"$f":"A213","v":"Upper Kaiwhata"},"B",{"$f":"INDEX('Class Rates'!$E$9:$E$139,MATCH(A214&B214,'Class Rates'!$M$9:$M$139,0),)","v":4.2},null,{"$f":"INDEX('Class Rates'!$F$9:$F$139,MATCH(A214&B214,'Class Rates'!$M$9:$M$139,0),)","v":220.95276000000001}]
["Upper Kaiwhata","C",{"$f":"INDEX('Class Rates'!$E$9:$E$139,MATCH(A215&B215,'Class Rates'!$M$9:$M$139,0),)","v":0.62},null,{"$f":"INDEX('Class Rates'!$F$9:$F$139,MATCH(A215&B215,'Class Rates'!$M$9:$M$139,0),)","v":594.07941199999993}]
["Upper Kaiwhata","D",{"$f":"INDEX('Class Rates'!$E$9:$E$139,MATCH(A216&B216,'Class Rates'!$M$9:$M$139,0),)","v":0.39},null,{"$f":"INDEX('Class Rates'!$F$9:$F$139,MATCH(A216&B216,'Class Rates'!$M$9:$M$139,0),)","v":800.54469300000005}]
["Upper Kaiwhata","E",{"$f":"INDEX('Class Rates'!$E$9:$E$139,MATCH(A217&B217,'Class Rates'!$M$9:$M$139,0),)","v":0.27},null,{"$f":"INDEX('Class Rates'!$F$9:$F$139,MATCH(A217&B217,'Class Rates'!$M$9:$M$139,0),)","v":443.12993999999998},null,"Maungaraki","River frontage",null,{"$f":"'Class Rates'!F158","v":3.5400000000000001E-2},null,{"$f":"'Class Rates'!H158","v":1685.7126000000001}]
["Upper Kaiwhata","F",{"$f":"INDEX('Class Rates'!$E$9:$E$139,MATCH(A218&B218,'Class Rates'!$M$9:$M$139,0),)","v":0.14499999999999999},null,{"$f":"INDEX('Class Rates'!$F$9:$F$139,MATCH(A218&B218,'Class Rates'!$M$9:$M$139,0),)","v":65.600319999999996},null,"Catchment management scheme 4 rates",null,null,null,null,{"$f":"L217","v":1685.7126000000001}]
[null,null,null,null,{"$f":"SUM(E213:E218)","v":2443.9253050000002},null,"Total catchment management scheme rates",null,null,null,null,{"$f":"E228+L200+L209+L218","v":72961.811306969743}]
["Lower Kaiwhata","A",{"$f":"INDEX('Class Rates'!$E$9:$E$139,MATCH(A220&B220,'Class Rates'!$M$9:$M$139,0),)","v":16.190000000000001},null,{"$f":"INDEX('Class Rates'!$F$9:$F$139,MATCH(A220&B220,'Class Rates'!$M$9:$M$139,0),)","v":743.61965200000009}]
[{"$f":"A220","v":"Lower Kaiwhata"},"B",{"$f":"INDEX('Class Rates'!$E$9:$E$139,MATCH(A221&B221,'Class Rates'!$M$9:$M$139,0),)","v":7.1},null,{"$f":"INDEX('Class Rates'!$F$9:$F$139,MATCH(A221&B221,'Class Rates'!$M$9:$M$139,0),)","v":315.28827999999999},null,"\n1 \"Separately used or inhabited part\" (dwelling) includes any part of a rating unit separately used or inhabited by the owner or any other person who has the right to use or inhabit that part by virtue of a tenancy, lease, licence or other agreement. At a minimum, the land or premises intended to form the separately used or inhabited part of the rating unit must be capable of actual habitation, or actual separate use. To avoid of doubt, a rating unit that has only one use (ie, it does not have separate parts or is vacant land) is treated as being one separately used or inhabited part (dwelling)."]
["Lower Kaiwhata","C",{"$f":"INDEX('Class Rates'!$E$9:$E$139,MATCH(A222&B222,'Class Rates'!$M$9:$M$139,0),)","v":1.01901},null,{"$f":"INDEX('Class Rates'!$F$9:$F$139,MATCH(A222&B222,'Class Rates'!$M$9:$M$139,0),)","v":1180.6666635089998}]
["Lower Kaiwhata","D",{"$f":"INDEX('Class Rates'!$E$9:$E$139,MATCH(A223&B223,'Class Rates'!$M$9:$M$139,0),)","v":0.638575},null,{"$f":"INDEX('Class Rates'!$F$9:$F$139,MATCH(A223&B223,'Class Rates'!$M$9:$M$139,0),)","v":1889.6335917899996}]
["Lower Kaiwhata","E",{"$f":"INDEX('Class Rates'!$E$9:$E$139,MATCH(A224&B224,'Class Rates'!$M$9:$M$139,0),)","v":0},null,{"$f":"INDEX('Class Rates'!$F$9:$F$139,MATCH(A224&B224,'Class Rates'!$M$9:$M$139,0),)","v":0}]
["Lower Kaiwhata","F",{"$f":"INDEX('Class Rates'!$E$9:$E$139,MATCH(A225&B225,'Class Rates'!$M$9:$M$139,0),)","v":0.21182500000000001},null,{"$f":"INDEX('Class Rates'!$F$9:$F$139,MATCH(A225&B225,'Class Rates'!$M$9:$M$139,0),)","v":73.780384464999997}]
[null,null,null,null,{"$f":"SUM(E220:E225)","v":4202.9885717639991}]
[]
["Catchment management scheme 1 rates",null,null,null,{"$f":"+E226+E219+E212+E209+E204","v":41957.838706969749}]
[]
[{"$f":"+A149","v":"All figures on this page exclude GST."}]
[]
[null,null,null,null,null,null,null,null,null,null,null,"Rates funding impact statement"]
[]
["Targeted rate\nPump drainage schemes",null,{"$f":"year_current","v":"2018/19"},null,{"$f":"year_current","v":"2018/19"},null,"Targeted rate\nGravity drainage schemes",null,null,{"$f":"year_current","v":"2018/19"},null,{"$f":"year_current","v":"2018/19"}]
[null,null,{"$f":"+$C$112","v":"$ per hectare"},null,"Revenue required\n $",null,null,null,null,{"$f":"+$C$112","v":"$ per hectare"},null,"Revenue required\n $"]
[]
["Te Hopai","A",{"$f":"INDEX('Class Rates'!$E$9:$E$139,MATCH(A237&B237,'Class Rates'!$M$9:$M$139,0),)","v":44.280099999999997},null,{"$f":"INDEX('Class Rates'!$F$9:$F$139,MATCH(A237&B237,'Class Rates'!$M$9:$M$139,0),)","v":55200.337094610499},null,"Okawa","A",null,{"$f":"INDEX('Class Rates'!$E$9:$E$139,MATCH(G237&H237,'Class Rates'!$M$9:$M$139,0),)","v":7.0071000000000003},null,{"$f":"INDEX('Class Rates'!$F$9:$F$139,MATCH(G237&H237,'Class Rates'!$M$9:$M$139,0),)","v":1976.0096299603995}]
["Moonmoot pump","A",{"$f":"INDEX('Class Rates'!$E$9:$E$139,MATCH(A238&B238,'Class Rates'!$M$9:$M$139,0),)","v":130.42169999999999},null,{"$f":"INDEX('Class Rates'!$F$9:$F$139,MATCH(A238&B238,'Class Rates'!$M$9:$M$139,0),)","v":29699.992748434499},null,"Taumata","A",null,{"$f":"INDEX('Class Rates'!$E$9:$E$139,MATCH(G238&H238,'Class Rates'!$M$9:$M$139,0),)","v":6.3118999999999996},null,{"$f":"INDEX('Class Rates'!$F$9:$F$139,MATCH(G238&H238,'Class Rates'!$M$9:$M$139,0),)","v":1834.00270613}]
["Onoke pump","A",{"$f":"INDEX('Class Rates'!$E$9:$E$139,MATCH(A239&B239,'Class Rates'!$M$9:$M$139,0),)","v":72.511700000000005},null,{"$f":"INDEX('Class Rates'!$F$9:$F$139,MATCH(A239&B239,'Class Rates'!$M$9:$M$139,0),)","v":51731.844477335013},null,"East Pukio","A",null,{"$f":"INDEX('Class Rates'!$E$9:$E$139,MATCH(G239&H239,'Class Rates'!$M$9:$M$139,0),)","v":27.740300000000001},null,{"$f":"INDEX('Class Rates'!$F$9:$F$139,MATCH(G239&H239,'Class Rates'!$M$9:$M$139,0),)","v":3149.9981721148642}]
["Pouawha pump","A",{"$f":"INDEX('Class Rates'!$E$9:$E$139,MATCH(A240&B240,'Class Rates'!$M$9:$M$139,0),)","v":109.3922},null,{"$f":"INDEX('Class Rates'!$F$9:$F$139,MATCH(A240&B240,'Class Rates'!$M$9:$M$139,0),)","v":103430.3515729124},null,"Longbush","A",null,{"$f":"INDEX('Class Rates'!$E$9:$E$139,MATCH(G240&H240,'Class Rates'!$M$9:$M$139,0),)","v":15.7545},null,{"$f":"INDEX('Class Rates'!$F$9:$F$139,MATCH(G240&H240,'Class Rates'!$M$9:$M$139,0),)","v":3436.7862197985924}]
[null,null,null,null,null,null,{"$f":"G240","v":"Longbush"},"B",null,{"$f":"INDEX('Class Rates'!$E$9:$E$139,MATCH(G241&H241,'Class Rates'!$M$9:$M$139,0),)","v":7.8773},null,{"$f":"INDEX('Class Rates'!$F$9:$F$139,MATCH(G241&H241,'Class Rates'!$M$9:$M$139,0),)","v":990.21123368562257}]
["Total pump drainage scheme rates",null,null,null,{"$f":"SUM(E237:E241)","v":240062.52589329239},null,"Otahoua","A",null,{"$f":"INDEX('Class Rates'!$E$9:$E$139,MATCH(G242&H242,'Class Rates'!$M$9:$M$139,0),)","v":32.357399999999998},null,{"$f":"INDEX('Class Rates'!$F$9:$F$139,MATCH(G242&H242,'Class Rates'!$M$9:$M$139,0),)","v":2999.9978067725237}]
[null,null,null,null,null,null,"Te Whiti","A",null,{"$f":"INDEX('Class Rates'!$E$9:$E$139,MATCH(G243&H243,'Class Rates'!$M$9:$M$139,0),)","v":9.5417000000000005},null,{"$f":"INDEX('Class Rates'!$F$9:$F$139,MATCH(G243&H243,'Class Rates'!$M$9:$M$139,0),)","v":1347.9941257999999}]
["Targeted rate\nPest management",null,{"$f":"+$C$8","v":"2018/19"},null,{"$f":"+C244","v":"2018/19"},null,"Ahikouka","A",null,{"$f":"INDEX('Class Rates'!$E$9:$E$139,MATCH(G244&H244,'Class Rates'!$M$9:$M$139,0),)","v":27.166399999999999},null,{"$f":"INDEX('Class Rates'!$F$9:$F$139,MATCH(G244&H244,'Class Rates'!$M$9:$M$139,0),)","v":3048.2747788240004}]
[null,null,{"$f":"+$C$112","v":"$ per hectare"},null,"Revenue required\n $",null,"Battersea","A",null,{"$f":"INDEX('Class Rates'!$E$9:$E$139,MATCH(G245&H245,'Class Rates'!$M$9:$M$139,0),)","v":15.0373},null,{"$f":"INDEX('Class Rates'!$F$9:$F$139,MATCH(G245&H245,'Class Rates'!$M$9:$M$139,0),)","v":2536.8098225890344}]
[null,null,null,null,null,null,{"$f":"G245","v":"Battersea"},"B",null,{"$f":"INDEX('Class Rates'!$E$9:$E$139,MATCH(G246&H246,'Class Rates'!$M$9:$M$139,0),)","v":12.425800000000001},null,{"$f":"INDEX('Class Rates'!$F$9:$F$139,MATCH(G246&H246,'Class Rates'!$M$9:$M$139,0),)","v":2427.5136037375073}]
["Rural land area",null,null,null,null,null,"Battersea","C",null,{"$f":"INDEX('Class Rates'!$E$9:$E$139,MATCH(G247&H247,'Class Rates'!$M$9:$M$139,0),)","v":9.7245000000000008},null,{"$f":"INDEX('Class Rates'!$F$9:$F$139,MATCH(G247&H247,'Class Rates'!$M$9:$M$139,0),)","v":3092.5012360373394}]
["Land area of 4 or more hectares in all rural classified areas",null,{"$f":"Pest!C19","v":0.86682366680113054},null,{"$f":"Pest!D19","v":532000},null,"Battersea","D",null,{"$f":"INDEX('Class Rates'!$E$9:$E$139,MATCH(G248&H248,'Class Rates'!$M$9:$M$139,0),)","v":5.8792},null,{"$f":"INDEX('Class Rates'!$F$9:$F$139,MATCH(G248&H248,'Class Rates'!$M$9:$M$139,0),)","v":897.97225507807116}]
["Total pest management rate",null,null,null,{"$f":"SUM(E248:E248)","v":532000},null,"Battersea","E",null,{"$f":"INDEX('Class Rates'!$E$9:$E$139,MATCH(G249&H249,'Class Rates'!$M$9:$M$139,0),)","v":5.0279999999999996},null,{"$f":"INDEX('Class Rates'!$F$9:$F$139,MATCH(G249&H249,'Class Rates'!$M$9:$M$139,0),)","v":1020.1552175284344}]
[null,null,null,null,null,null,"Battersea","F",null,{"$f":"INDEX('Class Rates'!$E$9:$E$139,MATCH(G250&H250,'Class Rates'!$M$9:$M$139,0),)","v":5.069},null,{"$f":"INDEX('Class Rates'!$F$9:$F$139,MATCH(G250&H250,'Class Rates'!$M$9:$M$139,0),)","v":357.05168927248292}]
[{"$f":"+A230","v":"All figures on this page exclude GST."},null,null,null,null,null,"Manaia","A",null,{"$f":"INDEX('Class Rates'!$E$9:$E$139,MATCH(G251&H251,'Class Rates'!$M$9:$M$139,0),)","v":22.752800000000001},null,{"$f":"INDEX('Class Rates'!$F$9:$F$139,MATCH(G251&H251,'Class Rates'!$M$9:$M$139,0),)","v":3969.0049146958236}]
[null,null,null,null,null,null,"Whakawiriwiri","A",null,{"$f":"INDEX('Class Rates'!$E$9:$E$139,MATCH(G252&H252,'Class Rates'!$M$9:$M$139,0),)","v":11.4764},null,{"$f":"INDEX('Class Rates'!$F$9:$F$139,MATCH(G252&H252,'Class Rates'!$M$9:$M$139,0),)","v":8273.0156469608355}]
[null,null,null,null,null,null,"Total gravity drainage scheme rates",null,null,null,null,{"$f":"SUM(L237:L252)","v":41357.299058985533}]
[]
[]
[null,null,null,null,null,null,null,null,null,"Rates Sought Total",null,{"$f":"+E21+E53+L46+E99+L100+E186+L162+E228+L200+L209+L218+E242+E249+L253","v":128874351.34233065}]
[null,null,null,null,null,null,null,null,null,"Total Regnl Rates",null,{"$f":"INDEX(ESSbase!$G$8:$G$25,MATCH(J257,ESSbase!$B$8:$B$25,0),)","v":128874350.32872939}]
[null,null,null,null,null,null,null,null,null,"difference",null,{"$f":"IF(ABS(L257-L256)>tolerance_dollar,1,0)","v":0}]
[]
[null,null,null,null,null,null,null,null,null,"Warm Wellington rates sought",null,{"$f":"+L53","v":3237058}]
[null,null,null,null,null,null,null,null,null,"Warm Greater Wellington rate",null,{"$f":"INDEX(ESSbase!$G$8:$G$25,MATCH(J261,ESSbase!$B$8:$B$25,0),)","v":3237058}]
[null,null,null,null,null,null,null,null,null,"difference",null,{"$f":"IF(ABS(L261-L260)>tolerance_dollar,1,0)","v":0}]

{"sheet":"Changes","index":32,"n_rows":148,"n_cols":13,"rows_kept":148,"cut":false,"hidden":false,"merged":[[5,3,6,3],[5,4,6,4],[7,6,7,8],[14,6,14,8],[53,2,53,12],[46,2,46,12],[39,2,39,12],[32,2,32,12],[20,2,20,12],[27,2,27,12]]}
[{"$f":"year_current&\" Final Rates Averages\"","v":"2018/19 Final Rates Averages"}]
["Greater Wellington Region"]
[]
[]
[null,null,null,{"$f":"year_previous","v":"2017/18"},{"$f":"year_current","v":"2018/19"},null,{"$f":"year_previous","v":"2017/18"},{"$f":"year_current","v":"2018/19"}]
[null,null,null,"Average CV","Average CV",null,"Budget","Plan","Change","Change"]
[null,null,null,null,null,null,"$000s","$000s","$000s","%  "]
[null,null,null,null,null,null,"Excluding GST"]
["Regional CBD",null,null,{"$f":"INDEX('Comparison - Category'!$H$52:$H$56,MATCH(A9,'Comparison - Category'!$C$52:$C$56,0),)","v":2309377.094972067},{"$f":"INDEX('Comparison - Category'!$H$111:$H$115,MATCH(A9,'Comparison - Category'!$C$111:$C$115,0),)","v":2355327.7136941734},null,{"$f":"INDEX('Comparison - Category'!$V$9:$V$56,MATCH(\"Region Wide\"&A9,'Comparison - Category'!$D$9:$D$56,0),)","v":8606.0064614151124},{"$f":"INDEX('Comparison - Category'!$V$68:$V$115,MATCH(\"Region Wide\"&A9,'Comparison - Category'!$D$68:$D$115,0),)","v":8954.374345265187},{"$f":"+H9-G9","v":348.36788385007458},{"$f":"+I9/G9","v":4.0479621461124417E-2}]
["Business",null,null,{"$f":"INDEX('Comparison - Category'!$H$52:$H$56,MATCH(A10,'Comparison - Category'!$C$52:$C$56,0),)","v":1431443.457959777},{"$f":"INDEX('Comparison - Category'!$H$111:$H$115,MATCH(A10,'Comparison - Category'!$C$111:$C$115,0),)","v":1485178.1654061966},null,{"$f":"INDEX('Comparison - Category'!$V$9:$V$56,MATCH(\"Region Wide\"&A10,'Comparison - Category'!$D$9:$D$56,0),)","v":1429.9877027190701},{"$f":"INDEX('Comparison - Category'!$V$68:$V$115,MATCH(\"Region Wide\"&A10,'Comparison - Category'!$D$68:$D$115,0),)","v":1537.5345344673347},{"$f":"+H10-G10","v":107.54683174826459},{"$f":"+I10/G10","v":7.5208221402021963E-2}]
["Residential",null,null,{"$f":"INDEX('Comparison - Category'!$H$52:$H$56,MATCH(A11,'Comparison - Category'!$C$52:$C$56,0),)","v":474927.55003127316},{"$f":"INDEX('Comparison - Category'!$H$111:$H$115,MATCH(A11,'Comparison - Category'!$C$111:$C$115,0),)","v":502545.84107551421},null,{"$f":"INDEX('Comparison - Category'!$V$9:$V$56,MATCH(\"Region Wide\"&A11,'Comparison - Category'!$D$9:$D$56,0),)","v":419.69293255284845},{"$f":"INDEX('Comparison - Category'!$V$68:$V$115,MATCH(\"Region Wide\"&A11,'Comparison - Category'!$D$68:$D$115,0),)","v":448.52977003355545},{"$f":"+H11-G11","v":28.836837480707004},{"$f":"+I11/G11","v":6.8709371171209371E-2}]
["Rural",null,null,{"$f":"INDEX('Comparison - Category'!$H$52:$H$56,MATCH(A12,'Comparison - Category'!$C$52:$C$56,0),)","v":691562.9816727757},{"$f":"INDEX('Comparison - Category'!$H$111:$H$115,MATCH(A12,'Comparison - Category'!$C$111:$C$115,0),)","v":802092.2821325066},null,{"$f":"INDEX('Comparison - Category'!$V$9:$V$56,MATCH(\"Region Wide\"&A12,'Comparison - Category'!$D$9:$D$56,0),)","v":351.0739759127747},{"$f":"INDEX('Comparison - Category'!$V$68:$V$115,MATCH(\"Region Wide\"&A12,'Comparison - Category'!$D$68:$D$115,0),)","v":384.47520528635687},{"$f":"+H12-G12","v":33.401229373582169},{"$f":"+I12/G12","v":9.5140146137977472E-2}]
["Total",null,null,{"$f":"INDEX('Comparison - Category'!$H$52:$H$56,MATCH(A13,'Comparison - Category'!$C$52:$C$56,0),)","v":562142.14607288339},{"$f":"INDEX('Comparison - Category'!$H$111:$H$115,MATCH(A13,'Comparison - Category'!$C$111:$C$115,0),)","v":595990.0230619451},null,{"$f":"INDEX('Comparison - Category'!$V$9:$V$56,MATCH(\"Region Wide\"&A13,'Comparison - Category'!$D$9:$D$56,0),)","v":595.81419707750194},{"$f":"INDEX('Comparison - Category'!$V$68:$V$115,MATCH(\"Region Wide\"&A13,'Comparison - Category'!$D$68:$D$115,0),)","v":631.2520157248515},{"$f":"+H13-G13","v":35.437818647349559},{"$f":"+I13/G13","v":5.9477969509914012E-2}]
["Note: some business and rural values dropped due to on-going sesimic assesments impacting capital value"]
[null,null,null,null,null,null,"Including GST"]
["All properties",null,null,{"$f":"+D13","v":562142.14607288339},{"$f":"+E13","v":595990.0230619451},null,{"$f":"+G13*(1+GST)","v":685.18632663912717},{"$f":"+H13*(1+GST)","v":725.93981808357921},{"$f":"+I13*(1+GST)","v":40.753491444451988},{"$f":"+I16/G16","v":5.9477969509914012E-2}]
["Residential property",null,null,{"$f":"+D11","v":474927.55003127316},{"$f":"+E11","v":502545.84107551421},null,{"$f":"+G11*(1+GST)","v":482.64687243577566},{"$f":"+H11*(1+GST)","v":515.80923553858872},{"$f":"+I11*(1+GST)","v":33.162363102813053},{"$f":"+I17/G17","v":6.8709371171209371E-2}]
[]
["Average Rates - Residential properties"]
[null,null,"Wellington city","Hutt city","Upper Hutt city","Porirua city","Kāpiti Coast district","Kāpiti Coast district excl Ōtaki ","Ōtaki rating area","Masterton district","Carterton district","South Wairarapa district","Tararua district"]
[null,null,"Excluding GST"]
["Residential",{"$f":"\"Average Rates \"& year_current","v":"Average Rates 2018/19"},{"$f":"INDEX('Comparison - Category'!$V$69:$V$115,MATCH(C$20&$A22,'Comparison - Category'!$D$69:$D$115,0),)","v":450.50669024992226},{"$f":"INDEX('Comparison - Category'!$V$69:$V$115,MATCH(D$20&$A22,'Comparison - Category'!$D$69:$D$115,0),)","v":549.94333293166233},{"$f":"INDEX('Comparison - Category'!$V$69:$V$115,MATCH(E$20&$A22,'Comparison - Category'!$D$69:$D$115,0),)","v":454.57517105555343},{"$f":"INDEX('Comparison - Category'!$V$69:$V$115,MATCH(F$20&$A22,'Comparison - Category'!$D$69:$D$115,0),)","v":505.75315019201867},{"$f":"INDEX('Comparison - Category'!$V$69:$V$115,MATCH(G$20&$A22,'Comparison - Category'!$D$69:$D$115,0),)","v":{"$error":"#N/A"}},{"$f":"INDEX('Comparison - Category'!$V$69:$V$115,MATCH(H$20&$A22,'Comparison - Category'!$D$69:$D$115,0),)","v":409.643057987524},{"$f":"INDEX('Comparison - Category'!$V$69:$V$115,MATCH(I$20&$A22,'Comparison - Category'!$D$69:$D$115,0),)","v":246.28378555884674},{"$f":"INDEX('Comparison - Category'!$V$69:$V$115,MATCH(J$20&$A22,'Comparison - Category'!$D$69:$D$115,0),)","v":159.6129725874687},{"$f":"INDEX('Comparison - Category'!$V$69:$V$115,MATCH(K$20&$A22,'Comparison - Category'!$D$69:$D$115,0),)","v":194.96805526573479},{"$f":"INDEX('Comparison - Category'!$V$69:$V$115,MATCH(L$20&$A22,'Comparison - Category'!$D$69:$D$115,0),)","v":235.49788914587629},{"$f":"INDEX('Comparison - Category'!$V$69:$V$115,MATCH(M$20&$A22,'Comparison - Category'!$D$69:$D$115,0),)","v":{"$error":"#N/A"}}]
[null,{"$f":"\"Average Rates \"& year_previous","v":"Average Rates 2017/18"},{"$f":"INDEX('Comparison - Category'!$V$9:$V$56,MATCH(C$20&$A22,'Comparison - Category'!$D$9:$D$56,0),)","v":419.41534734077328},{"$f":"INDEX('Comparison - Category'!$V$9:$V$56,MATCH(D$20&$A22,'Comparison - Category'!$D$9:$D$56,0),)","v":519.25237259494872},{"$f":"INDEX('Comparison - Category'!$V$9:$V$56,MATCH(E$20&$A22,'Comparison - Category'!$D$9:$D$56,0),)","v":448.6329345340265},{"$f":"INDEX('Comparison - Category'!$V$9:$V$56,MATCH(F$20&$A22,'Comparison - Category'!$D$9:$D$56,0),)","v":490.8425896946739},{"$f":"INDEX('Comparison - Category'!$V$9:$V$56,MATCH(G$20&$A22,'Comparison - Category'!$D$9:$D$56,0),)","v":{"$error":"#N/A"}},{"$f":"INDEX('Comparison - Category'!$V$9:$V$56,MATCH(H$20&$A22,'Comparison - Category'!$D$9:$D$56,0),)","v":362.69540787592172},{"$f":"INDEX('Comparison - Category'!$V$9:$V$56,MATCH(I$20&$A22,'Comparison - Category'!$D$9:$D$56,0),)","v":223.88128673200248},{"$f":"INDEX('Comparison - Category'!$V$9:$V$56,MATCH(J$20&$A22,'Comparison - Category'!$D$9:$D$56,0),)","v":130.29168450315552},{"$f":"INDEX('Comparison - Category'!$V$9:$V$56,MATCH(K$20&$A22,'Comparison - Category'!$D$9:$D$56,0),)","v":159.56940710192612},{"$f":"INDEX('Comparison - Category'!$V$9:$V$56,MATCH(L$20&$A22,'Comparison - Category'!$D$9:$D$56,0),)","v":178.78253205781866},{"$f":"INDEX('Comparison - Category'!$V$9:$V$56,MATCH(M$20&$A22,'Comparison - Category'!$D$9:$D$56,0),)","v":{"$error":"#N/A"}}]
[null,"Average Increase",{"$f":"C22-C23","v":31.091342909148977},{"$f":"INDEX('Comparison - Category'!$V$128:$V$174,MATCH(D$20&$A22,'Comparison - Category'!$D$128:$D$174,0),)","v":30.690960336713601},{"$f":"INDEX('Comparison - Category'!$V$128:$V$174,MATCH(E$20&$A22,'Comparison - Category'!$D$128:$D$174,0),)","v":5.9422365215269224},{"$f":"INDEX('Comparison - Category'!$V$128:$V$174,MATCH(F$20&$A22,'Comparison - Category'!$D$128:$D$174,0),)","v":14.910560497344761},{"$f":"INDEX('Comparison - Category'!$V$128:$V$174,MATCH(G$20&$A22,'Comparison - Category'!$D$128:$D$174,0),)","v":{"$error":"#N/A"}},{"$f":"INDEX('Comparison - Category'!$V$128:$V$174,MATCH(H$20&$A22,'Comparison - Category'!$D$128:$D$174,0),)","v":46.947650111602286},{"$f":"INDEX('Comparison - Category'!$V$128:$V$174,MATCH(I$20&$A22,'Comparison - Category'!$D$128:$D$174,0),)","v":22.402498826844266},{"$f":"INDEX('Comparison - Category'!$V$128:$V$174,MATCH(J$20&$A22,'Comparison - Category'!$D$128:$D$174,0),)","v":29.321288084313181},{"$f":"INDEX('Comparison - Category'!$V$128:$V$174,MATCH(K$20&$A22,'Comparison - Category'!$D$128:$D$174,0),)","v":35.398648163808673},{"$f":"INDEX('Comparison - Category'!$V$128:$V$174,MATCH(L$20&$A22,'Comparison - Category'!$D$128:$D$174,0),)","v":56.71535708805763},{"$f":"INDEX('Comparison - Category'!$V$128:$V$174,MATCH(M$20&$A22,'Comparison - Category'!$D$128:$D$174,0),)","v":{"$error":"#N/A"}}]
[null,"% Increase",{"$f":"C24/C23","v":7.413019839707341E-2},{"$f":"D24/D23","v":5.9106057009111798E-2},1.3245207973192692E-2,3.0377479074543631E-2,{"$f":"G24/G23","v":{"$error":"#N/A"}},{"$f":"H24/H23","v":0.12944098296293594},{"$f":"I24/I23","v":0.10006418648853496},{"$f":"J24/J23","v":0.22504343386245076},{"$f":"K24/K23","v":0.22183856421298556},{"$f":"L24/L23","v":0.31723097572930536},{"$f":"M24/M23","v":{"$error":"#N/A"}}]
[null,{"$f":"\"Average Value \"&year_current","v":"Average Value 2018/19"},{"$f":"INDEX('Comparison - Category'!$H$69:$H$115,MATCH(C$20&$A22,'Comparison - Category'!$D$69:$D$115,0),)","v":554459.5066612442},{"$f":"INDEX('Comparison - Category'!$H$69:$H$115,MATCH(D$20&$A22,'Comparison - Category'!$D$69:$D$115,0),)","v":474858.71116478206},{"$f":"INDEX('Comparison - Category'!$H$69:$H$115,MATCH(E$20&$A22,'Comparison - Category'!$D$69:$D$115,0),)","v":415367.22795655398},{"$f":"INDEX('Comparison - Category'!$H$69:$H$115,MATCH(F$20&$A22,'Comparison - Category'!$D$69:$D$115,0),)","v":495584.87684729067},{"$f":"INDEX('Comparison - Category'!$H$69:$H$115,MATCH(G$20&$A22,'Comparison - Category'!$D$69:$D$115,0),)","v":{"$error":"#N/A"}},{"$f":"INDEX('Comparison - Category'!$H$69:$H$115,MATCH(H$20&$A22,'Comparison - Category'!$D$69:$D$115,0),)","v":571428.5434721834},{"$f":"INDEX('Comparison - Category'!$H$69:$H$115,MATCH(I$20&$A22,'Comparison - Category'!$D$69:$D$115,0),)","v":350606.44239923835},{"$f":"INDEX('Comparison - Category'!$H$69:$H$115,MATCH(J$20&$A22,'Comparison - Category'!$D$69:$D$115,0),)","v":329152.65419615776},{"$f":"INDEX('Comparison - Category'!$H$69:$H$115,MATCH(K$20&$A22,'Comparison - Category'!$D$69:$D$115,0),)","v":352806.64715719066},{"$f":"INDEX('Comparison - Category'!$H$69:$H$115,MATCH(L$20&$A22,'Comparison - Category'!$D$69:$D$115,0),)","v":408450.32517807372},{"$f":"INDEX('Comparison - Category'!$H$69:$H$115,MATCH(M$20&$A22,'Comparison - Category'!$D$69:$D$115,0),)","v":{"$error":"#N/A"}}]
[]
[null,null,"Including GST"]
[null,{"$f":"\"Average Rates \"& year_current","v":"Average Rates 2018/19"},{"$f":"+C22*(1+GST)","v":518.08269378741056},632.43483287141157,522.76144671388636,581.61612272082141,{"$f":"+G22*(1+GST)","v":{"$error":"#N/A"}},471.08951668565254,{"$f":"+I22*(1+GST)","v":283.22635339267373},{"$f":"+J22*(1+GST)","v":183.55491847558901},224.21326355559498,270.82257251775769,{"$error":"#N/A"}]
[null,{"$f":"\"Average Rates \"& year_previous","v":"Average Rates 2017/18"},{"$f":"+C23*(1+GST)","v":482.32764944188921},597.14022848419097,515.92787471413044,564.46897814887495,{"$error":"#N/A"},417.09971905730993,{"$f":"+I23*(1+GST)","v":257.46347974180281},149.83543717862884,183.50481816721503,205.59991186649142,{"$error":"#N/A"}]
[null,"Average Increase",{"$f":"+C24*(1+GST)","v":35.75504434552132},35.294604387220637,6.8335719997559599,17.147144571946473,{"$error":"#N/A"},53.989797628342622,{"$f":"+I24*(1+GST)","v":25.762873650870905},33.719481296960154,40.708445388379971,65.222660651266267,{"$error":"#N/A"}]
[]
[null,null,"Excluding GST"]
["Rural",{"$f":"\"Average Rates \"& year_current","v":"Average Rates 2018/19"},{"$f":"INDEX('Comparison - Category'!$V$69:$V$115,MATCH(C$20&$A34,'Comparison - Category'!$D$69:$D$115,0),)","v":433.71959020736989},{"$f":"INDEX('Comparison - Category'!$V$69:$V$115,MATCH(D$20&$A34,'Comparison - Category'!$D$69:$D$115,0),)","v":495.04124589837693},{"$f":"INDEX('Comparison - Category'!$V$69:$V$115,MATCH(E$20&$A34,'Comparison - Category'!$D$69:$D$115,0),)","v":443.89635279370498},{"$f":"INDEX('Comparison - Category'!$V$69:$V$115,MATCH(F$20&$A34,'Comparison - Category'!$D$69:$D$115,0),)","v":562.28429608424813},{"$f":"INDEX('Comparison - Category'!$V$69:$V$115,MATCH(G$20&$A34,'Comparison - Category'!$D$69:$D$115,0),)","v":393.89530332685047},{"$f":"INDEX('Comparison - Category'!$V$69:$V$115,MATCH(H$20&$A34,'Comparison - Category'!$D$69:$D$115,0),)","v":{"$error":"#N/A"}},{"$f":"INDEX('Comparison - Category'!$V$69:$V$115,MATCH(I$20&$A34,'Comparison - Category'!$D$69:$D$115,0),)","v":{"$error":"#N/A"}},{"$f":"INDEX('Comparison - Category'!$V$69:$V$115,MATCH(J$20&$A34,'Comparison - Category'!$D$69:$D$115,0),)","v":298.41187206473904},{"$f":"INDEX('Comparison - Category'!$V$69:$V$115,MATCH(K$20&$A34,'Comparison - Category'!$D$69:$D$115,0),)","v":368.13322411308059},{"$f":"INDEX('Comparison - Category'!$V$69:$V$115,MATCH(L$20&$A34,'Comparison - Category'!$D$69:$D$115,0),)","v":405.87900913234574},{"$f":"INDEX('Comparison - Category'!$V$69:$V$115,MATCH(M$20&$A34,'Comparison - Category'!$D$69:$D$115,0),)","v":263.302464297749}]
[null,{"$f":"\"Average Rates \"& year_previous","v":"Average Rates 2017/18"},{"$f":"INDEX('Comparison - Category'!$V$9:$V$56,MATCH(C$20&$A34,'Comparison - Category'!$D$9:$D$56,0),)","v":401.03000016326183},{"$f":"INDEX('Comparison - Category'!$V$9:$V$56,MATCH(D$20&$A34,'Comparison - Category'!$D$9:$D$56,0),)","v":456.84684423182881},{"$f":"INDEX('Comparison - Category'!$V$9:$V$56,MATCH(E$20&$A34,'Comparison - Category'!$D$9:$D$56,0),)","v":403.61355742451246},{"$f":"INDEX('Comparison - Category'!$V$9:$V$56,MATCH(F$20&$A34,'Comparison - Category'!$D$9:$D$56,0),)","v":520.25920458070402},{"$f":"INDEX('Comparison - Category'!$V$9:$V$56,MATCH(G$20&$A34,'Comparison - Category'!$D$9:$D$56,0),)","v":392.40012294643242},{"$f":"INDEX('Comparison - Category'!$V$9:$V$56,MATCH(H$20&$A34,'Comparison - Category'!$D$9:$D$56,0),)","v":{"$error":"#N/A"}},{"$f":"INDEX('Comparison - Category'!$V$9:$V$56,MATCH(I$20&$A34,'Comparison - Category'!$D$9:$D$56,0),)","v":{"$error":"#N/A"}},{"$f":"INDEX('Comparison - Category'!$V$9:$V$56,MATCH(J$20&$A34,'Comparison - Category'!$D$9:$D$56,0),)","v":261.80220892739106},{"$f":"INDEX('Comparison - Category'!$V$9:$V$56,MATCH(K$20&$A34,'Comparison - Category'!$D$9:$D$56,0),)","v":330.96905126031817},{"$f":"INDEX('Comparison - Category'!$V$9:$V$56,MATCH(L$20&$A34,'Comparison - Category'!$D$9:$D$56,0),)","v":356.39297879805548},{"$f":"INDEX('Comparison - Category'!$V$9:$V$56,MATCH(M$20&$A34,'Comparison - Category'!$D$9:$D$56,0),)","v":224.20357346081778}]
[null,"Average Increase",{"$f":"C34-C35","v":32.689590044108058},{"$f":"INDEX('Comparison - Category'!$V$128:$V$174,MATCH(D$20&$A34,'Comparison - Category'!$D$128:$D$174,0),)","v":38.194401666548117},{"$f":"INDEX('Comparison - Category'!$V$128:$V$174,MATCH(E$20&$A34,'Comparison - Category'!$D$128:$D$174,0),)","v":40.282795369192513},{"$f":"INDEX('Comparison - Category'!$V$128:$V$174,MATCH(F$20&$A34,'Comparison - Category'!$D$128:$D$174,0),)","v":42.025091503544104},{"$f":"INDEX('Comparison - Category'!$V$128:$V$174,MATCH(G$20&$A34,'Comparison - Category'!$D$128:$D$174,0),)","v":1.4951803804180486},{"$f":"INDEX('Comparison - Category'!$V$128:$V$174,MATCH(H$20&$A34,'Comparison - Category'!$D$128:$D$174,0),)","v":{"$error":"#N/A"}},{"$f":"INDEX('Comparison - Category'!$V$128:$V$174,MATCH(I$20&$A34,'Comparison - Category'!$D$128:$D$174,0),)","v":{"$error":"#N/A"}},{"$f":"INDEX('Comparison - Category'!$V$128:$V$174,MATCH(J$20&$A34,'Comparison - Category'!$D$128:$D$174,0),)","v":36.60966313734798},{"$f":"INDEX('Comparison - Category'!$V$128:$V$174,MATCH(K$20&$A34,'Comparison - Category'!$D$128:$D$174,0),)","v":37.16417285276242},{"$f":"INDEX('Comparison - Category'!$V$128:$V$174,MATCH(L$20&$A34,'Comparison - Category'!$D$128:$D$174,0),)","v":49.486030334290263},{"$f":"INDEX('Comparison - Category'!$V$128:$V$174,MATCH(M$20&$A34,'Comparison - Category'!$D$128:$D$174,0),)","v":39.098890836931218}]
[null,"% Increase",{"$f":"C36/C35","v":8.1514076330448895E-2},{"$f":"D36/D35","v":8.3604389849229674E-2},{"$f":"E36/E35","v":9.9805357446959828E-2},{"$f":"F36/F35","v":8.0777218612429286E-2},3.8103463607277199E-3,{"$f":"H36/H35","v":{"$error":"#N/A"}},{"$error":"#N/A"},{"$f":"J36/J35","v":0.1398371056047942},{"$f":"K36/K35","v":0.11228896693283735},{"$f":"L36/L35","v":0.13885242773632403},{"$f":"M36/M35","v":0.17439013229539008}]
[null,{"$f":"\"Average Value \"&year_current","v":"Average Value 2018/19"},{"$f":"INDEX('Comparison - Category'!$H$69:$H$115,MATCH(C$20&$A34,'Comparison - Category'!$D$69:$D$115,0),)","v":763054.48143405886},{"$f":"INDEX('Comparison - Category'!$H$69:$H$115,MATCH(D$20&$A34,'Comparison - Category'!$D$69:$D$115,0),)","v":649060.41666666663},{"$f":"INDEX('Comparison - Category'!$H$69:$H$115,MATCH(E$20&$A34,'Comparison - Category'!$D$69:$D$115,0),)","v":682132.75339185959},{"$f":"INDEX('Comparison - Category'!$H$69:$H$115,MATCH(F$20&$A34,'Comparison - Category'!$D$69:$D$115,0),)","v":1004521.1878009631},{"$f":"INDEX('Comparison - Category'!$H$69:$H$115,MATCH(G$20&$A34,'Comparison - Category'!$D$69:$D$115,0),)","v":744005.18350359437},{"$f":"INDEX('Comparison - Category'!$H$69:$H$115,MATCH(H$20&$A34,'Comparison - Category'!$D$69:$D$115,0),)","v":{"$error":"#N/A"}},{"$f":"INDEX('Comparison - Category'!$H$69:$H$115,MATCH(I$20&$A34,'Comparison - Category'!$D$69:$D$115,0),)","v":{"$error":"#N/A"}},{"$f":"INDEX('Comparison - Category'!$H$69:$H$115,MATCH(J$20&$A34,'Comparison - Category'!$D$69:$D$115,0),)","v":723942.16494845366},{"$f":"INDEX('Comparison - Category'!$H$69:$H$115,MATCH(K$20&$A34,'Comparison - Category'!$D$69:$D$115,0),)","v":853777.38619676942},{"$f":"INDEX('Comparison - Category'!$H$69:$H$115,MATCH(L$20&$A34,'Comparison - Category'!$D$69:$D$115,0),)","v":954638.47631241998},{"$f":"INDEX('Comparison - Category'!$H$69:$H$115,MATCH(M$20&$A34,'Comparison - Category'!$D$69:$D$115,0),)","v":1076050}]
[]
[null,null,"Excluding GST"]
["Business",{"$f":"\"Average Rates \"& year_current","v":"Average Rates 2018/19"},{"$f":"INDEX('Comparison - Category'!$V$69:$V$115,MATCH(C$20&$A41,'Comparison - Category'!$D$69:$D$115,0),)","v":1910.9375867822318},{"$f":"INDEX('Comparison - Category'!$V$69:$V$115,MATCH(D$20&$A41,'Comparison - Category'!$D$69:$D$115,0),)","v":1999.3061349838358},{"$f":"INDEX('Comparison - Category'!$V$69:$V$115,MATCH(E$20&$A41,'Comparison - Category'!$D$69:$D$115,0),)","v":1939.9001272602159},{"$f":"INDEX('Comparison - Category'!$V$69:$V$115,MATCH(F$20&$A41,'Comparison - Category'!$D$69:$D$115,0),)","v":1536.2739993179648},{"$f":"INDEX('Comparison - Category'!$V$69:$V$115,MATCH(G$20&$A41,'Comparison - Category'!$D$69:$D$115,0),)","v":887.4370891787745},{"$f":"INDEX('Comparison - Category'!$V$69:$V$115,MATCH(H$20&$A41,'Comparison - Category'!$D$69:$D$115,0),)","v":{"$error":"#N/A"}},{"$f":"INDEX('Comparison - Category'!$V$69:$V$115,MATCH(I$20&$A41,'Comparison - Category'!$D$69:$D$115,0),)","v":{"$error":"#N/A"}},{"$f":"INDEX('Comparison - Category'!$V$69:$V$115,MATCH(J$20&$A41,'Comparison - Category'!$D$69:$D$115,0),)","v":439.61366010404049},{"$f":"INDEX('Comparison - Category'!$V$69:$V$115,MATCH(K$20&$A41,'Comparison - Category'!$D$69:$D$115,0),)","v":267.77983886509003},{"$f":"INDEX('Comparison - Category'!$V$69:$V$115,MATCH(L$20&$A41,'Comparison - Category'!$D$69:$D$115,0),)","v":446.34640854692702},{"$f":"INDEX('Comparison - Category'!$V$69:$V$115,MATCH(M$20&$A41,'Comparison - Category'!$D$69:$D$115,0),)","v":{"$error":"#N/A"}}]
[null,{"$f":"\"Average Rates \"& year_previous","v":"Average Rates 2017/18"},{"$f":"INDEX('Comparison - Category'!$V$9:$V$56,MATCH(C$20&$A41,'Comparison - Category'!$D$9:$D$56,0),)","v":1709.2917229929787},{"$f":"INDEX('Comparison - Category'!$V$9:$V$56,MATCH(D$20&$A41,'Comparison - Category'!$D$9:$D$56,0),)","v":1881.2693924637156},{"$f":"INDEX('Comparison - Category'!$V$9:$V$56,MATCH(E$20&$A41,'Comparison - Category'!$D$9:$D$56,0),)","v":1849.4419134297805},{"$f":"INDEX('Comparison - Category'!$V$9:$V$56,MATCH(F$20&$A41,'Comparison - Category'!$D$9:$D$56,0),)","v":1472.5335312710961},{"$f":"INDEX('Comparison - Category'!$V$9:$V$56,MATCH(G$20&$A41,'Comparison - Category'!$D$9:$D$56,0),)","v":864.72232226204733},{"$f":"INDEX('Comparison - Category'!$V$9:$V$56,MATCH(H$20&$A41,'Comparison - Category'!$D$9:$D$56,0),)","v":{"$error":"#N/A"}},{"$f":"INDEX('Comparison - Category'!$V$9:$V$56,MATCH(I$20&$A41,'Comparison - Category'!$D$9:$D$56,0),)","v":{"$error":"#N/A"}},{"$f":"INDEX('Comparison - Category'!$V$9:$V$56,MATCH(J$20&$A41,'Comparison - Category'!$D$9:$D$56,0),)","v":388.39100516213119},{"$f":"INDEX('Comparison - Category'!$V$9:$V$56,MATCH(K$20&$A41,'Comparison - Category'!$D$9:$D$56,0),)","v":266.74240595497224},{"$f":"INDEX('Comparison - Category'!$V$9:$V$56,MATCH(L$20&$A41,'Comparison - Category'!$D$9:$D$56,0),)","v":412.61421887867567},{"$f":"INDEX('Comparison - Category'!$V$9:$V$56,MATCH(M$20&$A41,'Comparison - Category'!$D$9:$D$56,0),)","v":{"$error":"#N/A"}}]
[null,"Average Increase",{"$f":"C41-C42","v":201.6458637892531},{"$f":"INDEX('Comparison - Category'!$V$128:$V$174,MATCH(D$20&$A41,'Comparison - Category'!$D$128:$D$174,0),)","v":118.03674252012024},{"$f":"INDEX('Comparison - Category'!$V$128:$V$174,MATCH(E$20&$A41,'Comparison - Category'!$D$128:$D$174,0),)","v":90.458213830435398},{"$f":"INDEX('Comparison - Category'!$V$128:$V$174,MATCH(F$20&$A41,'Comparison - Category'!$D$128:$D$174,0),)","v":63.740468046868727},{"$f":"INDEX('Comparison - Category'!$V$128:$V$174,MATCH(G$20&$A41,'Comparison - Category'!$D$128:$D$174,0),)","v":22.714766916727172},{"$f":"INDEX('Comparison - Category'!$V$128:$V$174,MATCH(H$20&$A41,'Comparison - Category'!$D$128:$D$174,0),)","v":{"$error":"#N/A"}},{"$f":"INDEX('Comparison - Category'!$V$128:$V$174,MATCH(I$20&$A41,'Comparison - Category'!$D$128:$D$174,0),)","v":{"$error":"#N/A"}},{"$f":"INDEX('Comparison - Category'!$V$128:$V$174,MATCH(J$20&$A41,'Comparison - Category'!$D$128:$D$174,0),)","v":51.222654941909298},{"$f":"INDEX('Comparison - Category'!$V$128:$V$174,MATCH(K$20&$A41,'Comparison - Category'!$D$128:$D$174,0),)","v":1.0374329101177864},{"$f":"INDEX('Comparison - Category'!$V$128:$V$174,MATCH(L$20&$A41,'Comparison - Category'!$D$128:$D$174,0),)","v":33.732189668251351},{"$f":"INDEX('Comparison - Category'!$V$128:$V$174,MATCH(M$20&$A41,'Comparison - Category'!$D$128:$D$174,0),)","v":{"$error":"#N/A"}}]
[null,"% Increase",{"$f":"C43/C42","v":0.11797042077531981},{"$f":"D43/D42","v":6.2743136625179982E-2},{"$f":"E43/E42","v":4.8911086730310499E-2},{"$f":"F43/F42","v":4.3286259153533659E-2},2.6268278650777837E-2,{"$f":"H43/H42","v":{"$error":"#N/A"}},{"$error":"#N/A"},{"$f":"J43/J42","v":0.13188424618774769},{"$f":"K43/K42","v":3.8892687737581231E-3},{"$f":"L43/L42","v":8.1752368495497496E-2},{"$f":"M43/M42","v":{"$error":"#N/A"}}]
[null,{"$f":"\"Average Value \"&year_current","v":"Average Value 2018/19"},{"$f":"INDEX('Comparison - Category'!$H$69:$H$115,MATCH(C$20&$A41,'Comparison - Category'!$D$69:$D$115,0),)","v":2051674.776197999},{"$f":"INDEX('Comparison - Category'!$H$69:$H$115,MATCH(D$20&$A41,'Comparison - Category'!$D$69:$D$115,0),)","v":1598072.3323492198},{"$f":"INDEX('Comparison - Category'!$H$69:$H$115,MATCH(E$20&$A41,'Comparison - Category'!$D$69:$D$115,0),)","v":1640609.6368715083},{"$f":"INDEX('Comparison - Category'!$H$69:$H$115,MATCH(F$20&$A41,'Comparison - Category'!$D$69:$D$115,0),)","v":1380170.0125470515},{"$f":"INDEX('Comparison - Category'!$H$69:$H$115,MATCH(G$20&$A41,'Comparison - Category'!$D$69:$D$115,0),)","v":1108807.7211394303},{"$f":"INDEX('Comparison - Category'!$H$69:$H$115,MATCH(H$20&$A41,'Comparison - Category'!$D$69:$D$115,0),)","v":{"$error":"#N/A"}},{"$f":"INDEX('Comparison - Category'!$H$69:$H$115,MATCH(I$20&$A41,'Comparison - Category'!$D$69:$D$115,0),)","v":{"$error":"#N/A"}},{"$f":"INDEX('Comparison - Category'!$H$69:$H$115,MATCH(J$20&$A41,'Comparison - Category'!$D$69:$D$115,0),)","v":787932.90909090906},{"$f":"INDEX('Comparison - Category'!$H$69:$H$115,MATCH(K$20&$A41,'Comparison - Category'!$D$69:$D$115,0),)","v":425781.93832599121},{"$f":"INDEX('Comparison - Category'!$H$69:$H$115,MATCH(L$20&$A41,'Comparison - Category'!$D$69:$D$115,0),)","v":679255.26315789472},{"$f":"INDEX('Comparison - Category'!$H$69:$H$115,MATCH(M$20&$A41,'Comparison - Category'!$D$69:$D$115,0),)","v":{"$error":"#N/A"}}]
[]
[null,null,"Excluding GST"]
["Regional CBD",{"$f":"\"Average Rates \"& year_current","v":"Average Rates 2018/19"},{"$f":"INDEX('Comparison - Category'!$V$69:$V$115,MATCH(C$20&$A48,'Comparison - Category'!$D$69:$D$115,0),)","v":8954.374345265187},{"$f":"INDEX('Comparison - Category'!$V$69:$V$115,MATCH(D$20&$A48,'Comparison - Category'!$D$69:$D$115,0),)","v":{"$error":"#N/A"}},{"$f":"INDEX('Comparison - Category'!$V$69:$V$115,MATCH(E$20&$A48,'Comparison - Category'!$D$69:$D$115,0),)","v":{"$error":"#N/A"}},{"$f":"INDEX('Comparison - Category'!$V$69:$V$115,MATCH(F$20&$A48,'Comparison - Category'!$D$69:$D$115,0),)","v":{"$error":"#N/A"}},{"$f":"INDEX('Comparison - Category'!$V$69:$V$115,MATCH(G$20&$A48,'Comparison - Category'!$D$69:$D$115,0),)","v":{"$error":"#N/A"}},{"$f":"INDEX('Comparison - Category'!$V$69:$V$115,MATCH(H$20&$A48,'Comparison - Category'!$D$69:$D$115,0),)","v":{"$error":"#N/A"}},{"$f":"INDEX('Comparison - Category'!$V$69:$V$115,MATCH(I$20&$A48,'Comparison - Category'!$D$69:$D$115,0),)","v":{"$error":"#N/A"}},{"$f":"INDEX('Comparison - Category'!$V$69:$V$115,MATCH(J$20&$A48,'Comparison - Category'!$D$69:$D$115,0),)","v":{"$error":"#N/A"}},{"$f":"INDEX('Comparison - Category'!$V$69:$V$115,MATCH(K$20&$A48,'Comparison - Category'!$D$69:$D$115,0),)","v":{"$error":"#N/A"}},{"$f":"INDEX('Comparison - Category'!$V$69:$V$115,MATCH(L$20&$A48,'Comparison - Category'!$D$69:$D$115,0),)","v":{"$error":"#N/A"}},{"$f":"INDEX('Comparison - Category'!$V$69:$V$115,MATCH(M$20&$A48,'Comparison - Category'!$D$69:$D$115,0),)","v":{"$error":"#N/A"}}]
[null,{"$f":"\"Average Rates \"& year_previous","v":"Average Rates 2017/18"},{"$f":"INDEX('Comparison - Category'!$V$9:$V$56,MATCH(C$20&$A48,'Comparison - Category'!$D$9:$D$56,0),)","v":8606.0064614151124},{"$f":"INDEX('Comparison - Category'!$V$9:$V$56,MATCH(D$20&$A48,'Comparison - Category'!$D$9:$D$56,0),)","v":{"$error":"#N/A"}},{"$f":"INDEX('Comparison - Category'!$V$9:$V$56,MATCH(E$20&$A48,'Comparison - Category'!$D$9:$D$56,0),)","v":{"$error":"#N/A"}},{"$f":"INDEX('Comparison - Category'!$V$9:$V$56,MATCH(F$20&$A48,'Comparison - Category'!$D$9:$D$56,0),)","v":{"$error":"#N/A"}},{"$f":"INDEX('Comparison - Category'!$V$9:$V$56,MATCH(G$20&$A48,'Comparison - Category'!$D$9:$D$56,0),)","v":{"$error":"#N/A"}},{"$f":"INDEX('Comparison - Category'!$V$9:$V$56,MATCH(H$20&$A48,'Comparison - Category'!$D$9:$D$56,0),)","v":{"$error":"#N/A"}},{"$f":"INDEX('Comparison - Category'!$V$9:$V$56,MATCH(I$20&$A48,'Comparison - Category'!$D$9:$D$56,0),)","v":{"$error":"#N/A"}},{"$f":"INDEX('Comparison - Category'!$V$9:$V$56,MATCH(J$20&$A48,'Comparison - Category'!$D$9:$D$56,0),)","v":{"$error":"#N/A"}},{"$f":"INDEX('Comparison - Category'!$V$9:$V$56,MATCH(K$20&$A48,'Comparison - Category'!$D$9:$D$56,0),)","v":{"$error":"#N/A"}},{"$f":"INDEX('Comparison - Category'!$V$9:$V$56,MATCH(L$20&$A48,'Comparison - Category'!$D$9:$D$56,0),)","v":{"$error":"#N/A"}},{"$f":"INDEX('Comparison - Category'!$V$9:$V$56,MATCH(M$20&$A48,'Comparison - Category'!$D$9:$D$56,0),)","v":{"$error":"#N/A"}}]
[null,"Average Increase",{"$f":"C48-C49","v":348.36788385007458},{"$f":"INDEX('Comparison - Category'!$V$128:$V$174,MATCH(D$20&$A48,'Comparison - Category'!$D$128:$D$174,0),)","v":{"$error":"#N/A"}},{"$f":"INDEX('Comparison - Category'!$V$128:$V$174,MATCH(E$20&$A48,'Comparison - Category'!$D$128:$D$174,0),)","v":{"$error":"#N/A"}},{"$f":"INDEX('Comparison - Category'!$V$128:$V$174,MATCH(F$20&$A48,'Comparison - Category'!$D$128:$D$174,0),)","v":{"$error":"#N/A"}},{"$f":"INDEX('Comparison - Category'!$V$128:$V$174,MATCH(G$20&$A48,'Comparison - Category'!$D$128:$D$174,0),)","v":{"$error":"#N/A"}},{"$f":"INDEX('Comparison - Category'!$V$128:$V$174,MATCH(H$20&$A48,'Comparison - Category'!$D$128:$D$174,0),)","v":{"$error":"#N/A"}},{"$f":"INDEX('Comparison - Category'!$V$128:$V$174,MATCH(I$20&$A48,'Comparison - Category'!$D$128:$D$174,0),)","v":{"$error":"#N/A"}},{"$f":"INDEX('Comparison - Category'!$V$128:$V$174,MATCH(J$20&$A48,'Comparison - Category'!$D$128:$D$174,0),)","v":{"$error":"#N/A"}},{"$f":"INDEX('Comparison - Category'!$V$128:$V$174,MATCH(K$20&$A48,'Comparison - Category'!$D$128:$D$174,0),)","v":{"$error":"#N/A"}},{"$f":"INDEX('Comparison - Category'!$V$128:$V$174,MATCH(L$20&$A48,'Comparison - Category'!$D$128:$D$174,0),)","v":{"$error":"#N/A"}},{"$f":"INDEX('Comparison - Category'!$V$128:$V$174,MATCH(M$20&$A48,'Comparison - Category'!$D$128:$D$174,0),)","v":{"$error":"#N/A"}}]
[null,"% Increase",{"$f":"C50/C49","v":4.0479621461124417E-2},{"$f":"D50/D49","v":{"$error":"#N/A"}},{"$f":"E50/E49","v":{"$error":"#N/A"}},{"$f":"F50/F49","v":{"$error":"#N/A"}},{"$error":"#N/A"},{"$f":"H50/H49","v":{"$error":"#N/A"}},{"$error":"#N/A"},{"$f":"J50/J49","v":{"$error":"#N/A"}},{"$f":"K50/K49","v":{"$error":"#N/A"}},{"$f":"L50/L49","v":{"$error":"#N/A"}},{"$f":"M50/M49","v":{"$error":"#N/A"}}]
[null,{"$f":"\"Average Value \"&year_current","v":"Average Value 2018/19"},{"$f":"INDEX('Comparison - Category'!$H$69:$H$115,MATCH(C$20&$A48,'Comparison - Category'!$D$69:$D$115,0),)","v":2355327.7136941734},{"$f":"INDEX('Comparison - Category'!$H$69:$H$115,MATCH(D$20&$A48,'Comparison - Category'!$D$69:$D$115,0),)","v":{"$error":"#N/A"}},{"$f":"INDEX('Comparison - Category'!$H$69:$H$115,MATCH(E$20&$A48,'Comparison - Category'!$D$69:$D$115,0),)","v":{"$error":"#N/A"}},{"$f":"INDEX('Comparison - Category'!$H$69:$H$115,MATCH(F$20&$A48,'Comparison - Category'!$D$69:$D$115,0),)","v":{"$error":"#N/A"}},{"$f":"INDEX('Comparison - Category'!$H$69:$H$115,MATCH(G$20&$A48,'Comparison - Category'!$D$69:$D$115,0),)","v":{"$error":"#N/A"}},{"$f":"INDEX('Comparison - Category'!$H$69:$H$115,MATCH(H$20&$A48,'Comparison - Category'!$D$69:$D$115,0),)","v":{"$error":"#N/A"}},{"$f":"INDEX('Comparison - Category'!$H$69:$H$115,MATCH(I$20&$A48,'Comparison - Category'!$D$69:$D$115,0),)","v":{"$error":"#N/A"}},{"$f":"INDEX('Comparison - Category'!$H$69:$H$115,MATCH(J$20&$A48,'Comparison - Category'!$D$69:$D$115,0),)","v":{"$error":"#N/A"}},{"$f":"INDEX('Comparison - Category'!$H$69:$H$115,MATCH(K$20&$A48,'Comparison - Category'!$D$69:$D$115,0),)","v":{"$error":"#N/A"}},{"$f":"INDEX('Comparison - Category'!$H$69:$H$115,MATCH(L$20&$A48,'Comparison - Category'!$D$69:$D$115,0),)","v":{"$error":"#N/A"}},{"$f":"INDEX('Comparison - Category'!$H$69:$H$115,MATCH(M$20&$A48,'Comparison - Category'!$D$69:$D$115,0),)","v":{"$error":"#N/A"}}]
[]
[null,null,"Excluding GST"]
["District wide",{"$f":"\"Average Rates \"& year_current","v":"Average Rates 2018/19"},{"$f":"INDEX('Comparison - Category'!$V$69:$V$115,MATCH(C$20&$A55,'Comparison - Category'!$D$69:$D$115,0),)","v":857.79932798581433},{"$f":"INDEX('Comparison - Category'!$V$69:$V$115,MATCH(D$20&$A55,'Comparison - Category'!$D$69:$D$115,0),)","v":636.69814245872533},{"$f":"INDEX('Comparison - Category'!$V$69:$V$115,MATCH(E$20&$A55,'Comparison - Category'!$D$69:$D$115,0),)","v":516.94070877354079},{"$f":"INDEX('Comparison - Category'!$V$69:$V$115,MATCH(F$20&$A55,'Comparison - Category'!$D$69:$D$115,0),)","v":551.6189612037582},{"$f":"INDEX('Comparison - Category'!$V$69:$V$115,MATCH(G$20&$A55,'Comparison - Category'!$D$69:$D$115,0),)","v":412.58740111382656},{"$f":"INDEX('Comparison - Category'!$V$69:$V$115,MATCH(H$20&$A55,'Comparison - Category'!$D$69:$D$115,0),)","v":{"$error":"#N/A"}},{"$f":"INDEX('Comparison - Category'!$V$69:$V$115,MATCH(I$20&$A55,'Comparison - Category'!$D$69:$D$115,0),)","v":{"$error":"#N/A"}},{"$f":"INDEX('Comparison - Category'!$V$69:$V$115,MATCH(J$20&$A55,'Comparison - Category'!$D$69:$D$115,0),)","v":214.71474767302396},{"$f":"INDEX('Comparison - Category'!$V$69:$V$115,MATCH(K$20&$A55,'Comparison - Category'!$D$69:$D$115,0),)","v":272.52161915080148},{"$f":"INDEX('Comparison - Category'!$V$69:$V$115,MATCH(L$20&$A55,'Comparison - Category'!$D$69:$D$115,0),)","v":323.52050725247835},{"$f":"INDEX('Comparison - Category'!$V$69:$V$115,MATCH(M$20&$A55,'Comparison - Category'!$D$69:$D$115,0),)","v":260.50246429774904}]
[null,{"$f":"\"Average Rates \"& year_previous","v":"Average Rates 2017/18"},{"$f":"INDEX('Comparison - Category'!$V$9:$V$56,MATCH(C$20&$A55,'Comparison - Category'!$D$9:$D$56,0),)","v":812.91628105113432},{"$f":"INDEX('Comparison - Category'!$V$9:$V$56,MATCH(D$20&$A55,'Comparison - Category'!$D$9:$D$56,0),)","v":600.63590115989939},{"$f":"INDEX('Comparison - Category'!$V$9:$V$56,MATCH(E$20&$A55,'Comparison - Category'!$D$9:$D$56,0),)","v":506.16847935228236},{"$f":"INDEX('Comparison - Category'!$V$9:$V$56,MATCH(F$20&$A55,'Comparison - Category'!$D$9:$D$56,0),)","v":534.02228926284317},{"$f":"INDEX('Comparison - Category'!$V$9:$V$56,MATCH(G$20&$A55,'Comparison - Category'!$D$9:$D$56,0),)","v":376.68379901956973},{"$f":"INDEX('Comparison - Category'!$V$9:$V$56,MATCH(H$20&$A55,'Comparison - Category'!$D$9:$D$56,0),)","v":{"$error":"#N/A"}},{"$f":"INDEX('Comparison - Category'!$V$9:$V$56,MATCH(I$20&$A55,'Comparison - Category'!$D$9:$D$56,0),)","v":{"$error":"#N/A"}},{"$f":"INDEX('Comparison - Category'!$V$9:$V$56,MATCH(J$20&$A55,'Comparison - Category'!$D$9:$D$56,0),)","v":182.43541893140156},{"$f":"INDEX('Comparison - Category'!$V$9:$V$56,MATCH(K$20&$A55,'Comparison - Category'!$D$9:$D$56,0),)","v":239.84938953836109},{"$f":"INDEX('Comparison - Category'!$V$9:$V$56,MATCH(L$20&$A55,'Comparison - Category'!$D$9:$D$56,0),)","v":272.6086427892086},{"$f":"INDEX('Comparison - Category'!$V$9:$V$56,MATCH(M$20&$A55,'Comparison - Category'!$D$9:$D$56,0),)","v":217.20357346081778}]
[null,"Average Increase",{"$f":"C55-C56","v":44.88304693468001},{"$f":"INDEX('Comparison - Category'!$V$128:$V$174,MATCH(D$20&$A55,'Comparison - Category'!$D$128:$D$174,0),)","v":36.062241298825938},{"$f":"INDEX('Comparison - Category'!$V$128:$V$174,MATCH(E$20&$A55,'Comparison - Category'!$D$128:$D$174,0),)","v":10.77222942125843},{"$f":"INDEX('Comparison - Category'!$V$128:$V$174,MATCH(F$20&$A55,'Comparison - Category'!$D$128:$D$174,0),)","v":17.59667194091503},{"$f":"INDEX('Comparison - Category'!$V$128:$V$174,MATCH(G$20&$A55,'Comparison - Category'!$D$128:$D$174,0),)","v":35.903602094256826},{"$f":"INDEX('Comparison - Category'!$V$128:$V$174,MATCH(H$20&$A55,'Comparison - Category'!$D$128:$D$174,0),)","v":{"$error":"#N/A"}},{"$f":"INDEX('Comparison - Category'!$V$128:$V$174,MATCH(I$20&$A55,'Comparison - Category'!$D$128:$D$174,0),)","v":{"$error":"#N/A"}},{"$f":"INDEX('Comparison - Category'!$V$128:$V$174,MATCH(J$20&$A55,'Comparison - Category'!$D$128:$D$174,0),)","v":32.279328741622408},{"$f":"INDEX('Comparison - Category'!$V$128:$V$174,MATCH(K$20&$A55,'Comparison - Category'!$D$128:$D$174,0),)","v":32.67222961244039},{"$f":"INDEX('Comparison - Category'!$V$128:$V$174,MATCH(L$20&$A55,'Comparison - Category'!$D$128:$D$174,0),)","v":50.911864463269751},{"$f":"INDEX('Comparison - Category'!$V$128:$V$174,MATCH(M$20&$A55,'Comparison - Category'!$D$128:$D$174,0),)","v":43.298890836931264}]
[null,"% Increase",{"$f":"C57/C56","v":5.5212385310630482E-2},{"$f":"D57/D56","v":6.0040102879607198E-2},{"$f":"E57/E56","v":2.1281904861091105E-2},{"$f":"F57/F56","v":3.2951193788568693E-2},9.5314962277927795E-2,{"$f":"H57/H56","v":{"$error":"#N/A"}},{"$error":"#N/A"},{"$f":"J57/J56","v":0.17693564621768931},{"$f":"K57/K56","v":0.13621977389779785},{"$f":"L57/L56","v":0.18675807172642264},{"$f":"M57/M56","v":0.19934704639996231}]
[null,{"$f":"\"Average Value \"&year_current","v":"Average Value 2018/19"},{"$f":"INDEX('Comparison - Category'!$H$69:$H$115,MATCH(C$20&$A55,'Comparison - Category'!$D$69:$D$115,0),)","v":672011.23771794909},{"$f":"INDEX('Comparison - Category'!$H$69:$H$115,MATCH(D$20&$A55,'Comparison - Category'!$D$69:$D$115,0),)","v":544773.85649196932},{"$f":"INDEX('Comparison - Category'!$H$69:$H$115,MATCH(E$20&$A55,'Comparison - Category'!$D$69:$D$115,0),)","v":487516.51143401623},{"$f":"INDEX('Comparison - Category'!$H$69:$H$115,MATCH(F$20&$A55,'Comparison - Category'!$D$69:$D$115,0),)","v":550314.81927710841},{"$f":"INDEX('Comparison - Category'!$H$69:$H$115,MATCH(G$20&$A55,'Comparison - Category'!$D$69:$D$115,0),)","v":590505.56110822374},{"$f":"INDEX('Comparison - Category'!$H$69:$H$115,MATCH(H$20&$A55,'Comparison - Category'!$D$69:$D$115,0),)","v":{"$error":"#N/A"}},{"$f":"INDEX('Comparison - Category'!$H$69:$H$115,MATCH(I$20&$A55,'Comparison - Category'!$D$69:$D$115,0),)","v":{"$error":"#N/A"}},{"$f":"INDEX('Comparison - Category'!$H$69:$H$115,MATCH(J$20&$A55,'Comparison - Category'!$D$69:$D$115,0),)","v":473708.83973424078},{"$f":"INDEX('Comparison - Category'!$H$69:$H$115,MATCH(K$20&$A55,'Comparison - Category'!$D$69:$D$115,0),)","v":575897.29729729728},{"$f":"INDEX('Comparison - Category'!$H$69:$H$115,MATCH(L$20&$A55,'Comparison - Category'!$D$69:$D$115,0),)","v":677132.38696109364},{"$f":"INDEX('Comparison - Category'!$H$69:$H$115,MATCH(M$20&$A55,'Comparison - Category'!$D$69:$D$115,0),)","v":1076050}]
[]
[]
[]
[null,"Consultation document"]
[]
[null,"Residential Property - including GST","Average Capital Value",{"$f":"\"Average Increase \nin \"&year_current","v":"Average Increase \nin 2018/19"},"Average Increase \nWeekly",{"$f":"\"Average Rates \n\"&year_current","v":"Average Rates \n2018/19"},"Average rates\nweekly","Increase %"]
[null,"Wellington city",{"$f":"INDEX($C$26:$M$26,,MATCH($B66,$C$20:$M$20,0))","v":554459.5066612442},{"$f":"INDEX($C$31:$M$31,,MATCH($B66,$C$20:$M$20,0))","v":35.75504434552132},{"$f":"+D66/52","v":0.68759700664464074},{"$f":"INDEX($C$29:$M$29,,MATCH($B66,$C$20:$M$20,0))","v":518.08269378741056},{"$f":"+F66/52","v":9.9631287266809725},{"$f":"INDEX($C$25:$M$25,,MATCH($B66,$C$20:$M$20,0))","v":7.413019839707341E-2}]
[null,"Hutt city",{"$f":"INDEX($C$26:$M$26,,MATCH($B67,$C$20:$M$20,0))","v":474858.71116478206},{"$f":"INDEX($C$31:$M$31,,MATCH($B67,$C$20:$M$20,0))","v":35.294604387220637},{"$f":"+D67/52","v":0.67874239206193532},{"$f":"INDEX($C$29:$M$29,,MATCH($B67,$C$20:$M$20,0))","v":632.43483287141157},{"$f":"+F67/52","v":12.162208324450223},{"$f":"INDEX($C$25:$M$25,,MATCH($B67,$C$20:$M$20,0))","v":5.9106057009111798E-2}]
[null,"Upper Hutt city",415367.22795655398,6.8335719997559599,0.13141484614915308,522.76144671388636,10.053104744497814,1.3245207973192692E-2]
[null,"Porirua city",495584.87684729067,17.147144571946473,0.32975278022973986,581.61612272082141,11.184925436938872,3.0377479074543631E-2]
[null,"Kāpiti Coast district excl Ōtaki ",571428.5434721834,53.989797628342622,1.0382653390065888,471.08951668565254,9.0594137824163958,0.12944098296293594]
[null,"Ōtaki rating area",350606.44239923835,25.762873650870905,0.49543987790136357,283.22635339267373,5.4466606421668029,0.10006418648853496]
[null,"Masterton district",329152.65419615776,33.719481296960154,0.64845156340307986,183.55491847558901,3.5299022783767118,0.22504343386245076]
[null,"Carterton district",352806.64715719066,40.708445388379971,0.78285471900730719,224.21326355559498,4.3117935299152883,0.22183856421298556]
[null,"South Wairarapa district",408450.32517807372,65.222660651266267,1.2542819356012744,270.82257251775769,5.2081263945722629,0.31723097572930536]
[]
[]
[null,"Rural Property - excluding GST","Average Capital Value","Average Increase \nper year","Average Increase \nper week","Average Rates \nper year","Average rates\nper week","Increase %"]
[null,"Wellington city",{"$f":"ROUND(INDEX($C$38:$M$38,,MATCH($B78,$C$20:$M$20,0)),-3)","v":763000},{"$f":"INDEX($C$36:$M$36,,MATCH($B78,$C$20:$M$20,0))","v":32.689590044108058},{"$f":"+D78/52","v":0.62864596238669346},{"$f":"INDEX($C$34:$M$34,,MATCH($B78,$C$20:$M$20,0))","v":433.71959020736989},{"$f":"+F78/52","v":8.3407613501417295},{"$f":"INDEX($C$37:$M$37,,MATCH($B78,$C$20:$M$20,0))","v":8.1514076330448895E-2}]
[null,"Hutt city",{"$f":"ROUND(INDEX($C$38:$M$38,,MATCH($B79,$C$20:$M$20,0)),-3)","v":649000},{"$f":"INDEX($C$36:$M$36,,MATCH($B79,$C$20:$M$20,0))","v":38.194401666548117},{"$f":"+D79/52","v":0.73450772435669454},{"$f":"INDEX($C$34:$M$34,,MATCH($B79,$C$20:$M$20,0))","v":495.04124589837693},{"$f":"+F79/52","v":9.5200239595841722},{"$f":"INDEX($C$37:$M$37,,MATCH($B79,$C$20:$M$20,0))","v":8.3604389849229674E-2}]
[null,"Upper Hutt city",682000,40.282795369192513,0.77466914171524059,443.89635279370498,8.5364683229558658,9.9805357446959828E-2]
[null,"Porirua city",1005000,42.025091503544104,0.80817483660661737,562.28429608424813,10.813159540081696,8.0777218612429286E-2]
[null,"Kāpiti Coast district",744000,1.4951803804180486,2.8753468854193241E-2,393.89530332685047,7.5749096793625093,3.8103463607277199E-3]
[null,"Masterton district",724000,36.60966313734798,0.70403198341053808,298.41187206473904,5.7386898473988275,0.1398371056047942]
[null,"Carterton district",854000,37.16417285276242,0.71469563178389273,368.13322411308059,7.0794850790977035,0.11228896693283735]
[null,"South Wairarapa district",955000,49.486030334290263,0.95165442950558199,405.87900913234574,7.8053655602374183,0.13885242773632403]
[null,"Tararua district",1076000,39.098890836931218,{"$f":"+D86/52","v":0.75190174686406186},263.302464297749,5.0635089288028654,0.17439013229539008]
[null,"These projected rates exclude the targeted rural pest and river management rates that are not charged to all ratepayers"]
[]
[]
[null,"Business Property - excluding GST","Average Capital Value","Average Increase \nper year","Average Increase \nper week","Average Rates \nper year","Average rates\nper week","Increase %"]
[null,"Wellington city - CBD",{"$f":"ROUND(+$C$52,-3)","v":2355000},{"$f":"ROUND(+$C$50,0)","v":348},{"$f":"+D91/52","v":6.6923076923076925},{"$f":"ROUND(+$C$48,0)","v":8954},{"$f":"+F91/52","v":172.19230769230768},{"$f":"C51","v":4.0479621461124417E-2}]
[null,"Wellington city",{"$f":"ROUND(INDEX($C$45:$M$45,,MATCH($B92,$C$20:$M$20,0)),-3)","v":2052000},{"$f":"INDEX($C$43:$M$43,,MATCH($B92,$C$20:$M$20,0))","v":201.6458637892531},3.877805072870252,{"$f":"INDEX($C$41:$M$41,,MATCH($B92,$C$20:$M$20,0))","v":1910.9375867822318},{"$f":"+F92/52","v":36.74879974581215},{"$f":"INDEX($C$44:$M$44,,MATCH($B92,$C$20:$M$20,0))","v":0.11797042077531981}]
[null,"Hutt city",{"$f":"ROUND(INDEX($C$45:$M$45,,MATCH($B93,$C$20:$M$20,0)),-3)","v":1598000},{"$f":"INDEX($C$43:$M$43,,MATCH($B93,$C$20:$M$20,0))","v":118.03674252012024},2.2699373561561584,{"$f":"INDEX($C$41:$M$41,,MATCH($B93,$C$20:$M$20,0))","v":1999.3061349838358},38.448194903535303,{"$f":"INDEX($C$44:$M$44,,MATCH($B93,$C$20:$M$20,0))","v":6.2743136625179982E-2}]
[null,"Upper Hutt city",1641000,90.458213830435398,1.7395810352006806,1939.9001272602159,37.305771678081072,4.8911086730310499E-2]
[null,"Porirua city",1380000,63.740468046868727,1.2257782316705526,1536.2739993179648,29.543730756114709,4.3286259153533659E-2]
[null,"Kāpiti Coast district",1109000,22.714766916727172,0.43682244070629178,887.4370891787745,17.066097868822588,2.6268278650777837E-2]
[null,"Masterton district",788000,51.222654941909298,0.98505105657517877,439.61366010404049,8.4541088481546254,0.13188424618774769]
[null,"Carterton district",426000,1.0374329101177864,1.9950632886880506E-2,267.77983886509003,5.1496122858671161,3.8892687737581231E-3]
[null,"South Wairarapa district",679000,33.732189668251351,0.64869595515867984,446.34640854692702,8.5835847797485965,8.1752368495497496E-2]
[null,"These projected rates exclude the targeted rural pest and river management rates that are not charged to all ratepayers"]
[]
[null,"You can estimate your own projected regional rates on our website"]
[]
[]
[]
[]
[null,"Residential Property - including GST","Average Capital Value","Average Increase \nper year","Average Increase \nper week","Average Rates \nper year","Average rates\nper week"]
[null,{"$f":"+B109","v":"Wellington city"},{"$f":"ROUND(C109,-5)-100000","v":400000},{"$f":"ROUND($C108/$C109*D109,0)","v":26},{"$f":"+D108/52","v":0.5},{"$f":"ROUND($C108/$C109*F109,0)","v":374},{"$f":"+F108/52","v":7.1923076923076925}]
[null,{"$f":"+B110","v":"Wellington city"},{"$f":"ROUND(C110,-5)-100000","v":500000},{"$f":"ROUND($C109/$C110*D110,0)","v":32},{"$f":"+D109/52","v":0.61538461538461542},{"$f":"ROUND($C109/$C110*F110,0)","v":468},{"$f":"+F109/52","v":9}]
[null,"Wellington city",{"$f":"ROUND(INDEX($C$26:$M$26,,MATCH($B110,$C$20:$M$20,0)),-3)","v":554000},{"$f":"INDEX($C$31:$M$31,,MATCH($B110,$C$20:$M$20,0))","v":35.75504434552132},{"$f":"+D110/52","v":0.68759700664464074},{"$f":"INDEX($C$29:$M$29,,MATCH($B110,$C$20:$M$20,0))","v":518.08269378741056},{"$f":"+F110/52","v":9.9631287266809725}]
[null,{"$f":"+B110","v":"Wellington city"},{"$f":"ROUND(C110,-5)+100000","v":700000},{"$f":"ROUND($C111/$C110*D110,0)","v":45},{"$f":"+D111/52","v":0.86538461538461542},{"$f":"ROUND($C111/$C110*F110,0)","v":655},{"$f":"+F111/52","v":12.596153846153847}]
[null,{"$f":"+B111","v":"Wellington city"},{"$f":"ROUND(C111,-5)+100000","v":800000},{"$f":"ROUND($C112/$C111*D111,0)","v":51},{"$f":"+D112/52","v":0.98076923076923073},{"$f":"ROUND($C112/$C111*F111,0)","v":749},{"$f":"+F112/52","v":14.403846153846153}]
[]
[]
[]
[null,"Residential Property - including GST","Average Capital Value","Average Increase \nper year","Average Increase \nper week","Average Rates \nper year","Average rates\nper week"]
[null,{"$f":"+B118","v":"Hutt city"},{"$f":"ROUND(C118,-5)-100000","v":300000},{"$f":"ROUND($C117/$C118*D118,0)","v":23},{"$f":"+D117/52","v":0.44230769230769229},{"$f":"ROUND($C117/$C118*F118,0)","v":400},{"$f":"+F117/52","v":7.6923076923076925}]
[null,{"$f":"+B119","v":"Hutt city"},{"$f":"ROUND(C119,-5)-100000","v":400000},{"$f":"ROUND($C118/$C119*D119,0)","v":30},{"$f":"+D118/52","v":0.57692307692307687},{"$f":"ROUND($C118/$C119*F119,0)","v":533},{"$f":"+F118/52","v":10.25}]
[null,{"$f":"+B67","v":"Hutt city"},{"$f":"ROUND(INDEX($C$26:$M$26,,MATCH($B119,$C$20:$M$20,0)),-3)","v":475000},{"$f":"INDEX($C$31:$M$31,,MATCH($B119,$C$20:$M$20,0))","v":35.294604387220637},{"$f":"+D119/52","v":0.67874239206193532},{"$f":"INDEX($C$29:$M$29,,MATCH($B119,$C$20:$M$20,0))","v":632.43483287141157},{"$f":"+F119/52","v":12.162208324450223}]
[null,{"$f":"+B119","v":"Hutt city"},{"$f":"ROUND(C119,-5)+100000","v":600000},{"$f":"ROUND($C120/$C119*D119,0)","v":45},{"$f":"+D120/52","v":0.86538461538461542},{"$f":"ROUND($C120/$C119*F119,0)","v":799},{"$f":"+F120/52","v":15.365384615384615}]
[null,{"$f":"+B120","v":"Hutt city"},{"$f":"ROUND(C120,-5)+100000","v":700000},{"$f":"ROUND($C121/$C120*D120,0)","v":53},{"$f":"+D121/52","v":1.0192307692307692},{"$f":"ROUND($C121/$C120*F120,0)","v":932},{"$f":"+F121/52","v":17.923076923076923}]
[]
[]
[]
[null,"Residential Property - including GST","Average Capital Value","Average Increase \nper year","Average Increase \nper week","Average Rates \nper year","Average rates\nper week"]
[null,{"$f":"+B127","v":"Upper Hutt city"},{"$f":"ROUND(C127,-5)-100000","v":200000},{"$f":"ROUND($C126/$C127*D127,0)","v":3},{"$f":"+D126/52","v":5.7692307692307696E-2},{"$f":"ROUND($C126/$C127*F127,0)","v":252},{"$f":"+F126/52","v":4.8461538461538458}]
[null,{"$f":"+B128","v":"Upper Hutt city"},{"$f":"ROUND(C128,-5)-100000","v":300000},{"$f":"ROUND($C127/$C128*D128,0)","v":5},{"$f":"+D127/52","v":9.6153846153846159E-2},{"$f":"ROUND($C127/$C128*F128,0)","v":378},{"$f":"+F127/52","v":7.2692307692307692}]
[null,{"$f":"+B68","v":"Upper Hutt city"},{"$f":"ROUND(INDEX($C$26:$M$26,,MATCH($B128,$C$20:$M$20,0)),-3)","v":415000},{"$f":"INDEX($C$31:$M$31,,MATCH($B128,$C$20:$M$20,0))","v":6.8335719997559599},{"$f":"+D128/52","v":0.13141484614915308},{"$f":"INDEX($C$29:$M$29,,MATCH($B128,$C$20:$M$20,0))","v":522.76144671388636},{"$f":"+F128/52","v":10.053104744497814}]
[null,{"$f":"+B128","v":"Upper Hutt city"},{"$f":"ROUND(C128,-5)+100000","v":500000},{"$f":"ROUND($C129/$C128*D128,0)","v":8},{"$f":"+D129/52","v":0.15384615384615385},{"$f":"ROUND($C129/$C128*F128,0)","v":630},{"$f":"+F129/52","v":12.115384615384615}]
[null,{"$f":"+B129","v":"Upper Hutt city"},{"$f":"ROUND(C129,-5)+100000","v":600000},{"$f":"ROUND($C130/$C129*D129,0)","v":10},{"$f":"+D130/52","v":0.19230769230769232},{"$f":"ROUND($C130/$C129*F129,0)","v":756},{"$f":"+F130/52","v":14.538461538461538}]
[]
[]
[]
[null,"Residential Property - including GST","Average Capital Value","Average Increase \nper year","Average Increase \nper week","Average Rates \nper year","Average rates\nper week"]
[null,{"$f":"+B136","v":"Porirua city"},{"$f":"ROUND(C136,-5)-100000","v":300000},{"$f":"ROUND($C135/$C136*D136,0)","v":11},{"$f":"+D135/52","v":0.21153846153846154},{"$f":"ROUND($C135/$C136*F136,0)","v":352},{"$f":"+F135/52","v":6.7692307692307692}]
[null,{"$f":"+B137","v":"Porirua city"},{"$f":"ROUND(C137,-5)-100000","v":400000},{"$f":"ROUND($C136/$C137*D137,0)","v":14},{"$f":"+D136/52","v":0.26923076923076922},{"$f":"ROUND($C136/$C137*F137,0)","v":469},{"$f":"+F136/52","v":9.0192307692307701}]
[null,{"$f":"+B69","v":"Porirua city"},{"$f":"ROUND(INDEX($C$26:$M$26,,MATCH($B137,$C$20:$M$20,0)),-3)","v":496000},{"$f":"INDEX($C$31:$M$31,,MATCH($B137,$C$20:$M$20,0))","v":17.147144571946473},{"$f":"+D137/52","v":0.32975278022973986},{"$f":"INDEX($C$29:$M$29,,MATCH($B137,$C$20:$M$20,0))","v":581.61612272082141},{"$f":"+F137/52","v":11.184925436938872}]
[null,{"$f":"+B137","v":"Porirua city"},{"$f":"ROUND(C137,-5)+100000","v":600000},{"$f":"ROUND($C138/$C137*D137,0)","v":21},{"$f":"+D138/52","v":0.40384615384615385},{"$f":"ROUND($C138/$C137*F137,0)","v":704},{"$f":"+F138/52","v":13.538461538461538}]
[null,{"$f":"+B138","v":"Porirua city"},{"$f":"ROUND(C138,-5)+100000","v":700000},{"$f":"ROUND($C139/$C138*D138,0)","v":25},{"$f":"+D139/52","v":0.48076923076923078},{"$f":"ROUND($C139/$C138*F138,0)","v":821},{"$f":"+F139/52","v":15.788461538461538}]
[]
[]
[]
[null,"Residential Property - including GST","Average Capital Value","Average Increase \nper year","Average Increase \nper week","Average Rates \nper year","Average rates\nper week"]
[null,{"$f":"+B145","v":"Kāpiti Coast district excl Ōtaki "},{"$f":"ROUND(C145,-5)-100000","v":400000},{"$f":"ROUND($C144/$C145*D145,0)","v":38},{"$f":"+D144/52","v":0.73076923076923073},{"$f":"ROUND($C144/$C145*F145,0)","v":330},{"$f":"+F144/52","v":6.3461538461538458}]
[null,{"$f":"+B146","v":"Kāpiti Coast district excl Ōtaki "},{"$f":"ROUND(C146,-5)-100000","v":500000},{"$f":"ROUND($C145/$C146*D146,0)","v":47},{"$f":"+D145/52","v":0.90384615384615385},{"$f":"ROUND($C145/$C146*F146,0)","v":413},{"$f":"+F145/52","v":7.9423076923076925}]
[null,{"$f":"+B70","v":"Kāpiti Coast district excl Ōtaki "},{"$f":"ROUND(INDEX($C$26:$M$26,,MATCH($B146,$C$20:$M$20,0)),-3)","v":571000},{"$f":"INDEX($C$31:$M$31,,MATCH($B146,$C$20:$M$20,0))","v":53.989797628342622},{"$f":"+D146/52","v":1.0382653390065888},{"$f":"INDEX($C$29:$M$29,,MATCH($B146,$C$20:$M$20,0))","v":471.08951668565254},{"$f":"+F146/52","v":9.0594137824163958}]
[null,{"$f":"+B146","v":"Kāpiti Coast district excl Ōtaki "},{"$f":"ROUND(C146,-5)+100000","v":700000},{"$f":"ROUND($C147/$C146*D146,0)","v":66},{"$f":"+D147/52","v":1.2692307692307692},{"$f":"ROUND($C147/$C146*F146,0)","v":578},{"$f":"+F147/52","v":11.115384615384615}]
[null,{"$f":"+B147","v":"Kāpiti Coast district excl Ōtaki "},{"$f":"ROUND(C147,-5)+100000","v":800000},{"$f":"ROUND($C148/$C147*D147,0)","v":75},{"$f":"+D148/52","v":1.4423076923076923},{"$f":"ROUND($C148/$C147*F147,0)","v":661},{"$f":"+F148/52","v":12.711538461538462}]

{"sheet":"Mechanisms","index":33,"n_rows":19,"n_cols":8,"rows_kept":19,"cut":false,"hidden":false,"merged":[[14,0,14,4],[18,0,18,4],[16,0,16,4]]}
["Rating mechanisms"]
["Funding mechanism","Groups of activities funded","Valuation system","Matters for differentiation/categories of land","Calculation factor","Years used"]
["General rate"]
["General rate","All Groups of activities except Public Transport are funded to some extent by this rate. Activities that are not funded are Warm Greater Wellington and the Wellington Regional Strategy.","Capital value","Where the land is situated.","Cents per dollar of rateable capital value","2018-2028",null,"Only display column f for LTP year"]
["Targeted rates"]
["Wellington Regional Strategy","Regional Leadership","Business category - capital value\nResidential and Rural categories - not based on value","Where the land is situated and the use to which the land is put.","Business - cents per dollar of rateable capital value\nResidential - fixed dollar amount per rating unit\nRural - fixed dollar amount per rating unit","2018-2028"]
["Warm Greater Wellington","Regional Leadership","Extent of service provided","Provision of service to the land.","Extent of service, calculated as a percentage of the service.","2018-2028"]
["Public transport","Public Transport","Capital value","Where the land is situated and the use to which the land is put.","Cents per dollar of rateable capital value","2018-2028"]
["Pest management","Environment","Land area","Where the land is situated and the area of land within each rating unit.","Dollars per hectare","2018-2028"]
["River  management","Flood Protection","Capital value/land value","Where the land is situated.","Cents per dollar of rateable capital value / land value.","2018-2028",null,"should have been new page 216"]
["Wairarapa river management schemes ","Flood Protection","Land area/inhabited parts/services provided","Where the land is situated (in some cases set under section146 of the Local Government (Rating) Act 2002 using approved classification and differential registers) and/or the benefits accruing through the provision of services and in some cases use.","Dollars per hectare in the area protected, or dollars per point attributed to each rating unit and in some cases a fixed charge per separately used or inhabited part (dwelling).1","2018-2028"]
["Wairarapa catchment schemes ","Flood Protection","Land area/land value/inhabited parts","Where the land is situated (in some cases set under S146 of the Local Government (Rating) Act 2002 using approved classification and differential registers) and in some cases use and land value.","Dollars per hectare or cents per metre of river frontage in the area protected and in some cases a fixed charge per separately used or inhabited part (dwelling) and cents per dollar of rateable land value.1","2018-2028"]
["Wairarapa drainage schemes","Flood Protection","Land area","Where the land is situated (Set under S146 of the Local Government (Rating) Act 2002 using approved classification and differential registers).","Dollars per hectare in the area protected.","2018-2028"]
["Differential on the general rate"]
["There are no differentials on Greater Wellington Regional Council's general rate."]
["Estimate of projected valuation"]
[" Greater Wellington uses an \"estimate of projected valuation\" to recognise that valuation dates vary across the region (section 131, Local Government (Rating) Act 2002). "]
["Separately used or inhabited part"]
["1 \"Separately used or inhabited part\" (dwelling) includes any part of a rating unit separately used or inhabited by the owner or any other person who has the right to use or inhabit that part by virtue of a tenancy, lease, licence or other agreement. At a minimum, the land or premises intended to form the separately used or inhabited part of the rating unit must be capable of actual habitation, or actual separate use. To avoid doubt, a rating unit that has only one use (ie, it does not have separate parts or is vacant land) is treated as being one separately used or inhabited part (dwelling)."]

{"sheet":"For IT","index":34,"n_rows":158,"n_cols":19,"rows_kept":158,"cut":false,"hidden":false,"merged":[]}
["Wellington Regional Council"]
["Figures for IT to upload to website"]
[]
["Rate_Class_ID","Rate_Class_Name","Model"]
[1,"Residential","Residential"]
[2,"Business","Business",null,null,null,null,null,null,null,"per $",null,"Model name","Rate","Look up rate name","Category"]
[3,"Rural","Rural",null,null,"TA_ID","Rate_Class_ID","Rates_ID","Rates_Status_ID","Rates_year","Rates_value"]
[4,"Regional CBD","Regional CBD",null,null,41,1,1,2,{"$f":"year_current","v":"2018/19"},{"$f":"ROUND(INDEX('Comparison - Category'!$X$81:$AB$107,MATCH(M8&P8,'Comparison - Category'!$D$81:$D$107,0),MATCH(O8,'Comparison - Category'!$X$66:$AB$66,0)),10)","v":4.4329360599999999E-2},null,{"$f":"VLOOKUP(F8,$A$30:$B$38,2,FALSE)","v":"Wellington city"},{"$f":"VLOOKUP(H8,$A$19:$B$25,2,FALSE)","v":"General rate"},{"$f":"VLOOKUP(H8,$A$19:$C$25,3,FALSE)","v":"General rate"},{"$f":"VLOOKUP(G8,$A$5:$B$10,2,FALSE)","v":"Residential"}]
[5,"Residential - excl Otaki"," excl Otaki",null,null,{"$f":"+F8","v":41},1,2,{"$f":"+I8","v":2},"2018/19",{"$f":"ROUND(INDEX('Comparison - Category'!$X$81:$AB$107,MATCH(M9&P9,'Comparison - Category'!$D$81:$D$107,0),MATCH(O9,'Comparison - Category'!$X$66:$AB$66,0)),10)","v":8.2086299999999994E-5},null,"Wellington city","River management rate","River management rate",{"$f":"VLOOKUP(G9,$A$5:$B$10,2,FALSE)","v":"Residential"}]
[6,"Residential - Otaki rating area",null,null,null,41,1,3,{"$f":"+I9","v":2},"2018/19",{"$f":"ROUND(INDEX('Comparison - Category'!$X$81:$AB$107,MATCH(M10&P10,'Comparison - Category'!$D$81:$D$107,0),MATCH(O10,'Comparison - Category'!$X$66:$AB$66,0)),10)","v":3.4315076E-2},null,"Wellington city","Public transport rate","Public transport rate","Residential"]
[null,null,null,null,null,41,1,4,2,"2018/19",{"$f":"ROUND(INDEX('Comparison - Category'!$X$81:$AB$107,MATCH(M11&P11,'Comparison - Category'!$D$81:$D$107,0),MATCH(O11,'Comparison - Category'!$X$66:$AB$66,0)),10)","v":0},null,"Wellington city","Stadium purposes rate","Stadium purposes rate","Residential"]
[null,null,null,null,null,41,1,5,2,"2018/19",{"$f":"ROUND(INDEX('Comparison - Category'!$X$81:$AB$107,MATCH(M12&P12,'Comparison - Category'!$D$81:$D$107,0),MATCH(O12,'Comparison - Category'!$X$66:$AB$66,0)),10)","v":14},null,"Wellington city","Wellington regional strategy rate","Wellington regional strategy rate","Residential"]
["Rates_status_ID","Rates_status",null,null,null,41,{"$f":"G8+1","v":2},1,2,"2018/19",{"$f":"ROUND(INDEX('Comparison - Category'!$X$81:$AB$107,MATCH(M13&P13,'Comparison - Category'!$D$81:$D$107,0),MATCH(O13,'Comparison - Category'!$X$66:$AB$66,0)),10)","v":4.4329360599999999E-2},null,"Wellington city","General rate","General rate","Business"]
[1,"Draft",null,null,null,{"$f":"+F13","v":41},2,2,2,"2018/19",{"$f":"ROUND(INDEX('Comparison - Category'!$X$81:$AB$107,MATCH(M14&P14,'Comparison - Category'!$D$81:$D$107,0),MATCH(O14,'Comparison - Category'!$X$66:$AB$66,0)),10)","v":8.2086299999999994E-5},null,"Wellington city","River management rate","River management rate","Business"]
[2,"Approved",null,null,null,41,2,3,2,"2018/19",{"$f":"ROUND(INDEX('Comparison - Category'!$X$81:$AB$107,MATCH(M15&P15,'Comparison - Category'!$D$81:$D$107,0),MATCH(O15,'Comparison - Category'!$X$66:$AB$66,0)),10)","v":3.7503386399999998E-2},null,"Wellington city","Public transport rate","Public transport rate","Business"]
[null,null,null,null,null,41,2,4,2,"2018/19",{"$f":"ROUND(INDEX('Comparison - Category'!$X$81:$AB$107,MATCH(M16&P16,'Comparison - Category'!$D$81:$D$107,0),MATCH(O16,'Comparison - Category'!$X$66:$AB$66,0)),10)","v":0},null,"Wellington city","Stadium purposes rate","Stadium purposes rate","Business"]
[null,null,null,null,null,41,2,6,2,"2018/19",{"$f":"ROUND(INDEX('Comparison - Category'!$X$81:$AB$107,MATCH(M17&P17,'Comparison - Category'!$D$81:$D$107,0),MATCH(O17,'Comparison - Category'!$X$66:$AB$66,0)),10)","v":1.1225542099999999E-2},null,"Wellington city","Wellington regional strategy rate - Business","Wellington regional strategy rate","Business"]
["Rate_ID","Rate_Name","Model",null,null,41,3,1,2,"2018/19",{"$f":"ROUND(INDEX('Comparison - Category'!$X$81:$AB$107,MATCH(M18&P18,'Comparison - Category'!$D$81:$D$107,0),MATCH(O18,'Comparison - Category'!$X$66:$AB$66,0)),10)","v":4.4329360599999999E-2},null,"Wellington city","General rate","General rate","Rural"]
[1,"General rate","General rate",null,null,41,3,2,2,"2018/19",{"$f":"ROUND(INDEX('Comparison - Category'!$X$81:$AB$107,MATCH(M19&P19,'Comparison - Category'!$D$81:$D$107,0),MATCH(O19,'Comparison - Category'!$X$66:$AB$66,0)),10)","v":8.2086299999999994E-5},null,"Wellington city","River management rate","River management rate","Rural"]
[2,"River management rate","River management rate",null,null,41,3,3,2,"2018/19",{"$f":"ROUND(INDEX('Comparison - Category'!$X$81:$AB$107,MATCH(M20&P20,'Comparison - Category'!$D$81:$D$107,0),MATCH(O20,'Comparison - Category'!$X$66:$AB$66,0)),10)","v":8.7590147999999993E-3},null,"Wellington city","Public transport rate","Public transport rate","Rural"]
[3,"Public transport rate","Public transport rate",null,null,41,3,4,2,"2018/19",{"$f":"ROUND(INDEX('Comparison - Category'!$X$81:$AB$107,MATCH(M21&P21,'Comparison - Category'!$D$81:$D$107,0),MATCH(O21,'Comparison - Category'!$X$66:$AB$66,0)),10)","v":0},null,"Wellington city","Stadium purposes rate","Stadium purposes rate","Rural"]
[4,"Stadium purposes rate","Stadium purposes rate",null,null,41,3,5,2,"2018/19",{"$f":"ROUND(INDEX('Comparison - Category'!$X$81:$AB$107,MATCH(M22&P22,'Comparison - Category'!$D$81:$D$107,0),MATCH(O22,'Comparison - Category'!$X$66:$AB$66,0)),10)","v":28},null,"Wellington city","Wellington regional strategy rate","Wellington regional strategy rate","Rural"]
[5,"Wellington regional strategy rate","Wellington regional strategy rate",null,null,41,4,1,2,"2018/19",{"$f":"ROUND(INDEX('Comparison - Category'!$X$81:$AB$107,MATCH(M23&P23,'Comparison - Category'!$D$81:$D$107,0),MATCH(O23,'Comparison - Category'!$X$66:$AB$66,0)),10)","v":4.4329360599999999E-2},null,"Wellington city","General rate","General rate","Regional CBD"]
[6,"Wellington regional strategy rate - Business","Wellington regional strategy rate",null,null,41,4,2,2,"2018/19",{"$f":"ROUND(INDEX('Comparison - Category'!$X$81:$AB$107,MATCH(M24&P24,'Comparison - Category'!$D$81:$D$107,0),MATCH(O24,'Comparison - Category'!$X$66:$AB$66,0)),10)","v":8.2086299999999994E-5},null,"Wellington city","River management rate","River management rate","Regional CBD"]
[null,null,null,null,null,41,4,3,2,"2018/19",{"$f":"ROUND(INDEX('Comparison - Category'!$X$81:$AB$107,MATCH(M25&P25,'Comparison - Category'!$D$81:$D$107,0),MATCH(O25,'Comparison - Category'!$X$66:$AB$66,0)),10)","v":0.32453831719999998},null,"Wellington city","Public transport rate","Public transport rate","Regional CBD"]
[null,null,null,null,null,41,4,4,2,"2018/19",{"$f":"ROUND(INDEX('Comparison - Category'!$X$81:$AB$107,MATCH(M26&P26,'Comparison - Category'!$D$81:$D$107,0),MATCH(O26,'Comparison - Category'!$X$66:$AB$66,0)),10)","v":0},null,"Wellington city","Stadium purposes rate","Stadium purposes rate","Regional CBD"]
[null,null,null,null,null,41,4,6,2,"2018/19",{"$f":"ROUND(INDEX('Comparison - Category'!$X$81:$AB$107,MATCH(M27&P27,'Comparison - Category'!$D$81:$D$107,0),MATCH(O27,'Comparison - Category'!$X$66:$AB$66,0)),10)","v":1.1225542099999999E-2},null,"Wellington city","Wellington regional strategy rate - Business","Wellington regional strategy rate","Regional CBD"]
[]
["TA_ID","TA_NAME","Model",null,null,"TA_ID","Rate_Class_ID","Rates_ID","Rates_Status_ID","Rates_year","Rates_value"]
[41,"Wellington city","Wellington city",null,null,42,1,1,{"$f":"$I$8","v":2},{"$f":"year_current","v":"2018/19"},{"$f":"ROUND(INDEX('Comparison - Category'!$X$81:$AB$107,MATCH(M30&P30,'Comparison - Category'!$D$81:$D$107,0),MATCH(O30,'Comparison - Category'!$X$66:$AB$66,0)),10)","v":3.7654862300000001E-2},null,{"$f":"VLOOKUP(F30,$A$30:$B$38,2,FALSE)","v":"Hutt city"},{"$f":"VLOOKUP(H30,$A$19:$B$25,2,FALSE)","v":"General rate"},{"$f":"VLOOKUP(H30,$A$19:$C$25,3,FALSE)","v":"General rate"},{"$f":"VLOOKUP(G30,$A$5:$B$10,2,FALSE)","v":"Residential"}]
[42,"Hutt city","Hutt city",null,null,{"$f":"+F30","v":42},{"$f":"+G30","v":1},2,{"$f":"+I30","v":2},"2018/19",{"$f":"ROUND(INDEX('Comparison - Category'!$X$81:$AB$107,MATCH(M31&P31,'Comparison - Category'!$D$81:$D$107,0),MATCH(O31,'Comparison - Category'!$X$66:$AB$66,0)),10)","v":2.0355359399999998E-2},null,"Hutt city","River management rate","River management rate","Residential"]
[43,"Upper Hutt city","Rest of Upper Hutt city",null,null,42,1,3,{"$f":"+I31","v":2},"2018/19",{"$f":"ROUND(INDEX('Comparison - Category'!$X$81:$AB$107,MATCH(M32&P32,'Comparison - Category'!$D$81:$D$107,0),MATCH(O32,'Comparison - Category'!$X$66:$AB$66,0)),10)","v":5.4853525E-2},null,"Hutt city","Public transport rate","Public transport rate","Residential"]
[44,"Porirua city","Porirua city",null,null,42,1,4,2,"2018/19",{"$f":"ROUND(INDEX('Comparison - Category'!$X$81:$AB$107,MATCH(M33&P33,'Comparison - Category'!$D$81:$D$107,0),MATCH(O33,'Comparison - Category'!$X$66:$AB$66,0)),10)","v":0},null,"Hutt city","Stadium purposes rate","Stadium purposes rate","Residential"]
[45,"Kāpiti Coast district","Kāpiti Coast district",null,null,{"$f":"+F33","v":42},1,5,2,"2018/19",{"$f":"ROUND(INDEX('Comparison - Category'!$X$81:$AB$107,MATCH(M34&P34,'Comparison - Category'!$D$81:$D$107,0),MATCH(O34,'Comparison - Category'!$X$66:$AB$66,0)),10)","v":14},null,"Hutt city","Wellington regional strategy rate","Wellington regional strategy rate","Residential"]
[46,"Masterton district","Masterton district",null,null,{"$f":"+F34","v":42},2,1,2,"2018/19",{"$f":"ROUND(INDEX('Comparison - Category'!$X$81:$AB$107,MATCH(M35&P35,'Comparison - Category'!$D$81:$D$107,0),MATCH(O35,'Comparison - Category'!$X$66:$AB$66,0)),10)","v":3.7654862300000001E-2},null,"Hutt city","General rate","General rate","Business"]
[47,"Carterton district","Carterton district",null,null,{"$f":"+F35","v":42},{"$f":"+G35","v":2},2,2,"2018/19",{"$f":"ROUND(INDEX('Comparison - Category'!$X$81:$AB$107,MATCH(M36&P36,'Comparison - Category'!$D$81:$D$107,0),MATCH(O36,'Comparison - Category'!$X$66:$AB$66,0)),10)","v":2.0355359399999998E-2},null,"Hutt city","River management rate","River management rate","Business"]
[48,"South Wairarapa district","South Wairarapa district",null,null,{"$f":"+F36","v":42},2,3,2,"2018/19",{"$f":"ROUND(INDEX('Comparison - Category'!$X$81:$AB$107,MATCH(M37&P37,'Comparison - Category'!$D$81:$D$107,0),MATCH(O37,'Comparison - Category'!$X$66:$AB$66,0)),10)","v":5.7561783999999998E-2},null,"Hutt city","Public transport rate","Public transport rate","Business"]
[49,"Tararua district","Tararua district",null,null,{"$f":"+F37","v":42},2,4,2,"2018/19",{"$f":"ROUND(INDEX('Comparison - Category'!$X$81:$AB$107,MATCH(M38&P38,'Comparison - Category'!$D$81:$D$107,0),MATCH(O38,'Comparison - Category'!$X$66:$AB$66,0)),10)","v":0},null,"Hutt city","Stadium purposes rate","Stadium purposes rate","Business"]
[null,null,null,null,null,{"$f":"+F38","v":42},2,6,2,"2018/19",{"$f":"ROUND(INDEX('Comparison - Category'!$X$81:$AB$107,MATCH(M39&P39,'Comparison - Category'!$D$81:$D$107,0),MATCH(O39,'Comparison - Category'!$X$66:$AB$66,0)),10)","v":9.5353561999999992E-3},null,"Hutt city","Wellington regional strategy rate - Business","Wellington regional strategy rate","Business"]
[null,null,null,null,null,{"$f":"+F39","v":42},3,1,2,"2018/19",{"$f":"ROUND(INDEX('Comparison - Category'!$X$81:$AB$107,MATCH(M40&P40,'Comparison - Category'!$D$81:$D$107,0),MATCH(O40,'Comparison - Category'!$X$66:$AB$66,0)),10)","v":3.7654862300000001E-2},null,"Hutt city","General rate","General rate","Rural"]
[null,null,null,null,null,{"$f":"+F40","v":42},{"$f":"+G40","v":3},2,2,"2018/19",{"$f":"ROUND(INDEX('Comparison - Category'!$X$81:$AB$107,MATCH(M41&P41,'Comparison - Category'!$D$81:$D$107,0),MATCH(O41,'Comparison - Category'!$X$66:$AB$66,0)),10)","v":2.0355359399999998E-2},null,"Hutt city","River management rate","River management rate","Rural"]
[null,null,null,null,null,{"$f":"+F41","v":42},3,3,2,"2018/19",{"$f":"ROUND(INDEX('Comparison - Category'!$X$81:$AB$107,MATCH(M42&P42,'Comparison - Category'!$D$81:$D$107,0),MATCH(O42,'Comparison - Category'!$X$66:$AB$66,0)),10)","v":1.39462918E-2},null,"Hutt city","Public transport rate","Public transport rate","Rural"]
[null,null,null,null,null,{"$f":"+F42","v":42},3,4,2,"2018/19",{"$f":"ROUND(INDEX('Comparison - Category'!$X$81:$AB$107,MATCH(M43&P43,'Comparison - Category'!$D$81:$D$107,0),MATCH(O43,'Comparison - Category'!$X$66:$AB$66,0)),10)","v":0},null,"Hutt city","Stadium purposes rate","Stadium purposes rate","Rural"]
[null,null,null,null,null,{"$f":"+F43","v":42},3,5,2,"2018/19",{"$f":"ROUND(INDEX('Comparison - Category'!$X$81:$AB$107,MATCH(M44&P44,'Comparison - Category'!$D$81:$D$107,0),MATCH(O44,'Comparison - Category'!$X$66:$AB$66,0)),10)","v":28},null,"Hutt city","Wellington regional strategy rate","Wellington regional strategy rate","Rural"]
[]
[null,null,null,null,null,"TA_ID","Rate_Class_ID","Rates_ID","Rates_Status_ID","Rates_year","Rates_value"]
[null,null,null,null,null,43,1,1,{"$f":"$I$8","v":2},{"$f":"year_current","v":"2018/19"},{"$f":"ROUND(INDEX(Gen!$E$10:$E$25,MATCH(R47,Gen!$A$10:$A$25,0),),10)","v":3.7522778899999998E-2},null,{"$f":"VLOOKUP(F47,$A$30:$B$38,2,FALSE)","v":"Upper Hutt city"},{"$f":"VLOOKUP(H47,$A$19:$B$25,2,FALSE)","v":"General rate"},{"$f":"VLOOKUP(H47,$A$19:$C$25,3,FALSE)","v":"General rate"},{"$f":"VLOOKUP(G47,$A$5:$B$10,2,FALSE)","v":"Residential"},null,"Rest of Upper Hutt City"]
[null,null,null,null,null,{"$f":"+F47","v":43},{"$f":"+G47","v":1},2,{"$f":"+I47","v":2},"2018/19",{"$f":"ROUND(INDEX('River management'!$D$10:$D$25,MATCH(R47,'River management'!$A$10:$A$25,0),),10)","v":8.1664193E-3},null,"Upper Hutt city","River management rate","River management rate","Residential",null,"Rest of Upper Hutt City"]
[null,null,null,null,null,{"$f":"+F48","v":43},1,3,{"$f":"+I48","v":2},"2018/19",{"$f":"ROUND(INDEX('Public transport'!$J$23:$J$60,MATCH(R49&P49,'Public transport'!$D$23:$D$60,0),),10)","v":6.0549972600000002E-2},null,"Upper Hutt city","Public transport rate","Public transport rate","Residential",null,"Rest of Upper Hutt City"]
[null,null,null,null,null,{"$f":"+F49","v":43},1,4,2,"2018/19",{"$f":"ROUND(INDEX(Stadium!$H$23:$H$60,MATCH(R50&P50,Stadium!$D$23:$D$60,0),),10)","v":0},null,"Upper Hutt city","Stadium purposes rate","Stadium purposes rate","Residential",null,"Rest of Upper Hutt City"]
[null,null,null,null,null,{"$f":"+F50","v":43},{"$f":"+G50","v":1},5,2,"2018/19",{"$f":"ROUND(INDEX('Comparison - Category'!$X$81:$AB$107,MATCH(M51&P51,'Comparison - Category'!$D$81:$D$107,0),MATCH(O51,'Comparison - Category'!$X$66:$AB$66,0)),10)","v":14},null,"Upper Hutt city","Wellington regional strategy rate","Wellington regional strategy rate","Residential",null,"Upper Hutt City"]
[null,null,null,null,null,{"$f":"+F51","v":43},2,1,2,"2018/19",{"$f":"ROUND(INDEX(Gen!$E$10:$E$25,MATCH(R52,Gen!$A$10:$A$25,0),),10)","v":3.7522778899999998E-2},null,"Upper Hutt city","General rate","General rate","Business",null,"Rest of Upper Hutt City"]
[null,null,null,null,null,{"$f":"+F52","v":43},2,2,2,"2018/19",{"$f":"ROUND(INDEX('River management'!$D$10:$D$25,MATCH(R52,'River management'!$A$10:$A$25,0),),10)","v":8.1664193E-3},null,"Upper Hutt city","River management rate","River management rate","Business",null,"Rest of Upper Hutt City"]
[null,null,null,null,null,{"$f":"+F53","v":43},2,3,2,"2018/19",{"$f":"ROUND(INDEX('Public transport'!$J$23:$J$60,MATCH(R54&P54,'Public transport'!$D$23:$D$60,0),),10)","v":6.19410866E-2},null,"Upper Hutt city","Public transport rate","Public transport rate","Business",null,"Rest of Upper Hutt City"]
[null,null,null,null,null,{"$f":"+F54","v":43},2,4,2,"2018/19",{"$f":"ROUND(INDEX(Stadium!$H$23:$H$60,MATCH(R55&P55,Stadium!$D$23:$D$60,0),),10)","v":0},null,"Upper Hutt city","Stadium purposes rate","Stadium purposes rate","Business",null,"Rest of Upper Hutt City"]
[null,null,null,null,null,{"$f":"+F55","v":43},2,6,2,"2018/19",{"$f":"ROUND(INDEX('Comparison - Category'!$X$81:$AB$107,MATCH(M56&P56,'Comparison - Category'!$D$81:$D$107,0),MATCH(O56,'Comparison - Category'!$X$66:$AB$66,0)),10)","v":9.4809886000000003E-3},null,"Upper Hutt city","Wellington regional strategy rate - Business","Wellington regional strategy rate","Business",null,"Upper Hutt City"]
[null,null,null,null,null,{"$f":"+F56","v":43},3,1,2,"2018/19",{"$f":"ROUND(INDEX(Gen!$E$10:$E$25,MATCH(R57,Gen!$A$10:$A$25,0),),10)","v":3.7522778899999998E-2},null,"Upper Hutt city","General rate","General rate","Rural",null,"Rest of Upper Hutt City"]
[null,null,null,null,null,{"$f":"+F57","v":43},3,2,2,"2018/19",{"$f":"ROUND(INDEX('River management'!$D$10:$D$25,MATCH(R57,'River management'!$A$10:$A$25,0),),10)","v":8.1664193E-3},null,"Upper Hutt city","River management rate","River management rate","Rural",null,"Rest of Upper Hutt City"]
[null,null,null,null,null,{"$f":"+F58","v":43},3,3,2,"2018/19",{"$f":"ROUND(INDEX('Public transport'!$J$23:$J$60,MATCH(R59&P59,'Public transport'!$D$23:$D$60,0),),10)","v":1.5366243E-2},null,"Upper Hutt city","Public transport rate","Public transport rate","Rural",null,"Rest of Upper Hutt City"]
[null,null,null,null,null,{"$f":"+F59","v":43},3,4,2,"2018/19",{"$f":"ROUND(INDEX(Stadium!$H$23:$H$60,MATCH(R60&P60,Stadium!$D$23:$D$60,0),),10)","v":0},null,"Upper Hutt city","Stadium purposes rate","Stadium purposes rate","Rural",null,"Rest of Upper Hutt City"]
[null,null,null,null,null,{"$f":"+F60","v":43},3,5,2,"2018/19",{"$f":"ROUND(INDEX('Comparison - Category'!$X$81:$AB$107,MATCH(M61&P61,'Comparison - Category'!$D$81:$D$107,0),MATCH(O61,'Comparison - Category'!$X$66:$AB$66,0)),10)","v":28},null,"Upper Hutt city","Wellington regional strategy rate","Wellington regional strategy rate","Rural",null,"Upper Hutt City"]
[]
[null,null,null,null,null,"TA_ID","Rate_Class_ID","Rates_ID","Rates_Status_ID","Rates_year","Rates_value"]
[null,null,null,null,null,44,1,1,{"$f":"$I$8","v":2},{"$f":"year_current","v":"2018/19"},{"$f":"ROUND(INDEX('Comparison - Category'!$X$81:$AB$107,MATCH(M64&P64,'Comparison - Category'!$D$81:$D$107,0),MATCH(O64,'Comparison - Category'!$X$66:$AB$66,0)),10)","v":3.71629323E-2},null,{"$f":"VLOOKUP(F64,$A$30:$B$38,2,FALSE)","v":"Porirua city"},{"$f":"VLOOKUP(H64,$A$19:$B$25,2,FALSE)","v":"General rate"},{"$f":"VLOOKUP(H64,$A$19:$C$25,3,FALSE)","v":"General rate"},{"$f":"VLOOKUP(G64,$A$5:$B$10,2,FALSE)","v":"Residential"}]
[null,null,null,null,null,{"$f":"+F64","v":44},{"$f":"+G64","v":1},2,{"$f":"+I64","v":2},"2018/19",{"$f":"ROUND(INDEX('Comparison - Category'!$X$81:$AB$107,MATCH(M65&P65,'Comparison - Category'!$D$81:$D$107,0),MATCH(O65,'Comparison - Category'!$X$66:$AB$66,0)),10)","v":3.268228E-4},null,"Porirua city","River management rate","River management rate","Residential"]
[null,null,null,null,null,{"$f":"+F65","v":44},1,3,{"$f":"+I65","v":2},"2018/19",{"$f":"ROUND(INDEX('Comparison - Category'!$X$81:$AB$107,MATCH(M66&P66,'Comparison - Category'!$D$81:$D$107,0),MATCH(O66,'Comparison - Category'!$X$66:$AB$66,0)),10)","v":6.1737072300000001E-2},null,"Porirua city","Public transport rate","Public transport rate","Residential"]
[null,null,null,null,null,{"$f":"+F66","v":44},1,4,2,"2018/19",{"$f":"ROUND(INDEX('Comparison - Category'!$X$81:$AB$107,MATCH(M67&P67,'Comparison - Category'!$D$81:$D$107,0),MATCH(O67,'Comparison - Category'!$X$66:$AB$66,0)),10)","v":0},null,"Porirua city","Stadium purposes rate","Stadium purposes rate","Residential"]
[null,null,null,null,null,{"$f":"+F67","v":44},{"$f":"+G67","v":1},5,2,"2018/19",{"$f":"ROUND(INDEX('Comparison - Category'!$X$81:$AB$107,MATCH(M68&P68,'Comparison - Category'!$D$81:$D$107,0),MATCH(O68,'Comparison - Category'!$X$66:$AB$66,0)),10)","v":14},null,"Porirua city","Wellington regional strategy rate","Wellington regional strategy rate","Residential"]
[null,null,null,null,null,{"$f":"+F68","v":44},2,1,2,"2018/19",{"$f":"ROUND(INDEX('Comparison - Category'!$X$81:$AB$107,MATCH(M69&P69,'Comparison - Category'!$D$81:$D$107,0),MATCH(O69,'Comparison - Category'!$X$66:$AB$66,0)),10)","v":3.71629323E-2},null,"Porirua city","General rate","General rate","Business"]
[null,null,null,null,null,{"$f":"+F69","v":44},2,2,2,"2018/19",{"$f":"ROUND(INDEX('Comparison - Category'!$X$81:$AB$107,MATCH(M70&P70,'Comparison - Category'!$D$81:$D$107,0),MATCH(O70,'Comparison - Category'!$X$66:$AB$66,0)),10)","v":3.268228E-4},null,"Porirua city","River management rate","River management rate","Business"]
[null,null,null,null,null,{"$f":"+F70","v":44},2,3,2,"2018/19",{"$f":"ROUND(INDEX('Comparison - Category'!$X$81:$AB$107,MATCH(M71&P71,'Comparison - Category'!$D$81:$D$107,0),MATCH(O71,'Comparison - Category'!$X$66:$AB$66,0)),10)","v":6.4409949999999994E-2},null,"Porirua city","Public transport rate","Public transport rate","Business"]
[null,null,null,null,null,{"$f":"+F71","v":44},2,4,2,"2018/19",{"$f":"ROUND(INDEX('Comparison - Category'!$X$81:$AB$107,MATCH(M72&P72,'Comparison - Category'!$D$81:$D$107,0),MATCH(O72,'Comparison - Category'!$X$66:$AB$66,0)),10)","v":0},null,"Porirua city","Stadium purposes rate","Stadium purposes rate","Business"]
[null,null,null,null,null,{"$f":"+F72","v":44},2,6,2,"2018/19",{"$f":"ROUND(INDEX('Comparison - Category'!$X$81:$AB$107,MATCH(M73&P73,'Comparison - Category'!$D$81:$D$107,0),MATCH(O73,'Comparison - Category'!$X$66:$AB$66,0)),10)","v":9.4107844999999999E-3},null,"Porirua city","Wellington regional strategy rate - Business","Wellington regional strategy rate","Business"]
[null,null,null,null,null,{"$f":"+F73","v":44},3,1,2,"2018/19",{"$f":"ROUND(INDEX('Comparison - Category'!$X$81:$AB$107,MATCH(M74&P74,'Comparison - Category'!$D$81:$D$107,0),MATCH(O74,'Comparison - Category'!$X$66:$AB$66,0)),10)","v":3.71629323E-2},null,"Porirua city","General rate","General rate","Rural"]
[null,null,null,null,null,{"$f":"+F74","v":44},3,2,2,"2018/19",{"$f":"ROUND(INDEX('Comparison - Category'!$X$81:$AB$107,MATCH(M75&P75,'Comparison - Category'!$D$81:$D$107,0),MATCH(O75,'Comparison - Category'!$X$66:$AB$66,0)),10)","v":3.268228E-4},null,"Porirua city","River management rate","River management rate","Rural"]
[null,null,null,null,null,{"$f":"+F75","v":44},3,3,2,"2018/19",{"$f":"ROUND(INDEX('Comparison - Category'!$X$81:$AB$107,MATCH(M76&P76,'Comparison - Category'!$D$81:$D$107,0),MATCH(O76,'Comparison - Category'!$X$66:$AB$66,0)),10)","v":1.5698201799999999E-2},null,"Porirua city","Public transport rate","Public transport rate","Rural"]
[null,null,null,null,null,{"$f":"+F76","v":44},3,4,2,"2018/19",{"$f":"ROUND(INDEX('Comparison - Category'!$X$81:$AB$107,MATCH(M77&P77,'Comparison - Category'!$D$81:$D$107,0),MATCH(O77,'Comparison - Category'!$X$66:$AB$66,0)),10)","v":0},null,"Porirua city","Stadium purposes rate","Stadium purposes rate","Rural"]
[null,null,null,null,null,{"$f":"+F77","v":44},3,5,2,"2018/19",{"$f":"ROUND(INDEX('Comparison - Category'!$X$81:$AB$107,MATCH(M78&P78,'Comparison - Category'!$D$81:$D$107,0),MATCH(O78,'Comparison - Category'!$X$66:$AB$66,0)),10)","v":28},null,"Porirua city","Wellington regional strategy rate","Wellington regional strategy rate","Rural"]
[]
[null,null,null,null,null,"TA_ID","Rate_Class_ID","Rates_ID","Rates_Status_ID","Rates_year","Rates_value"]
[null,null,null,null,null,45,5,1,{"$f":"$I$8","v":2},{"$f":"year_current","v":"2018/19"},{"$f":"ROUND(INDEX('Comparison - Category'!$X$81:$AB$107,MATCH(R81&S81,'Comparison - Category'!$D$81:$D$107,0),MATCH(O81,'Comparison - Category'!$X$66:$AB$66,0)),10)","v":3.3208045999999998E-2},null,{"$f":"VLOOKUP(F81,$A$30:$B$38,2,FALSE)","v":"Kāpiti Coast district"},{"$f":"VLOOKUP(H81,$A$19:$B$25,2,FALSE)","v":"General rate"},{"$f":"VLOOKUP(H81,$A$19:$C$25,3,FALSE)","v":"General rate"},{"$f":"VLOOKUP(G81,$A$5:$B$10,2,FALSE)","v":"Residential - excl Otaki"},null,"Kāpiti Coast district excl Ōtaki ","Residential"]
[null,null,null,null,null,{"$f":"+F81","v":45},{"$f":"+G81","v":5},2,{"$f":"+I81","v":2},"2018/19",{"$f":"ROUND(INDEX('Comparison - Category'!$X$81:$AB$107,MATCH(R82&S82,'Comparison - Category'!$D$81:$D$107,0),MATCH(O82,'Comparison - Category'!$X$66:$AB$66,0)),10)","v":9.0409375000000004E-3},null,"Kāpiti Coast district","River management rate","River management rate","Residential - excl Otaki",null,"Kāpiti Coast district excl Ōtaki ","Residential"]
[null,null,null,null,null,{"$f":"+F82","v":45},5,3,{"$f":"+I82","v":2},"2018/19",{"$f":"ROUND(INDEX('Comparison - Category'!$X$81:$AB$107,MATCH(R83&S83,'Comparison - Category'!$D$81:$D$107,0),MATCH(O83,'Comparison - Category'!$X$66:$AB$66,0)),10)","v":2.6988555099999999E-2},null,"Kāpiti Coast district","Public transport rate","Public transport rate","Residential - excl Otaki",null,"Kāpiti Coast district excl Ōtaki ","Residential"]
[null,null,null,null,null,{"$f":"+F83","v":45},5,4,2,"2018/19",{"$f":"ROUND(INDEX('Comparison - Category'!$X$81:$AB$107,MATCH(R84&S84,'Comparison - Category'!$D$81:$D$107,0),MATCH(O84,'Comparison - Category'!$X$66:$AB$66,0)),10)","v":0},null,"Kāpiti Coast district","Stadium purposes rate","Stadium purposes rate","Residential - excl Otaki",null,"Kāpiti Coast district excl Ōtaki ","Residential"]
[null,null,null,null,null,{"$f":"+F84","v":45},{"$f":"+G84","v":5},5,2,"2018/19",{"$f":"ROUND(INDEX('Comparison - Category'!$X$81:$AB$107,MATCH(R85&S85,'Comparison - Category'!$D$81:$D$107,0),MATCH(O85,'Comparison - Category'!$X$66:$AB$66,0)),10)","v":14},null,"Kāpiti Coast district","Wellington regional strategy rate","Wellington regional strategy rate","Residential - excl Otaki",null,"Kāpiti Coast district excl Ōtaki ","Residential"]
[null,null,null,null,null,45,6,1,{"$f":"$I$8","v":2},"2018/19",{"$f":"ROUND(INDEX('Comparison - Category'!$X$81:$AB$107,MATCH(R86&S86,'Comparison - Category'!$D$81:$D$107,0),MATCH(O86,'Comparison - Category'!$X$66:$AB$66,0)),10)","v":3.3208045999999998E-2},null,"Kāpiti Coast district","General rate","General rate","Residential - Otaki rating area",null,"Ōtaki rating area","Residential"]
[null,null,null,null,null,45,6,2,{"$f":"+I86","v":2},"2018/19",{"$f":"ROUND(INDEX('Comparison - Category'!$X$81:$AB$107,MATCH(R87&S87,'Comparison - Category'!$D$81:$D$107,0),MATCH(O87,'Comparison - Category'!$X$66:$AB$66,0)),10)","v":9.0409375000000004E-3},null,"Kāpiti Coast district","River management rate","River management rate","Residential - Otaki rating area",null,"Ōtaki rating area","Residential"]
[null,null,null,null,null,45,6,3,2,"2018/19",{"$f":"ROUND(INDEX('Comparison - Category'!$X$81:$AB$107,MATCH(R88&S88,'Comparison - Category'!$D$81:$D$107,0),MATCH(O88,'Comparison - Category'!$X$66:$AB$66,0)),10)","v":2.4003018099999999E-2},null,"Kāpiti Coast district","Public transport rate","Public transport rate","Residential - Otaki rating area",null,"Ōtaki rating area","Residential"]
[null,null,null,null,null,45,6,4,2,"2018/19",{"$f":"ROUND(INDEX('Comparison - Category'!$X$81:$AB$107,MATCH(R89&S89,'Comparison - Category'!$D$81:$D$107,0),MATCH(O89,'Comparison - Category'!$X$66:$AB$66,0)),10)","v":0},null,"Kāpiti Coast district","Stadium purposes rate","Stadium purposes rate","Residential - Otaki rating area",null,"Ōtaki rating area","Residential"]
[null,null,null,null,null,45,6,5,2,"2018/19",{"$f":"ROUND(INDEX('Comparison - Category'!$X$81:$AB$107,MATCH(R90&S90,'Comparison - Category'!$D$81:$D$107,0),MATCH(O90,'Comparison - Category'!$X$66:$AB$66,0)),10)","v":14},null,"Kāpiti Coast district","Wellington regional strategy rate","Wellington regional strategy rate","Residential - Otaki rating area",null,"Ōtaki rating area","Residential"]
[null,null,null,null,null,{"$f":"+F85","v":45},2,1,{"$f":"+I85","v":2},"2018/19",{"$f":"ROUND(INDEX('Comparison - Category'!$X$81:$AB$107,MATCH(M91&P91,'Comparison - Category'!$D$81:$D$107,0),MATCH(O91,'Comparison - Category'!$X$66:$AB$66,0)),10)","v":3.3208045999999998E-2},null,"Kāpiti Coast district","General rate","General rate","Business"]
[null,null,null,null,null,{"$f":"+F91","v":45},2,2,2,"2018/19",{"$f":"ROUND(INDEX('Comparison - Category'!$X$81:$AB$107,MATCH(M92&P92,'Comparison - Category'!$D$81:$D$107,0),MATCH(O92,'Comparison - Category'!$X$66:$AB$66,0)),10)","v":9.0409375000000004E-3},null,"Kāpiti Coast district","River management rate","River management rate","Business"]
[null,null,null,null,null,{"$f":"+F92","v":45},2,3,2,"2018/19",{"$f":"ROUND(INDEX('Comparison - Category'!$X$81:$AB$107,MATCH(M93&P93,'Comparison - Category'!$D$81:$D$107,0),MATCH(O93,'Comparison - Category'!$X$66:$AB$66,0)),10)","v":2.9376984700000001E-2},null,"Kāpiti Coast district","Public transport rate","Public transport rate","Business"]
[null,null,null,null,null,{"$f":"+F93","v":45},2,4,2,"2018/19",{"$f":"ROUND(INDEX('Comparison - Category'!$X$81:$AB$107,MATCH(M94&P94,'Comparison - Category'!$D$81:$D$107,0),MATCH(O94,'Comparison - Category'!$X$66:$AB$66,0)),10)","v":0},null,"Kāpiti Coast district","Stadium purposes rate","Stadium purposes rate","Business"]
[null,null,null,null,null,{"$f":"+F94","v":45},2,6,2,"2018/19",{"$f":"ROUND(INDEX('Comparison - Category'!$X$81:$AB$107,MATCH(M95&P95,'Comparison - Category'!$D$81:$D$107,0),MATCH(O95,'Comparison - Category'!$X$66:$AB$66,0)),10)","v":8.4092869999999997E-3},null,"Kāpiti Coast district","Wellington regional strategy rate - Business","Wellington regional strategy rate","Business"]
[null,null,null,null,null,{"$f":"+F95","v":45},3,1,2,"2018/19",{"$f":"ROUND(INDEX('Comparison - Category'!$X$81:$AB$107,MATCH(M96&P96,'Comparison - Category'!$D$81:$D$107,0),MATCH(O96,'Comparison - Category'!$X$66:$AB$66,0)),10)","v":3.3208045999999998E-2},null,"Kāpiti Coast district","General rate","General rate","Rural"]
[null,null,null,null,null,{"$f":"+F96","v":45},3,2,2,"2018/19",{"$f":"ROUND(INDEX('Comparison - Category'!$X$81:$AB$107,MATCH(M97&P97,'Comparison - Category'!$D$81:$D$107,0),MATCH(O97,'Comparison - Category'!$X$66:$AB$66,0)),10)","v":9.0409375000000004E-3},null,"Kāpiti Coast district","River management rate","River management rate","Rural"]
[null,null,null,null,null,{"$f":"+F97","v":45},3,3,2,"2018/19",{"$f":"ROUND(INDEX('Comparison - Category'!$X$81:$AB$107,MATCH(M98&P98,'Comparison - Category'!$D$81:$D$107,0),MATCH(O98,'Comparison - Category'!$X$66:$AB$66,0)),10)","v":6.9301501999999996E-3},null,"Kāpiti Coast district","Public transport rate","Public transport rate","Rural"]
[null,null,null,null,null,{"$f":"+F98","v":45},3,4,2,"2018/19",{"$f":"ROUND(INDEX('Comparison - Category'!$X$81:$AB$107,MATCH(M99&P99,'Comparison - Category'!$D$81:$D$107,0),MATCH(O99,'Comparison - Category'!$X$66:$AB$66,0)),10)","v":0},null,"Kāpiti Coast district","Stadium purposes rate","Stadium purposes rate","Rural"]
[null,null,null,null,null,{"$f":"+F99","v":45},3,5,2,"2018/19",{"$f":"ROUND(INDEX('Comparison - Category'!$X$81:$AB$107,MATCH(M100&P100,'Comparison - Category'!$D$81:$D$107,0),MATCH(O100,'Comparison - Category'!$X$66:$AB$66,0)),10)","v":28},null,"Kāpiti Coast district","Wellington regional strategy rate","Wellington regional strategy rate","Rural"]
[]
[null,null,null,null,null,"TA_ID","Rate_Class_ID","Rates_ID","Rates_Status_ID","Rates_year","Rates_value"]
[null,null,null,null,null,46,1,1,{"$f":"$I$8","v":2},{"$f":"year_current","v":"2018/19"},{"$f":"ROUND(INDEX('Comparison - Category'!$X$81:$AB$107,MATCH(M103&P103,'Comparison - Category'!$D$81:$D$107,0),MATCH(O103,'Comparison - Category'!$X$66:$AB$66,0)),10)","v":3.36735373E-2},null,{"$f":"VLOOKUP(F103,$A$30:$B$38,2,FALSE)","v":"Masterton district"},{"$f":"VLOOKUP(H103,$A$19:$B$25,2,FALSE)","v":"General rate"},{"$f":"VLOOKUP(H103,$A$19:$C$25,3,FALSE)","v":"General rate"},{"$f":"VLOOKUP(G103,$A$5:$B$8,2,FALSE)","v":"Residential"}]
[null,null,null,null,null,{"$f":"+F103","v":46},{"$f":"+G103","v":1},2,{"$f":"+I103","v":2},"2018/19",{"$f":"ROUND(INDEX('Comparison - Category'!$X$81:$AB$107,MATCH(M104&P104,'Comparison - Category'!$D$81:$D$107,0),MATCH(O104,'Comparison - Category'!$X$66:$AB$66,0)),10)","v":0},null,"Masterton district","River management rate","River management rate","Residential"]
[null,null,null,null,null,{"$f":"+F104","v":46},1,3,{"$f":"+I104","v":2},"2018/19",{"$f":"ROUND(INDEX('Comparison - Category'!$X$81:$AB$107,MATCH(M105&P105,'Comparison - Category'!$D$81:$D$107,0),MATCH(O105,'Comparison - Category'!$X$66:$AB$66,0)),10)","v":1.05651983E-2},null,"Masterton district","Public transport rate","Public transport rate","Residential"]
[null,null,null,null,null,{"$f":"+F105","v":46},1,4,2,"2018/19",{"$f":"ROUND(INDEX('Comparison - Category'!$X$81:$AB$107,MATCH(M106&P106,'Comparison - Category'!$D$81:$D$107,0),MATCH(O106,'Comparison - Category'!$X$66:$AB$66,0)),10)","v":0},null,"Masterton district","Stadium purposes rate","Stadium purposes rate","Residential"]
[null,null,null,null,null,{"$f":"+F106","v":46},1,5,2,"2018/19",{"$f":"ROUND(INDEX('Comparison - Category'!$X$81:$AB$107,MATCH(M107&P107,'Comparison - Category'!$D$81:$D$107,0),MATCH(O107,'Comparison - Category'!$X$66:$AB$66,0)),10)","v":14},null,"Masterton district","Wellington regional strategy rate","Wellington regional strategy rate","Residential"]
[null,null,null,null,null,{"$f":"+F107","v":46},2,1,2,"2018/19",{"$f":"ROUND(INDEX('Comparison - Category'!$X$81:$AB$107,MATCH(M108&P108,'Comparison - Category'!$D$81:$D$107,0),MATCH(O108,'Comparison - Category'!$X$66:$AB$66,0)),10)","v":3.36735373E-2},null,"Masterton district","General rate","General rate","Business"]
[null,null,null,null,null,{"$f":"+F108","v":46},2,2,2,"2018/19",{"$f":"ROUND(INDEX('Comparison - Category'!$X$81:$AB$107,MATCH(M109&P109,'Comparison - Category'!$D$81:$D$107,0),MATCH(O109,'Comparison - Category'!$X$66:$AB$66,0)),10)","v":0},null,"Masterton district","River management rate","River management rate","Business"]
[null,null,null,null,null,{"$f":"+F109","v":46},2,3,2,"2018/19",{"$f":"ROUND(INDEX('Comparison - Category'!$X$81:$AB$107,MATCH(M110&P110,'Comparison - Category'!$D$81:$D$107,0),MATCH(O110,'Comparison - Category'!$X$66:$AB$66,0)),10)","v":1.3592584899999999E-2},null,"Masterton district","Public transport rate","Public transport rate","Business"]
[null,null,null,null,null,{"$f":"+F110","v":46},2,4,2,"2018/19",{"$f":"ROUND(INDEX('Comparison - Category'!$X$81:$AB$107,MATCH(M111&P111,'Comparison - Category'!$D$81:$D$107,0),MATCH(O111,'Comparison - Category'!$X$66:$AB$66,0)),10)","v":0},null,"Masterton district","Stadium purposes rate","Stadium purposes rate","Business"]
[null,null,null,null,null,{"$f":"+F111","v":46},2,6,2,"2018/19",{"$f":"ROUND(INDEX('Comparison - Category'!$X$81:$AB$107,MATCH(M112&P112,'Comparison - Category'!$D$81:$D$107,0),MATCH(O112,'Comparison - Category'!$X$66:$AB$66,0)),10)","v":8.5271636000000001E-3},null,"Masterton district","Wellington regional strategy rate - Business","Wellington regional strategy rate","Business"]
[null,null,null,null,null,{"$f":"+F112","v":46},3,1,2,"2018/19",{"$f":"ROUND(INDEX('Comparison - Category'!$X$81:$AB$107,MATCH(M113&P113,'Comparison - Category'!$D$81:$D$107,0),MATCH(O113,'Comparison - Category'!$X$66:$AB$66,0)),10)","v":3.36735373E-2},null,"Masterton district","General rate","General rate","Rural"]
[null,null,null,null,null,{"$f":"+F113","v":46},3,2,2,"2018/19",{"$f":"ROUND(INDEX('Comparison - Category'!$X$81:$AB$107,MATCH(M114&P114,'Comparison - Category'!$D$81:$D$107,0),MATCH(O114,'Comparison - Category'!$X$66:$AB$66,0)),10)","v":0},null,"Masterton district","River management rate","River management rate","Rural"]
[null,null,null,null,null,{"$f":"+F114","v":46},3,3,2,"2018/19",{"$f":"ROUND(INDEX('Comparison - Category'!$X$81:$AB$107,MATCH(M115&P115,'Comparison - Category'!$D$81:$D$107,0),MATCH(O115,'Comparison - Category'!$X$66:$AB$66,0)),10)","v":3.6791526E-3},null,"Masterton district","Public transport rate","Public transport rate","Rural"]
[null,null,null,null,null,{"$f":"+F115","v":46},3,4,2,"2018/19",{"$f":"ROUND(INDEX('Comparison - Category'!$X$81:$AB$107,MATCH(M116&P116,'Comparison - Category'!$D$81:$D$107,0),MATCH(O116,'Comparison - Category'!$X$66:$AB$66,0)),10)","v":0},null,"Masterton district","Stadium purposes rate","Stadium purposes rate","Rural"]
[null,null,null,null,null,{"$f":"+F116","v":46},3,5,2,"2018/19",{"$f":"ROUND(INDEX('Comparison - Category'!$X$81:$AB$107,MATCH(M117&P117,'Comparison - Category'!$D$81:$D$107,0),MATCH(O117,'Comparison - Category'!$X$66:$AB$66,0)),10)","v":28},null,"Masterton district","Wellington regional strategy rate","Wellington regional strategy rate","Rural"]
[]
[null,null,null,null,null,"TA_ID","Rate_Class_ID","Rates_ID","Rates_Status_ID","Rates_year","Rates_value"]
[null,null,null,null,null,47,1,1,{"$f":"$I$8","v":2},{"$f":"year_current","v":"2018/19"},{"$f":"ROUND(INDEX('Comparison - Category'!$X$81:$AB$107,MATCH(M120&P120,'Comparison - Category'!$D$81:$D$107,0),MATCH(O120,'Comparison - Category'!$X$66:$AB$66,0)),10)","v":3.3798637100000001E-2},null,{"$f":"VLOOKUP(F120,$A$30:$B$38,2,FALSE)","v":"Carterton district"},{"$f":"VLOOKUP(H120,$A$19:$B$25,2,FALSE)","v":"General rate"},{"$f":"VLOOKUP(H120,$A$19:$C$25,3,FALSE)","v":"General rate"},{"$f":"VLOOKUP(G120,$A$5:$B$8,2,FALSE)","v":"Residential"}]
[null,null,null,null,null,{"$f":"+F120","v":47},{"$f":"+G120","v":1},2,{"$f":"+I120","v":2},"2018/19",{"$f":"ROUND(INDEX('Comparison - Category'!$X$81:$AB$107,MATCH(M121&P121,'Comparison - Category'!$D$81:$D$107,0),MATCH(O121,'Comparison - Category'!$X$66:$AB$66,0)),10)","v":8.8292259999999995E-4},null,"Carterton district","River management rate","River management rate","Residential"]
[null,null,null,null,null,{"$f":"+F121","v":47},1,3,{"$f":"+I121","v":2},"2018/19",{"$f":"ROUND(INDEX('Comparison - Category'!$X$81:$AB$107,MATCH(M122&P122,'Comparison - Category'!$D$81:$D$107,0),MATCH(O122,'Comparison - Category'!$X$66:$AB$66,0)),10)","v":1.6612274100000001E-2},null,"Carterton district","Public transport rate","Public transport rate","Residential"]
[null,null,null,null,null,{"$f":"+F122","v":47},1,4,2,"2018/19",{"$f":"ROUND(INDEX('Comparison - Category'!$X$81:$AB$107,MATCH(M123&P123,'Comparison - Category'!$D$81:$D$107,0),MATCH(O123,'Comparison - Category'!$X$66:$AB$66,0)),10)","v":0},null,"Carterton district","Stadium purposes rate","Stadium purposes rate","Residential"]
[null,null,null,null,null,{"$f":"+F123","v":47},1,5,2,"2018/19",{"$f":"ROUND(INDEX('Comparison - Category'!$X$81:$AB$107,MATCH(M124&P124,'Comparison - Category'!$D$81:$D$107,0),MATCH(O124,'Comparison - Category'!$X$66:$AB$66,0)),10)","v":14},null,"Carterton district","Wellington regional strategy rate","Wellington regional strategy rate","Residential"]
[null,null,null,null,null,{"$f":"+F124","v":47},2,1,2,"2018/19",{"$f":"ROUND(INDEX('Comparison - Category'!$X$81:$AB$107,MATCH(M125&P125,'Comparison - Category'!$D$81:$D$107,0),MATCH(O125,'Comparison - Category'!$X$66:$AB$66,0)),10)","v":3.3798637100000001E-2},null,"Carterton district","General rate","General rate","Business"]
[null,null,null,null,null,{"$f":"+F125","v":47},2,2,2,"2018/19",{"$f":"ROUND(INDEX('Comparison - Category'!$X$81:$AB$107,MATCH(M126&P126,'Comparison - Category'!$D$81:$D$107,0),MATCH(O126,'Comparison - Category'!$X$66:$AB$66,0)),10)","v":8.8292259999999995E-4},null,"Carterton district","River management rate","River management rate","Business"]
[null,null,null,null,null,{"$f":"+F126","v":47},2,3,2,"2018/19",{"$f":"ROUND(INDEX('Comparison - Category'!$X$81:$AB$107,MATCH(M127&P127,'Comparison - Category'!$D$81:$D$107,0),MATCH(O127,'Comparison - Category'!$X$66:$AB$66,0)),10)","v":1.96509076E-2},null,"Carterton district","Public transport rate","Public transport rate","Business"]
[null,null,null,null,null,{"$f":"+F127","v":47},2,4,2,"2018/19",{"$f":"ROUND(INDEX('Comparison - Category'!$X$81:$AB$107,MATCH(M128&P128,'Comparison - Category'!$D$81:$D$107,0),MATCH(O128,'Comparison - Category'!$X$66:$AB$66,0)),10)","v":0},null,"Carterton district","Stadium purposes rate","Stadium purposes rate","Business"]
[null,null,null,null,null,{"$f":"+F128","v":47},2,6,2,"2018/19",{"$f":"ROUND(INDEX('Comparison - Category'!$X$81:$AB$107,MATCH(M129&P129,'Comparison - Category'!$D$81:$D$107,0),MATCH(O129,'Comparison - Category'!$X$66:$AB$66,0)),10)","v":8.5588426999999995E-3},null,"Carterton district","Wellington regional strategy rate - Business","Wellington regional strategy rate","Business"]
[null,null,null,null,null,{"$f":"+F129","v":47},3,1,2,"2018/19",{"$f":"ROUND(INDEX('Comparison - Category'!$X$81:$AB$107,MATCH(M130&P130,'Comparison - Category'!$D$81:$D$107,0),MATCH(O130,'Comparison - Category'!$X$66:$AB$66,0)),10)","v":3.3798637100000001E-2},null,"Carterton district","General rate","General rate","Rural"]
[null,null,null,null,null,{"$f":"+F130","v":47},3,2,2,"2018/19",{"$f":"ROUND(INDEX('Comparison - Category'!$X$81:$AB$107,MATCH(M131&P131,'Comparison - Category'!$D$81:$D$107,0),MATCH(O131,'Comparison - Category'!$X$66:$AB$66,0)),10)","v":8.8292259999999995E-4},null,"Carterton district","River management rate","River management rate","Rural"]
[null,null,null,null,null,{"$f":"+F131","v":47},3,3,2,"2018/19",{"$f":"ROUND(INDEX('Comparison - Category'!$X$81:$AB$107,MATCH(M132&P132,'Comparison - Category'!$D$81:$D$107,0),MATCH(O132,'Comparison - Category'!$X$66:$AB$66,0)),10)","v":5.1570714999999998E-3},null,"Carterton district","Public transport rate","Public transport rate","Rural"]
[null,null,null,null,null,{"$f":"+F132","v":47},3,4,2,"2018/19",{"$f":"ROUND(INDEX('Comparison - Category'!$X$81:$AB$107,MATCH(M133&P133,'Comparison - Category'!$D$81:$D$107,0),MATCH(O133,'Comparison - Category'!$X$66:$AB$66,0)),10)","v":0},null,"Carterton district","Stadium purposes rate","Stadium purposes rate","Rural"]
[null,null,null,null,null,{"$f":"+F133","v":47},3,5,2,"2018/19",{"$f":"ROUND(INDEX('Comparison - Category'!$X$81:$AB$107,MATCH(M134&P134,'Comparison - Category'!$D$81:$D$107,0),MATCH(O134,'Comparison - Category'!$X$66:$AB$66,0)),10)","v":28},null,"Carterton district","Wellington regional strategy rate","Wellington regional strategy rate","Rural"]
[]
[null,null,null,null,null,"TA_ID","Rate_Class_ID","Rates_ID","Rates_Status_ID","Rates_year","Rates_value"]
[null,null,null,null,null,48,1,1,{"$f":"$I$8","v":2},{"$f":"year_current","v":"2018/19"},{"$f":"ROUND(INDEX('Comparison - Category'!$X$81:$AB$107,MATCH(M137&P137,'Comparison - Category'!$D$81:$D$107,0),MATCH(O137,'Comparison - Category'!$X$66:$AB$66,0)),10)","v":3.3462980199999999E-2},null,{"$f":"VLOOKUP(F137,$A$30:$B$38,2,FALSE)","v":"South Wairarapa district"},{"$f":"VLOOKUP(H137,$A$19:$B$25,2,FALSE)","v":"General rate"},{"$f":"VLOOKUP(H137,$A$19:$C$25,3,FALSE)","v":"General rate"},{"$f":"VLOOKUP(G137,$A$5:$B$8,2,FALSE)","v":"Residential"}]
[null,null,null,null,null,{"$f":"+F137","v":48},{"$f":"+G137","v":1},2,{"$f":"+I137","v":2},"2018/19",{"$f":"ROUND(INDEX('Comparison - Category'!$X$81:$AB$107,MATCH(M138&P138,'Comparison - Category'!$D$81:$D$107,0),MATCH(O138,'Comparison - Category'!$X$66:$AB$66,0)),10)","v":0},null,"South Wairarapa district","River management rate","River management rate","Residential"]
[null,null,null,null,null,{"$f":"+F138","v":48},1,3,{"$f":"+I138","v":2},"2018/19",{"$f":"ROUND(INDEX('Comparison - Category'!$X$81:$AB$107,MATCH(M139&P139,'Comparison - Category'!$D$81:$D$107,0),MATCH(O139,'Comparison - Category'!$X$66:$AB$66,0)),10)","v":2.0765863700000001E-2},null,"South Wairarapa district","Public transport rate","Public transport rate","Residential"]
[null,null,null,null,null,{"$f":"+F139","v":48},{"$f":"+G139","v":1},4,2,"2018/19",{"$f":"ROUND(INDEX('Comparison - Category'!$X$81:$AB$107,MATCH(M140&P140,'Comparison - Category'!$D$81:$D$107,0),MATCH(O140,'Comparison - Category'!$X$66:$AB$66,0)),10)","v":0},null,"South Wairarapa district","Stadium purposes rate","Stadium purposes rate","Residential"]
[null,null,null,null,null,{"$f":"+F140","v":48},{"$f":"+G140","v":1},5,2,"2018/19",{"$f":"ROUND(INDEX('Comparison - Category'!$X$81:$AB$107,MATCH(M141&P141,'Comparison - Category'!$D$81:$D$107,0),MATCH(O141,'Comparison - Category'!$X$66:$AB$66,0)),10)","v":14},null,"South Wairarapa district","Wellington regional strategy rate","Wellington regional strategy rate","Residential"]
[null,null,null,null,null,{"$f":"+F141","v":48},2,1,2,"2018/19",{"$f":"ROUND(INDEX('Comparison - Category'!$X$81:$AB$107,MATCH(M142&P142,'Comparison - Category'!$D$81:$D$107,0),MATCH(O142,'Comparison - Category'!$X$66:$AB$66,0)),10)","v":3.3462980199999999E-2},null,"South Wairarapa district","General rate","General rate","Business"]
[null,null,null,null,null,{"$f":"+F142","v":48},2,2,2,"2018/19",{"$f":"ROUND(INDEX('Comparison - Category'!$X$81:$AB$107,MATCH(M143&P143,'Comparison - Category'!$D$81:$D$107,0),MATCH(O143,'Comparison - Category'!$X$66:$AB$66,0)),10)","v":0},null,"South Wairarapa district","River management rate","River management rate","Business"]
[null,null,null,null,null,{"$f":"+F143","v":48},2,3,2,"2018/19",{"$f":"ROUND(INDEX('Comparison - Category'!$X$81:$AB$107,MATCH(M144&P144,'Comparison - Category'!$D$81:$D$107,0),MATCH(O144,'Comparison - Category'!$X$66:$AB$66,0)),10)","v":2.3774320299999999E-2},null,"South Wairarapa district","Public transport rate","Public transport rate","Business"]
[null,null,null,null,null,{"$f":"+F144","v":48},2,4,2,"2018/19",{"$f":"ROUND(INDEX('Comparison - Category'!$X$81:$AB$107,MATCH(M145&P145,'Comparison - Category'!$D$81:$D$107,0),MATCH(O145,'Comparison - Category'!$X$66:$AB$66,0)),10)","v":0},null,"South Wairarapa district","Stadium purposes rate","Stadium purposes rate","Business"]
[null,null,null,null,null,{"$f":"+F145","v":48},2,6,2,"2018/19",{"$f":"ROUND(INDEX('Comparison - Category'!$X$81:$AB$107,MATCH(M146&P146,'Comparison - Category'!$D$81:$D$107,0),MATCH(O146,'Comparison - Category'!$X$66:$AB$66,0)),10)","v":8.4738442000000004E-3},null,"South Wairarapa district","Wellington regional strategy rate - Business","Wellington regional strategy rate","Business"]
[null,null,null,null,null,{"$f":"+F146","v":48},3,1,2,"2018/19",{"$f":"ROUND(INDEX('Comparison - Category'!$X$81:$AB$107,MATCH(M147&P147,'Comparison - Category'!$D$81:$D$107,0),MATCH(O147,'Comparison - Category'!$X$66:$AB$66,0)),10)","v":3.3462980199999999E-2},null,"South Wairarapa district","General rate","General rate","Rural"]
[null,null,null,null,null,{"$f":"+F147","v":48},3,2,2,"2018/19",{"$f":"ROUND(INDEX('Comparison - Category'!$X$81:$AB$107,MATCH(M148&P148,'Comparison - Category'!$D$81:$D$107,0),MATCH(O148,'Comparison - Category'!$X$66:$AB$66,0)),10)","v":0},null,"South Wairarapa district","River management rate","River management rate","Rural"]
[null,null,null,null,null,{"$f":"+F148","v":48},3,3,2,"2018/19",{"$f":"ROUND(INDEX('Comparison - Category'!$X$81:$AB$107,MATCH(M149&P149,'Comparison - Category'!$D$81:$D$107,0),MATCH(O149,'Comparison - Category'!$X$66:$AB$66,0)),10)","v":6.1204870999999996E-3},null,"South Wairarapa district","Public transport rate","Public transport rate","Rural"]
[null,null,null,null,null,{"$f":"+F149","v":48},3,4,2,"2018/19",{"$f":"ROUND(INDEX('Comparison - Category'!$X$81:$AB$107,MATCH(M150&P150,'Comparison - Category'!$D$81:$D$107,0),MATCH(O150,'Comparison - Category'!$X$66:$AB$66,0)),10)","v":0},null,"South Wairarapa district","Stadium purposes rate","Stadium purposes rate","Rural"]
[null,null,null,null,null,{"$f":"+F150","v":48},3,5,2,"2018/19",{"$f":"ROUND(INDEX('Comparison - Category'!$X$81:$AB$107,MATCH(M151&P151,'Comparison - Category'!$D$81:$D$107,0),MATCH(O151,'Comparison - Category'!$X$66:$AB$66,0)),10)","v":28},null,"South Wairarapa district","Wellington regional strategy rate","Wellington regional strategy rate","Rural"]
[]
[null,null,null,null,null,"TA_ID","Rate_Class_ID","Rates_ID","Rates_Status_ID","Rates_year","Rates_value"]
[null,null,null,null,null,49,3,1,{"$f":"$I$8","v":2},{"$f":"year_current","v":"2018/19"},{"$f":"ROUND(INDEX('Comparison - Category'!$X$81:$AB$107,MATCH(M154&P154,'Comparison - Category'!$D$81:$D$107,0),MATCH(O154,'Comparison - Category'!$X$66:$AB$66,0)),10)","v":2.18672426E-2},null,{"$f":"VLOOKUP(F154,$A$30:$B$38,2,FALSE)","v":"Tararua district"},{"$f":"VLOOKUP(H154,$A$19:$B$25,2,FALSE)","v":"General rate"},{"$f":"VLOOKUP(H154,$A$19:$C$25,3,FALSE)","v":"General rate"},{"$f":"VLOOKUP(G154,$A$5:$B$8,2,FALSE)","v":"Rural"}]
[null,null,null,null,null,{"$f":"+F154","v":49},{"$f":"+G154","v":3},2,{"$f":"+I154","v":2},"2018/19",{"$f":"ROUND(INDEX('Comparison - Category'!$X$81:$AB$107,MATCH(M155&P155,'Comparison - Category'!$D$81:$D$107,0),MATCH(O155,'Comparison - Category'!$X$66:$AB$66,0)),10)","v":0},null,{"$f":"VLOOKUP(F155,$A$30:$B$38,2,FALSE)","v":"Tararua district"},{"$f":"VLOOKUP(H155,$A$19:$B$25,2,FALSE)","v":"River management rate"},{"$f":"VLOOKUP(H155,$A$19:$C$25,3,FALSE)","v":"River management rate"},"Rural"]
[null,null,null,null,null,{"$f":"+F155","v":49},3,3,{"$f":"+I155","v":2},"2018/19",{"$f":"ROUND(INDEX('Comparison - Category'!$X$81:$AB$107,MATCH(M156&P156,'Comparison - Category'!$D$81:$D$107,0),MATCH(O156,'Comparison - Category'!$X$66:$AB$66,0)),10)","v":0},null,{"$f":"VLOOKUP(F156,$A$30:$B$38,2,FALSE)","v":"Tararua district"},{"$f":"VLOOKUP(H156,$A$19:$B$25,2,FALSE)","v":"Public transport rate"},{"$f":"VLOOKUP(H156,$A$19:$C$25,3,FALSE)","v":"Public transport rate"},"Rural"]
[null,null,null,null,null,{"$f":"+F156","v":49},3,4,2,"2018/19",{"$f":"ROUND(INDEX('Comparison - Category'!$X$81:$AB$107,MATCH(M157&P157,'Comparison - Category'!$D$81:$D$107,0),MATCH(O157,'Comparison - Category'!$X$66:$AB$66,0)),10)","v":0},null,{"$f":"VLOOKUP(F157,$A$30:$B$38,2,FALSE)","v":"Tararua district"},{"$f":"VLOOKUP(H157,$A$19:$B$25,2,FALSE)","v":"Stadium purposes rate"},{"$f":"VLOOKUP(H157,$A$19:$C$25,3,FALSE)","v":"Stadium purposes rate"},"Rural"]
[null,null,null,null,null,{"$f":"+F157","v":49},3,5,2,"2018/19",{"$f":"ROUND(INDEX('Comparison - Category'!$X$81:$AB$107,MATCH(M158&P158,'Comparison - Category'!$D$81:$D$107,0),MATCH(O158,'Comparison - Category'!$X$66:$AB$66,0)),10)","v":28},null,{"$f":"VLOOKUP(F158,$A$30:$B$38,2,FALSE)","v":"Tararua district"},{"$f":"VLOOKUP(H158,$A$19:$B$25,2,FALSE)","v":"Wellington regional strategy rate"},{"$f":"VLOOKUP(H158,$A$19:$C$25,3,FALSE)","v":"Wellington regional strategy rate"},"Rural"]